{"text_format":"1","workbook":"xlsx","n_sheets":7,"sheets":["Introducción","Visor","Tabla Dinámica","Tabla Ranking procesos","Tabla Ranking Objetivos SG","Ranking","Indicadores Gestión"],"not_rendered":{"charts":3,"images":1,"macros":1,"external_links":0,"defined_names":13,"comments":0,"pivot_tables":3},"unopened":[],"bounds":{"document_bytes":16777216,"sheet_cells":100000,"rows_first":2000,"rows_last":500,"rows_between":2000,"halvings":0,"cell_chars":16384,"cell_head_chars":4096},"cells_cut":0,"cells_raw":0,"read":"whole","date_system":"1900"}

{"sheet":"Introducción","index":0,"n_rows":12,"n_cols":3,"rows_kept":12,"cut":false,"hidden":false,"merged":[[11,2,11,14],[0,2,0,14],[2,2,6,14],[8,2,8,14],[9,2,9,14],[10,2,10,14]]}
[null,null,"VISOR - INDICADORES DE GESTIÓN"]
[]
[null,null,"El Instituto Distrital de Recreación y Deporte - IDRD, pone a disposición de sus usuarios una herramienta para facilitar el acceso y consulta de los indicadores de gestión de los procesos. Se trata de un conjunto de tableros conectados - VISOR, con el cual se puede ver gráficamente la información relevante asociada a cada indicador, incluyendo su comportamiento o tendencia. Para su manejo, siga las siguientes instrucciones generales:"]
[]
[]
[]
[]
[]
[null,null,"* Haga clic en la imagen inferior"]
[null,null,"* Haga clic en el proceso y/o indicador que necesita consultar"]
[null,null,"* Observe la gráfica con los resultados obtenidos en la consulta"]
[null,null,"* Si requiere de una información más detallada puede aplicar los filtros de color azul"]

{"sheet":"Visor","index":1,"n_rows":1,"n_cols":5,"rows_kept":1,"cut":false,"hidden":false,"merged":[[0,4,0,21]]}
[null,null,null,null,"VISOR - INDICADORES DE GESTIÓN"]

{"sheet":"Tabla Dinámica","index":2,"n_rows":120,"n_cols":13,"rows_kept":120,"cut":false,"hidden":true,"merged":[]}
["Promedio de % Cumplimiento","Etiquetas de columna"]
["Etiquetas de fila","Enero","Febrero","Marzo","Abril","Mayo","Junio","Julio","Agosto","Septiembre","Octubre","Noviembre","Total general"]
["Administración y Mantenimiento de Parques y Escenarios"]
["Aprovechamiento económico de parques y/o escenarios",0.10829999813554853,0.21264549923001783,0.2980634155743937,0.3750843142608718,0.47657770360093626,0.54759493244811053,0.62636260895643481,0.71774667929170988,0.81905403175836777,0.91513465989433773,1.0123132276662643,0.55535246098336299]
["Porcentaje de avance en la ejecución de contratos de obras de mantenimiento o recuperación",null,null,null,0.8851851851851853,null,1.001851851851852,null,1.037037037037037,null,1.0833333333333333,null,1.0018518518518518]
["Porcentaje de cumplimiento en acuerdos de sostenibilidad social de parques",null,null,null,null,null,1,null,null,0.96341463414634143,null,null,0.98170731707317072]
["Satisfacción de los usuarios con las obras de mantenimiento de nuevas tendencias"]
["Total Administración y Mantenimiento de Parques y Escenarios",0.10829999813554853,0.21264549923001783,0.2980634155743937,0.63013474972302852,0.47657770360093626,0.84981559476665414,0.62636260895643481,0.87739185816437337,0.89123433295235466,0.9992339966138355,1.0123132276662643,0.71057053602180831]
["Adquisición de Bienes y Servicios"]
["Porcentaje de contratos legalizados dentro del tiempo establecido",null,null,null,null,0.41666666666666663,1.25,0.46875,0.41666666666666663,0.41666666666666663,0.41666666666666663,0,0.48363095238095227]
["Porcentaje de procesos de obra tramitados en análisis de costos dentro del tiempo establecido",null,null,1,null,null,1,null,null,1,null,null,1]
["Porcentaje de procesos de selección publicados dentro del tiempo establecido",null,null,null,null,null,0.98765432098765427,null,null,1.1111111111111112,null,null,1.0493827160493827]
["Porcentaje de procesos diferentes a obra tramitados en análisis de costos dentro del tiempo establecido",null,null,1.095679012345679,null,null,1.1111111111111112,null,null,1.0683760683760684,null,null,1.0917220639442862]
["Porcentaje de procesos requeridos por precios artificialmente bajos",null,null,0.88888888888888895,null,null,1.4326241134751772,null,null,1.1111111111111112,null,null,1.1442080378250592]
["Total Adquisición de Bienes y Servicios",null,null,0.99485596707818924,null,0.41666666666666663,1.1562779091147886,0.46875,0.41666666666666663,0.94145299145299144,0.41666666666666663,0,0.84399846689297042]
["Control Disciplinario"]
["Porcentaje de procesos disciplinarios resueltos de fondo",null,null,null,null,null,0.98245614035087714,null,null,null,null,null,0.98245614035087714]
["Porcentaje de procesos disciplinarios sin nulidades decretadas",null,null,null,null,null,1,null,null,0.98989898989898994,null,null,0.99494949494949503]
["Porcentaje de procesos disciplinarios sin vencimiento de términos",null,null,null,null,null,0.97894736842105268,null,null,0.97979797979797978,null,null,0.97937267410951623]
["Porcentaje de procesos disciplinarios sin vencimiento de términos ",null,null,0.98058252427184467,null,null,null,null,null,null,null,null,0.98058252427184467]
["Total Control Disciplinario",null,null,0.98058252427184467,null,null,0.98713450292397653,null,null,0.98484848484848486,null,null,0.98528050045679072]
["Control, Evaluación y Seguimiento"]
["Índice de eficacia de auditorías internas de control interno",null,null,0.77647058823529413,0.76078431372549016,null,1.0188235294117647,null,null,1.0823529411764705,null,null,0.90960784313725473]
["Porcentaje de acciones de mejoramiento externo con seguimiento efectuado",null,null,1,null,null,1,null,null,1,null,null,1]
["Porcentaje de acciones de mejoramiento interno con seguimiento efectuado",null,null,0.7857142857142857,null,null,0.9563106796116505,null,null,0.57213930348258701,null,null,0.77138808960284111]
["Porcentaje de informes presentados por la tercera línea de defensa dentro de los tiempos programados",null,null,1,null,null,1,null,null,1,null,null,1]
["Total Control, Evaluación y Seguimiento",null,null,0.8905462184873949,0.76078431372549016,null,0.9937835522558538,null,null,0.91362306116476433,null,null,0.91943043395058011]
["Diseño y Construcción de Parques y Escenarios"]
["Porcentaje de avance en la ejecución de obras de construcción y adecuación de parques y escenarios",null,null,null,1.0831910222005368,1.0524298819189959,1.030683968640173,1.0250319751507402,0.98859356447080704,1.0045354993360578,1.0312213039485767,1.0530870502780616,1.0335967832429935]
["Porcentaje de avance en la ejecución de proyectos de estudios y/o diseños de parques y escenarios",null,null,null,1.0988816477592729,1.0165484633569739,1.0430839002267573,1.0217190439613042,1.0475555555555556,1.0538888888888887,1.0598888888888889,1.0310000000000001,1.046570798579705]
["Porcentaje de fallas de calidad o estabilidad de obra atendidas en construcción y adecuación de parques y escenarios",null,null,null,null,null,1.0185185185185184,null,null,1.0317460317460319,null,null,1.0251322751322751]
["Satisfacción de los usuarios con las obras de construcción y/o adecuación entregadas"]
["Total Diseño y Construcción de Parques y Escenarios",null,null,null,1.0910363349799048,1.034489172637985,1.030762129128483,1.0233755095560222,1.0180745600131813,1.0300568066569928,1.0455550964187328,1.042043525139031,1.0384225113803411]
["Fomento al Deporte"]
["Cambio comportamental frente a la actividad física y el deporte"]
["Satisfacción de los usuarios con las actividades realizadas en los programas deportivos"]
["Total Fomento al Deporte"]
["Gestión de Asuntos Locales"]
["Porcentaje de actividades recreativas programadas por asuntos locales",null,null,null,0.90397223293482454,1.1352506801399145,0.84220753983676644,1.2261904761904763,1.0436573311367381,1.1355086372360845,1.4113712374581939,1.3875464684014871,1.1357130754168108]
["Porcentaje de asistencias técnicas realizadas a los Fondos de Desarrollo Local",null,null,null,null,null,1,null,null,1,null,null,1]
["Porcentaje de beneficiarios inscritos por asuntos locales en actividades deportivas",null,null,null,null,null,0.85832807885042972,null,null,0.94705882352941173,null,null,0.90269345118992073]
["Porcentaje de compromisos atendidos en el marco de las instancias de participación locales",null,null,null,null,null,1,null,null,1,null,null,1]
["Porcentaje de conceptos previos tramitados dentro de los términos legales vigentes",null,null,1.375,null,null,1.1351351351351351,null,null,1.1000000000000001,null,null,1.2033783783783785]
["Porcentaje de proyectos viabilizados con seguimiento efectuado",null,null,null,null,null,1,null,null,1,null,null,1]
["Total Gestión de Asuntos Locales",null,null,1.375,0.90397223293482454,1.1352506801399145,0.97261179230372186,1.2261904761904763,1.0436573311367381,1.0304279101275826,1.4113712374581939,1.3875464684014871,1.0790119284657613]
["Gestión de Comunicaciones"]
["Impacto de noticias publicadas en medios de comunicación",null,null,null,null,null,0.78181818181818186,null,null,0.78181818181818186,null,null,0.78181818181818186]
["Porcentaje de solicitudes de servicios de comunicaciones atendidas dentro de los tiempos establecidos",null,null,1.0924369747899159,null,null,1.0126582278481011,null,null,1.0126582278481011,null,null,1.0392511434953728]
["Salidas publicadas en medios de comunicación",null,null,null,1.0625,1.2625,1.7875000000000001,2.3250000000000002,3.55,3.55,1.675,1.9750000000000001,2.1484375000000004]
["Tasa de variación en el alcance total de las publicaciones en redes sociales",null,null,null,null,null,1.6099948183021089,null,null,1.6099948183021089,null,null,1.6099948183021089]
["Total Gestión de Comunicaciones",null,null,1.0924369747899159,1.0625,1.2625,1.2979928069920981,2.3250000000000002,3.55,1.7386178069920981,1.675,1.9750000000000001,1.6725919620484468]
["Gestión de Recursos Físicos"]
["Índice de implementación del PIGA"]
["Porcentaje de inventario aleatorio validado físicamente en bodega",null,null,null,null,null,null,null,null,1,null,null,1]
["Porcentaje de inventario individual validado físicamente"]
["Porcentaje de mantenimientos realizados a la infraestructura física de la sede administrativa",null,null,null,null,null,1.1111111111111112,null,null,1.1111111111111112,null,null,1.1111111111111112]
["Porcentaje de requerimientos de mantenimiento correctivo atendidos en la sede administrativa dentro de los tiempos establecidos",null,null,1.0526315789473684,null,null,1.0526315789473684,null,null,1.0526315789473684,null,null,1.0526315789473684]
["Total Gestión de Recursos Físicos",null,null,1.0526315789473684,null,null,1.0818713450292399,null,null,1.0545808966861598,null,null,1.0633528265107213]
["Gestión de Talento Humano"]
[" Prevalencia de la enfermedad laboral",null,null,null,null,null,1.1935483870967742,null,null,1.1935483870967742,null,null,1.1935483870967742]
["Impacto de la capacitación en el desempeño laboral de funcionarios",null,null,null,null,null,0.81871345029239773,null,null,1.0399492707672797,null,null,0.92933136052983878]
["Incidencia de la enfermedad laboral",null,null,null,null,null,2,null,null,2,null,null,2]
["Índice de clima organizacional"]
["Índice de desempeño laboral de funcionarios"]
["Porcentaje de ejecución del plan anual de bienestar e incentivos",null,null,null,null,null,0.43478260869565216,null,null,null,null,null,0.43478260869565216]
["Porcentaje de ejecución del plan anual de seguridad y salud en el trabajo",null,null,null,0.93301435406698563,0.91228070175438603,0.95546558704453444,0.95305832147937408,0.97165991902834015,0.97045587947564083,0.97744360902255645,0.96656736180072833,0.95499321670906834]
["Porcentaje de ejecución del plan institucional de capacitación",null,null,null,null,null,0.68965517241379315,null,null,null,null,null,0.68965517241379315]
["Porcentaje de funcionarios que asisten a las actividades del plan institucional de capacitación",null,null,null,null,null,1.0491967871485943,null,null,null,null,null,1.0491967871485943]
["Porcentaje de funcionarios que participan en las actividades del plan de bienestar e incentivos",null,null,null,null,null,0.73084677419354838,null,null,null,null,null,0.73084677419354838]
["Tasa de accidentalidad",null,null,null,1.7433628318584071,1.6737357259380099,1.585808065020319,1.4685839324788996,1.3973074514715091,1.3241119144922981,1.2612386042125119,1.1423948220064724,1.4495679184348034]
["Total Gestión de Talento Humano",null,null,null,1.3381885929626964,1.293008213846198,1.0508907591006238,1.2108211269791369,1.1844836852499245,1.3056130903663985,1.1193411066175343,1.0544810919036003,1.1687203814944533]
["Gestión de Tecnología de la Información y las Comunicaciones"]
["Índice de implementación de gobierno digital"]
["Porcentaje de avance en proyectos de TI",null,null,null,null,null,1,null,null,null,null,null,1]
["Porcentaje de disponibilidad de los servicios de comunicaciones",null,null,null,1.1110956790123456,1.1101851851851852,1.075268817204301,1.110558542413381,1.1110961768219834,1.1110802469135803,1.1110812425328553,1.11054012345679,1.1063632516925528]
["Porcentaje de disponibilidad de los sistemas de información",null,null,null,1.107445987654321,1.1110737753882916,1.1108333333333333,1.110558542413381,1.1111111111111112,1.1107253086419753,1.1106750298685781,1.11054012345679,1.1103704014834728]
["Porcentaje de remediación de vulnerabilidades de seguridad de la información"]
["Porcentaje de solicitudes de servicio tecnológico atendidas dentro de los tiempos establecidos",1.0900550696469065,1.0929076524539663,1.0753649091450699,1.0873581419899709,1.0674647711684748,1.0997345468335229,1.1060433295324972,1.1111111111111112,1.1060452549814253,1.109662465594669,1.102092352092352,1.0952581458681787]
["Total Gestión de Tecnología de la Información y las Comunicaciones",1.0900550696469065,1.0929076524539663,1.0753649091450699,1.1019666028855459,1.0962412439139839,1.0714591743427893,1.1090534714530864,1.1111061330147352,1.109283603512327,1.1104729126653676,1.107724199668644,1.0993467439270774]
["Gestión Documental"]
["Porcentaje de espacios controlados para la conservación documental",null,null,null,1,1,1,1,1,1,1,1,1]
["Porcentaje de inventario validado del fondo documental acumulado del archivo central",null,null,null,0.30630589314377438,0.41063058931437746,0.48221050217839945,0.58016968585186879,0.68075212107314842,0.74361843613850032,1.0019857830772758,null,0.60081043011104918]
["Porcentaje de transferencias primarias realizadas de acuerdo con los tiempos de retención",null,null,null,0.45454545454545453,0.68181818181818177,1.0606060606060606,1.25,1.5151515151515151,1.5909090909090908,1.7803030303030303,1.856060606060606,1.2736742424242422]
["Total Gestión Documental",null,null,null,0.58695044922974293,0.69748292371085308,0.84760552092815333,0.94338989528395623,1.0653012120748879,1.1115091756825304,1.2607629377934353,1.428030303030303,0.97369856305092539]
["Gestión Financiera"]
["Porcentaje de cuentas colectivas pagadas dentro del tiempo establecido",null,1,1,1,1,1,1,1,1,1,1,1]
["Porcentaje de cuentas individuales pagadas dentro del tiempo establecido",1,1,0.99444444444444446,0.99583333333333335,0.99616858237547889,1,1,1,1,1,0.990506329113924,0.99790478993338005]
["Porcentaje de ejecución del programa anual de caja",null,null,null,0.96303810868031048,0.94616312519388146,0.94086560993311175,0.9065348932083761,0.93147688539133744,0.86586199842340217,0.93352311011251343,0.78240855342033888,0.90873403554540899]
["Porcentaje de ejecución presupuestal en gastos de funcionamiento",null,null,null,0.3214139152374757,0.39703249662321571,0.50458291750777151,0.5613147228186145,0.6083842720985706,0.67217394728349822,0.77052928319482772,0.87384083750267749,0.58865904903333144]
["Porcentaje de ejecución presupuestal en gastos de inversión",null,null,null,0.36327498267694991,0.38089312504831574,0.42702740603406519,0.46492373960496713,0.48976755461188892,0.56150633631554492,0.60071841918667368,0.71008552342468623,0.4997746358628864]
["Porcentaje de informes financieros presentados a los entes de vigilancia y control dentro de los términos legales vigentes",null,null,null,null,null,1,null,null,1,1,1,1]
["Porcentaje de notas a los estados financieros reveladas correctamente"]
["Porcentaje de obligaciones contingentes registradas correctamente en la contabilidad",null,null,null,null,null,null,null,null,1,null,null,1]
["Porcentaje de partidas conciliatorias identificadas dentro del tiempo establecido",null,null,null,1.0416666666666667,0.84656084656084651,0.84656084656084651,1.1111111111111112,1.1111111111111112,1.1111111111111112,1.1111111111111112,null,1.0256046863189721]
["Total Gestión Financiera",1,1,0.99722222222222223,0.78087116776578946,0.76113636263362305,0.81700525429082782,0.84064741112384489,0.85678997053548456,0.90133167414169457,0.91655456051501794,0.89280687391027103,0.86199170626373689]
["Gestión Jurídica"]
["Porcentaje de procesos de cobro de cartera efectuados",null,null,null,1,null,null,null,1,null,null,null,1]
["Porcentaje de procesos judiciales y extrajudiciales atendidos dentro de los términos legales vigentes",null,null,1,null,null,1,null,null,1,null,null,1]
["Porcentaje de solicitudes de concepto a proyectos de acuerdo, decreto o ley atendidas dentro del tiempo establecido",null,null,null,null,null,1.1111111111111112,null,null,null,null,null,1.1111111111111112]
["Porcentaje de trámites de aval de escuelas deportivas atendidos dentro del término legal vigente",null,null,null,null,null,1.0869565217391304,null,null,1.0869565217391304,null,null,1.0869565217391304]
["Porcentaje de trámites de reconocimiento deportivo atendidos dentro del término legal vigente",null,null,1.0326086956521738,null,null,1.0421994884910486,null,null,1.0833810068649885,null,null,1.0527297303360703]
["Satisfacción de los usuarios con el trámite de reconocimiento deportivo",null,null,null,null,null,1.0058479532163744,null,null,null,null,null,1.0058479532163744]
["Índice de condenas adversas",null,null,null,null,null,2,null,null,null,null,null,2]
["Total Gestión Jurídica",null,null,1.0163043478260869,1,null,1.2076858457596107,null,1,1.056779176201373,null,null,1.1114662537549198]
["Promoción de la Recreación"]
["Porcentaje de actividades recreativas que cumplen con los requisitos para su ejecución",null,null,1.0281571443414415,null,null,1.0261467996431981,null,null,1.0261467996431981,null,null,1.0268169145426127]
["Satisfacción de los usuarios con los eventos y/o programas recreativos"]
["Total Promoción de la Recreación",null,null,1.0281571443414415,null,null,1.0261467996431981,null,null,1.0261467996431981,null,null,1.0268169145426127]
["Servicio a la Ciudadanía"]
["Porcentaje de información actualizada en ley de transparencia",null,null,null,0.9285714285714286,null,0.9464285714285714,null,null,0.9464285714285714,null,null,0.94047619047619035]
["Porcentaje de peticiones, quejas, reclamos y sugerencias contestadas dentro de los términos legales vigentes",0.91629955947136565,0.92222222222222228,0.92015209125475284,0.8928571428571429,0.56086956521739129,0.92156862745098034,0.83120204603580561,0.84135977337110479,0.9228395061728395,0.87037037037037035,0.88065843621399176,0.86185448551254251]
["Porcentaje de requerimientos atendidos con oportunidad y calidad",null,0.97153465346534651,1.0011574074074074,1.01890756302521,0.95808383233532934,0.90909090909090906,0.91666666666666652,1.0797491039426523,1.0304659498207884,1.1010362694300517,1.0029069767441861,0.9989599331928547]
["Satisfacción de peticionarios con la respuesta dada a sus requerimientos",1,1.0326086956521738,1.0576923076923077,1.0416666666666667,1.0096153846153846,1,1.0185185185185184,1.0459183673469388,1.0755813953488371,1.0526315789473684,1.0546875,1.0353564013443814]
["Satisfacción del ciudadano con la atención recibida en los SUPERCADE",1.0526315789473684,1.0526315789473684,1.0515015396785039,1.0521851703048972,1.0521396950319726,1.0526315789473684,1.0523271742108307,1.0523188541764394,1.0526315789473684,1.0521942579756411,1.0509894079973725,1.0521984013786483]
["Total Servicio a la Ciudadanía",0.98964371280624464,0.99474928757177783,1.0076258365082429,0.98683759428506901,0.89517711930001953,0.96594393738356588,0.95467860135795535,1.0048365247092839,1.0055894003436809,1.0190581191808579,0.99731058023888752,0.98379413204235688]
["Planeación de la Gestión"]
["Porcentaje de acciones de mejora con seguimiento efectuado dentro del Sistema de Gestión",null,null,null,1,1,1,1,1,1,1,1,1]
["Porcentaje de reportes de información presentados dentro de los tiempos programados",null,null,null,null,null,1,null,null,1,null,null,1]
["Total Planeación de la Gestión",null,null,null,1,1,1,1,1,1,1,1,1]
["Total general",0.8612143677001981,0.91056878774638694,0.97757026401744407,0.91186221558419722,0.89898755917008832,1.024757217016711,1.00538501322413,1.068871561554714,1.0700068330305914,1.0532266761159272,1.045551070818197,1.0103108599636401]

{"sheet":"Tabla Ranking procesos","index":3,"n_rows":21,"n_cols":2,"rows_kept":21,"cut":false,"hidden":true,"merged":[]}
["Período","(Todas)"]
[]
["Etiquetas de fila","Promedio de % Cumplimiento"]
["Gestión de Comunicaciones",1.6725919620484466]
["Gestión de Talento Humano",1.2192621724060977]
["Gestión Jurídica",1.1114662537549198]
["Gestión de Tecnología de la Información y las Comunicaciones",1.1030262529614137]
["Gestión de Asuntos Locales",1.0790119284657611]
["Gestión de Recursos Físicos",1.0633528265107213]
["Diseño y Construcción de Parques y Escenarios",1.0384225113803411]
["Promoción de la Recreación",1.0268169145426127]
["Gestión Financiera",1.0047328937424238]
["Planeación de la Gestión",1]
["Gestión Documental",1]
["Administración y Mantenimiento de Parques y Escenarios",0.99513700692562468]
["Control Disciplinario",0.98528050045679072]
["Servicio a la Ciudadanía",0.98379413204235699]
["Control, Evaluación y Seguimiento",0.91943043395058011]
["Adquisición de Bienes y Servicios",0.8439984668929702]
["Fomento al Deporte"]
["Total general",1.0666910562370067]

{"sheet":"Tabla Ranking Objetivos SG","index":4,"n_rows":10,"n_cols":2,"rows_kept":10,"cut":false,"hidden":true,"merged":[]}
["Período","(Todas)"]
[]
["Etiquetas de fila","Promedio de % Cumplimiento"]
["Prevenir los factores que afecten la salud y seguridad a fin de mejorar las condiciones del ambiente de trabajo",1.2811792927672261]
["Proteger la integridad, confidencialidad y disponibilidad de la información",1.1103704014834728]
["Mejorar continuamente los procesos del Sistema Integrado de Gestión",1.0495030585069167]
["Satisfacer las necesidades de los usuarios a través de la prestación de servicios eficientes, eficaces y efectivos",1.042128294920422]
["Implementar las políticas y líneas de acción para la preservación e integridad de la documentación",1]
["Implementar buenas prácticas ambientales para la prevención de la contaminación en el marco de una Bogotá que defiende lo público en su función administrativa y de desarrollo institucional"]
["Total general",1.066691056237006]

{"sheet":"Ranking","index":5,"n_rows":1,"n_cols":1,"rows_kept":1,"cut":false,"hidden":false,"merged":[[80,0,81,20],[82,0,83,20],[84,0,85,20],[74,0,75,20],[76,0,77,20],[78,0,79,20],[68,0,69,20],[70,0,71,20],[72,0,73,20],[62,0,63,20],[64,0,65,20],[66,0,67,20],[56,0,57,20],[58,0,59,20],[60,0,61,20],[50,0,51,20],[52,0,53,20],[54,0,55,20],[44,0,45,20],[46,0,47,20],[48,0,49,20],[38,0,39,20],[40,0,41,20],[42,0,43,20],[32,0,33,20],[34,0,35,20],[36,0,37,20],[26,0,27,20],[28,0,29,20],[30,0,31,20],[20,0,21,20],[22,0,23,20],[24,0,25,20],[14,0,15,20],[16,0,17,20],[18,0,19,20],[8,0,9,20],[10,0,11,20],[12,0,13,20],[0,0,1,20],[2,0,3,20],[4,0,5,20],[6,0,7,20]]}
["RANKING"]

{"sheet":"Indicadores Gestión","index":6,"n_rows":985,"n_cols":25,"rows_kept":985,"cut":false,"hidden":false,"merged":[]}
["Objetivo Sistema de Gestión","Proceso Fuente","Objetivo Proceso","FCE asociado 1","FCE asociado 2","FCE asociado 3","Indicador","Fórmula","Clasificación","Ámbito","Frecuencia","Meta","Unidad de medida","Fuente de información","Tendencia","Acumulado","Observaciones del indicador (Ficha)","Año","Período","Numerador","Denominador","Resultado","% Cumplimiento","Análisis Tolerancia","Observaciones del indicador (Mediciones)"]
["Mejorar continuamente los procesos del Sistema Integrado de Gestión","Planeación de la Gestión","Establecer directrices para formular y realizar seguimiento a la planeación estratégica y operativa de la entidad con el propósito de contribuir al desarrollo de la misión y objetivos institucionales, así como facilitar la oportunidad y cumplimiento de los resultados esperados","Oportunidad, veracidad y calidad de la información de inversión y gestión",null,null,"Porcentaje de reportes de información presentados dentro de los tiempos programados","(No. de reportes de información elaborados y presentados/Total de reportes de información programados)*100","Gestión","Calidad","Trimestral",1,"Porcentaje","Cronograma de trabajo interno, plan operativo por dependencias (Oficina Asesora de Planeación), plan de adecuación y sostenibilidad SIGD-MIPG","Positiva","No","En el análisis del indicador se desagregará la programación para cada trimestre.",2019,"Enero"]
["Mejorar continuamente los procesos del Sistema Integrado de Gestión","Planeación de la Gestión","Establecer directrices para formular y realizar seguimiento a la planeación estratégica y operativa de la entidad con el propósito de contribuir al desarrollo de la misión y objetivos institucionales, así como facilitar la oportunidad y cumplimiento de los resultados esperados","Oportunidad en el seguimiento de las acciones institucionales para la mejora (correcciones, acciones correctivas, oportunidades de mejora, acciones para abordar riesgos)",null,null,"Porcentaje de acciones de mejora con seguimiento efectuado dentro del Sistema de Gestión","[No. de acciones de mejora con seguimiento efectuado dentro del tiempo programado/Total de acciones de mejora abiertas dentro del Sistema de Gestión de la Calidad (correcciones, acciones correctivas, oportunidades de mejora, acciones para abordar riesgos)]*100","Gestión","Eficacia","Mensual",1,"Porcentaje","Isolución","Positiva","No","En el análisis del indicador se presentará el resultado desagregado por cada tipología de mejora (corrección, acciones correctivas, oportunidades de mejora, acciones para abordar riesgos).",2019,"Enero"]
["Mejorar continuamente los procesos del Sistema Integrado de Gestión","Gestión de Recursos Físicos","Administrar y controlar los bienes muebles y servicios para el funcionamiento administrativo de la entidad","Oportunidad en la atención de requerimientos y necesidades de servicios administrativos",null,null,"Porcentaje de mantenimientos realizados a la infraestructura física de la sede administrativa","(No. de mantenimientos realizados a la infraestructura física/Total de mantenimientos programados a la infraestructura física de la sede administrativa)*100","Gestión","Eficacia","Trimestral",0.9,"Porcentaje","Expendientes contractuales en plataforma ORFEO","Positiva","No",null,2019,"Enero"]
["Mejorar continuamente los procesos del Sistema Integrado de Gestión","Gestión de Recursos Físicos","Administrar y controlar los bienes muebles y servicios para el funcionamiento administrativo de la entidad","Oportunidad en la atención de requerimientos y necesidades de servicios administrativos",null,null,"Porcentaje de requerimientos de mantenimiento correctivo atendidos en la sede administrativa dentro de los tiempos establecidos","(No. de requerimientos de mantenimiento correctivo atendidos dentro de los tiempos establecidos/Total de requerimientos de mantenimiento correctivo reportados en la sede administrativa)*100","Gestión","Calidad","Trimestral",0.95,"Porcentaje","Aplicativo mesa de ayuda OTRS","Positiva","No",null,2019,"Enero"]
["Implementar buenas prácticas ambientales para la prevención de la contaminación en el marco de una Bogotá que defiende lo público en su función administrativa y de desarrollo institucional","Gestión de Recursos Físicos","Administrar y controlar los bienes muebles y servicios para el funcionamiento administrativo de la entidad","Calificación de la implementación del Plan Institucional de Gestión Ambiental, por parte de la Secretaría Distrital de Ambiente","Oportunidad en el reporte de formularios y registros electrónicos del PIGA ante la Secretaría Distrital de Ambiente",null,"Índice de implementación del PIGA","Promedio ponderado de cumplimiento de aspectos normativos y de implementación del PIGA, según auditoría realizada por la Secretaría Distrital de Ambiente en cada vigencia","Gestión","Eficacia","Anual",0.7,"Porcentaje","Informe de auditoría anual realizada por la Secretaría Distrital de Ambiente","Positiva","No","En el análisis del indicador se presentará el resultado desagregado por cada uno de los aspectos evaluados en la visita de control y seguimiento por parte de la Secretaría Distrital de Ambiente.\nLa meta está configurada como mayor a 70%.",2019,"Enero"]
["Mejorar continuamente los procesos del Sistema Integrado de Gestión","Gestión de Recursos Físicos","Administrar y controlar los bienes muebles y servicios para el funcionamiento administrativo de la entidad","Confiabilidad del inventario de bienes devolutivos",null,null,"Porcentaje de inventario individual validado físicamente","(No. de elementos devolutivos del inventario individual validados físicamente/Total de elementos devolutivos del inventario individual registrados en el sistema de información SEVEN)*100 ","Gestión","Eficacia","Anual",1,"Porcentaje","Sistema de información SEVEN","Positiva","No",null,2019,"Enero"]
["Mejorar continuamente los procesos del Sistema Integrado de Gestión","Gestión de Recursos Físicos","Administrar y controlar los bienes muebles y servicios para el funcionamiento administrativo de la entidad","Confiabilidad del inventario de bienes devolutivos",null,null,"Porcentaje de inventario aleatorio validado físicamente en bodega","(No. de elementos devolutivos y de consumo en bodegas validados físicamente/Muestra de inventario de elementos devolutivos y de consumo registrados en el sistema de información SEVEN)*100 ","Gestión","Eficacia","Trimestral",1,"Porcentaje","Sistema de información SEVEN","Positiva","No",null,2019,"Enero"]
["Mejorar continuamente los procesos del Sistema Integrado de Gestión","Gestión de Asuntos Locales","Desarrollar acciones a nivel local para promover la participación ciudadana, brindar acompañamiento a las alcaldías locales en temas misionales de la entidad y ofertar sus programas","Oportunidad en la emisión del concepto previo y favorable según los tiempos establecidos en la normatividad vigente",null,null,"Porcentaje de conceptos previos tramitados dentro de los términos legales vigentes","(No. de conceptos previos tramitados dentro de los términos legales vigentes/Total de solicitudes de conceptos previos recibidas)*100","Gestión","Calidad","Trimestral",0.5,"Porcentaje","Matriz de seguimiento a conceptos previos tramitados","Positiva","No",null,2019,"Enero"]
["Mejorar continuamente los procesos del Sistema Integrado de Gestión","Control, Evaluación y Seguimiento","Evaluar los controles y la gestión de la entidad con el fin de identificar e implementar acciones de mejora, en pro de la sostenibilidad del Sistema de Control Interno","Pertinencia y oportunidad en la entrega de los resultados del seguimiento a las partes interesadas","Oportunidad y calidad en la información reportada a las entidades competentes del orden nacional y distrital",null,"Porcentaje de informes presentados por la tercera línea de defensa dentro de los tiempos programados","(No. de informes de ley y de gestión elaborados y presentados dentro de los tiempos programados/Total de informes de ley y de gestión a cargo de la tercera línea de defensa )*100  ","Gestión","Calidad","Trimestral",1,"Porcentaje","Plan anual de auditoría\nCronograma presentación de informes","Positiva","No","En el análisis del indicador se presentará el resultado desagregado por cada uno de los informes realizados.",2019,"Enero"]
["Mejorar continuamente los procesos del Sistema Integrado de Gestión","Control, Evaluación y Seguimiento","Evaluar los controles y la gestión de la entidad con el fin de identificar e implementar acciones de mejora, en pro de la sostenibilidad del Sistema de Control Interno","Cumplimiento de los objetivos definidos en el plan de auditoría conforme al plan de pruebas","Cobertura de las unidades a auditar de acuerdo con los parámetros establecidos en la matriz de priorización, en concordancia con los recursos disponibles para la ejecución del Plan Anual de Auditoría",null,"Índice de eficacia de auditorías internas de control interno","(Índice auditoría 1 + índice auditoría 2 +...+Índice auditoría n)/Total de auditorías realizadas\nDonde: \nÍndice auditoría n = Calificación porcentual de la variable Objetivos Específicos*Peso de la variable Objetivos Específicos + Calificación porcentual de la variable Actividad Plan de Auditoría*Peso de la variable Actividad Plan de Auditoría + Calificación porcentual de la variable Oportunidad*Peso de la variable Oportunidad\nPesos de las variables:\nObjetivos Específicos = 40%\nActividades Plan de Auditoría = 30%\nOportunidad = 30%. Esta se medirá tomando como fecha de referencia la de emisión del informe preliminar de auditoría.\nn = número de auditorías realizadas","Gestión","Eficacia","Trimestral",0.85,"Porcentaje","Planes de cada una de las auditorías","Positiva","No","En el análisis del indicador se presentará el resultado desagregado por cada una de las auditorías realizadas.",2019,"Enero"]
["Mejorar continuamente los procesos del Sistema Integrado de Gestión","Gestión Financiera","Administrar los recursos financieros asignados y realizar los respectivos registros, para el cumplimiento de las funciones de la entidad y pago de sus obligaciones con terceros","Oportunidad en el seguimiento de las partidas pendientes por conciliar",null,null,"Porcentaje de partidas conciliatorias identificadas dentro del tiempo establecido","(No. de partidas conciliatorias identificadas con edad inferior a 60 días/Total de partidas reportadas)*100","Gestión","Calidad","Mensual",0.9,"Porcentaje","Sistema de información SEVEN","Positiva","No",null,2019,"Enero"]
["Mejorar continuamente los procesos del Sistema Integrado de Gestión","Gestión Financiera","Administrar los recursos financieros asignados y realizar los respectivos registros, para el cumplimiento de las funciones de la entidad y pago de sus obligaciones con terceros","Oportunidad e integridad de la información necesaria para realizar las diferentes conciliaciones",null,null,"Porcentaje de obligaciones contingentes registradas correctamente en la contabilidad","(No. de procesos registrados correctamente en la contabilidad/Total de procesos reportados en SIPROJ Web)*100","Gestión","Calidad","Trimestral",1,"Porcentaje","Sistema de información SEVEN","Positiva","No",null,2019,"Enero"]
["Mejorar continuamente los procesos del Sistema Integrado de Gestión","Gestión Financiera","Administrar los recursos financieros asignados y realizar los respectivos registros, para el cumplimiento de las funciones de la entidad y pago de sus obligaciones con terceros","Oportunidad en la presentación de informes y estados financieros a los diferentes entes de vigilancia y control",null,null,"Porcentaje de notas a los estados financieros reveladas correctamente","(No. de notas sin observaciones por parte de los órganos de control internos y externos/Total de notas a los estados financieros elaboradas)*100","Gestión","Calidad","Anual",0.95,"Porcentaje","Informes de entes de control y vigilancia","Positiva","No",null,2019,"Enero"]
["Mejorar continuamente los procesos del Sistema Integrado de Gestión","Gestión Financiera","Administrar los recursos financieros asignados y realizar los respectivos registros, para el cumplimiento de las funciones de la entidad y pago de sus obligaciones con terceros","Oportunidad en la presentación de informes y estados financieros a los diferentes entes de vigilancia y control","Oportunidad en la presentación de las declaraciones tributarias",null,"Porcentaje de informes financieros presentados a los entes de vigilancia y control dentro de los términos legales vigentes","(No. de informes financieros presentados dentro de los términos legales vigentes/Total de informes financieros a reportar a los entes de vigilancia y control)*100","Gestión","Calidad","Trimestral",1,"Porcentaje","Matriz de seguimiento a la presentación de informes ","Positiva","No",null,2019,"Enero"]
["Satisfacer las necesidades de los usuarios a través de la prestación de servicios eficientes, eficaces y efectivos","Promoción de la Recreación","Desarrollar actividades recreativas en función de las características y necesidades de la población de Bogotá D.C., para promover el aprovechamiento del tiempo libre y el mejoramiento en la calidad de vida","Satisfacción del usuario con las actividades recreativas realizadas",null,null,"Satisfacción de los usuarios con los eventos y/o programas recreativos","(No. de usuarios satisfechos con los eventos y/o programas recreativos/Total de usuarios de eventos y/o programas recreativos encuestados)*100","Gestión","Efectividad","Anual",1,"Porcentaje","Encuesta de satisfacción sobre eventos y/o programas recreativos","Positiva","No","En el análisis del indicador se presentará el resultado desagregado por programa y por cada uno de los aspectos evaluados en la encuesta de satisfacción.\nSe colocó una meta de 100%, mientras se levanta la línea base con la primera medición.",2019,"Enero"]
["Mejorar continuamente los procesos del Sistema Integrado de Gestión","Promoción de la Recreación","Desarrollar actividades recreativas en función de las características y necesidades de la población de Bogotá D.C., para promover el aprovechamiento del tiempo libre y el mejoramiento en la calidad de vida","Cumplimiento del programa de actividades recreativas, teniendo en cuenta lo establecido en las fichas técnicas o según lo concertado con la comunidad e instituciones",null,null,"Porcentaje de actividades recreativas que cumplen con los requisitos para su ejecución","(No. de actividades recreativas que cumplen con los requisitos definidos para su ejecución/Total de actividades recreativas realizadas)*100","Gestión","Eficacia","Trimestral",0.97,"Porcentaje","Sistema de información misional - SIM","Positiva","No","En el análisis del indicador se presentará el resultado desagregado por programa y por actividad.",2019,"Enero"]
["Satisfacer las necesidades de los usuarios a través de la prestación de servicios eficientes, eficaces y efectivos","Fomento al Deporte","Desarrollar e implementar programas deportivos y de actividad física, para contribuir con el mejoramiento de la calidad de vida en la población de Bogotá D.C.","Satisfacción del usuario con las actividades deportivas  realizadas",null,null,"Satisfacción de los usuarios con las actividades realizadas en los programas deportivos","(No. de usuarios satisfechos con las actividades deportivas realizadas/Total de usuarios de actividades deportivas encuestados)*100","Gestión","Efectividad","Anual",1,"Porcentaje","Encuesta de satisfacción sobre actividades/programas deportivos","Positiva","No","En el análisis del indicador se presentará el resultado desagregado por programa y por cada uno de los aspectos evaluados en la encuesta de satisfacción.\nSe colocó una meta de 100%, mientras se levanta la línea base con la primera medición.",2019,"Enero"]
["Mejorar continuamente los procesos del Sistema Integrado de Gestión","Fomento al Deporte","Desarrollar e implementar programas deportivos y de actividad física, para contribuir con el mejoramiento de la calidad de vida en la población de Bogotá D.C.","Cambios comportamentales como resultados de los programas deportivos y de actividad física",null,null,"Cambio comportamental frente a la actividad física y el deporte","(No. de beneficiarios con percepción de cambio comportamental alrededor de las 4 dimensiones de la alfabetización física/Total de beneficiarios de programas deportivos y de actividad física seleccionados en la muestra)*100","Gestión","Efectividad","Anual",1,"Porcentaje","Encuesta para medir las 4 dimensiones de la alfabetización física","Positiva","No","La metodología se aplicará sobre una muestra por cada por cada programa. Se define en 4 tipos de mediciones:\n1. Medición dimensión competencia física. Aplicar test de resistencia, fuerza de torso, habilidades y flexibilidad.\n2. Medición dimensiones: competencia cognitiva, comportamental y motivacional a través de un cuestionario (on-line o presencial).\nSe colocó una meta de 100%, mientras se levanta la línea base con la primera medición.",2019,"Enero"]
["Satisfacer las necesidades de los usuarios a través de la prestación de servicios eficientes, eficaces y efectivos","Servicio a la Ciudadanía","Brindar información y atender los requerimientos de los grupos de valor y de interés de la entidad para responder a sus necesidades en cumplimiento de sus derechos","Oportunidad y calidad en la respuesta a los requerimientos de los grupos de valor e interés de la entidad","Satisfacción del ciudadano frente a las respuestas a sus requerimientos",null,"Satisfacción de peticionarios con la respuesta dada a sus requerimientos","(No. de peticionarios satisfechos con la respuesta dada a sus peticiones, quejas, reclamos y sugerencias/Total de peticionarios contactados)*100","Gestión","Efectividad","Mensual",0.8,"Porcentaje","Base de datos de gestión de PQRS","Positiva","No",null,2019,"Enero",20,25,{"$f":"+T20/U20","v":0.8},{"$f":"+V20/L20","v":1},{"$f":"_xlfn.IFS(W20<=69%,\"Crítico\",W20>=90%,\"Aceptable\",W20>=70%,\"Tolerable\")","v":"Aceptable"}]
["Mejorar continuamente los procesos del Sistema Integrado de Gestión","Adquisición de Bienes y Servicios","Realizar actividades contractuales para adquirir bienes y servicios con la oportunidad y de acuerdo con las especificaciones establecidas por la entidad","Cumplimiento de requisitos de acuerdo con la modalidad de selección",null,null,"Porcentaje de procesos de selección publicados dentro del tiempo establecido","(No. de actos de apertura de procesos de selección publicados en un tiempo menor o igual a 30 días hábiles después de la radicación/Total de actos de apertura expedidos)*100","Gestión","Calidad","Trimestral",0.9,"Porcentaje","Plataforma ORFEO y SECOP","Positiva","No","En el análisis del indicador se presentará el resultado desagregado para licitación pública, concurso de méritos y selección abreviada.",2019,"Enero"]
["Mejorar continuamente los procesos del Sistema Integrado de Gestión","Adquisición de Bienes y Servicios","Realizar actividades contractuales para adquirir bienes y servicios con la oportunidad y de acuerdo con las especificaciones establecidas por la entidad","Oportunidad en la suscripción y legalización del contrato",null,null,"Porcentaje de contratos legalizados dentro del tiempo establecido","(No. de contratos legalizados en un tiempo menor o igual a 10 días hábiles a partir del acto administrativo de adjudicación/Total de procesos de selección adjudicados)*100","Gestión","Calidad","Mensual",0.8,"Porcentaje","SECOP y Plataforma ORFEO ","Positiva","No","En el análisis del indicador se presentará el resultado desagregado para licitación pública, concurso de méritos y selección abreviada.",2019,"Enero"]
["Mejorar continuamente los procesos del Sistema Integrado de Gestión","Adquisición de Bienes y Servicios","Realizar actividades contractuales para adquirir bienes y servicios con la oportunidad y de acuerdo con las especificaciones establecidas por la entidad","Definición clara y precisa de requisitos técnicos, financieros, económicos, jurídicos y de riesgos de acuerdo con el bien o servicio a adquirir",null,null,"Porcentaje de procesos de obra tramitados en análisis de costos dentro del tiempo establecido","(No. de procesos de obra (todas las Subdirecciones) tramitados en oportunidad al recibo del memorando con la solicitud estudio del sector (20 días)/Total de procesos de obra recibidos)*100","Gestión","Calidad","Trimestral",1,"Porcentaje","Matriz de tráfico ACEE","Positiva","No",null,2019,"Enero"]
["Mejorar continuamente los procesos del Sistema Integrado de Gestión","Adquisición de Bienes y Servicios","Realizar actividades contractuales para adquirir bienes y servicios con la oportunidad y de acuerdo con las especificaciones establecidas por la entidad","Definición clara y precisa de requisitos técnicos, financieros, económicos, jurídicos y de riesgos de acuerdo con el bien o servicio a adquirir",null,null,"Porcentaje de procesos diferentes a obra tramitados en análisis de costos dentro del tiempo establecido","(No. de procesos diferentes a obra tramitados en oportunidad al recibo del memorando con la solicitud estudio del sector (10 días hábiles)/Total de procesos recibidos diferentes a obra)*100","Gestión","Calidad","Trimestral",0.9,"Porcentaje","Matriz de tráfico ACEE","Positiva","No","En el análisis del indicador se presentará el resultado desagregado para procesos diferentes a obra.",2019,"Enero"]
["Mejorar continuamente los procesos del Sistema Integrado de Gestión","Adquisición de Bienes y Servicios","Realizar actividades contractuales para adquirir bienes y servicios con la oportunidad y de acuerdo con las especificaciones establecidas por la entidad","Definición clara y precisa de requisitos técnicos, financieros, económicos, jurídicos y de riesgos de acuerdo con el bien o servicio a adquirir",null,null,"Porcentaje de procesos requeridos por precios artificialmente bajos","(No. de procesos (excepto Subastas SAS) requeridos por precios artificialmente bajos/Total de procesos evaluados)*100","Gestión","Calidad","Trimestral",0.15,"Porcentaje","Evaluación económica de los proponentes\n\nAnálisis de precios realizado por la ACEE","Negativa","No","En el análisis del indicador se presentará el resultado desagregado por tipo de proceso.",2019,"Enero"]
["Mejorar continuamente los procesos del Sistema Integrado de Gestión","Control, Evaluación y Seguimiento","Evaluar los controles y la gestión de la entidad con el fin de identificar e implementar acciones de mejora, en pro de la sostenibilidad del Sistema de Control Interno","Pertinencia y oportunidad en la entrega de los resultados del seguimiento a las partes interesadas",null,null,"Porcentaje de acciones de mejoramiento interno con seguimiento efectuado","(No. de acciones de mejoramiento interno con seguimiento efectuado)/Total de acciones de mejoramiento interno abiertas de auditorías internas de control interno)*100","Gestión","Eficacia","Trimestral",1,"Porcentaje","Plataforma Isolución","Positiva","No","En el análisis del indicador se presentará el resultado desagregado por proceso.",2019,"Enero"]
["Mejorar continuamente los procesos del Sistema Integrado de Gestión","Control, Evaluación y Seguimiento","Evaluar los controles y la gestión de la entidad con el fin de identificar e implementar acciones de mejora, en pro de la sostenibilidad del Sistema de Control Interno","Pertinencia y oportunidad en la entrega de los resultados del seguimiento a las partes interesadas",null,null,"Porcentaje de acciones de mejoramiento externo con seguimiento efectuado","(No. de acciones de mejoramiento externo con seguimiento efectuado)/Total de acciones de mejoramiento externo abiertas de auditorías externas)*100","Gestión","Eficacia","Trimestral",1,"Porcentaje","Matrices de consolidación del estado de las acciones de los diferentes entes de control y vigilancia","Positiva","No","En el análisis del indicador se presentará el resultado desagregado por auditoría externa.",2019,"Enero"]
["Mejorar continuamente los procesos del Sistema Integrado de Gestión","Gestión Financiera","Administrar los recursos financieros asignados y realizar los respectivos registros, para el cumplimiento de las funciones de la entidad y pago de sus obligaciones con terceros","Oportunidad en la expedición de los certificados presupuestales y en la presentación de los informes de ejecución",null,null,"Porcentaje de ejecución presupuestal en gastos de funcionamiento","(Presupuesto de funcionamiento ejecutado/Presupuesto disponible de funcionamiento)*100","Gestión","Eficiencia","Mensual",0.95,"Porcentaje","Ejecución presupuestal en SEVEN","Positiva","Si","La meta es anual con medición y análisis mensual.\nLa medición está a cargo del Área Financiera y el análisis a cargo de la Subdirección Administrativa y Financiera.\nLa medición y el análisis se deben realizar a más tardar el quinto día hábil de cada mes.\nUna vez se realice el Comité Financiero, el Área Financiera debe enviar a la Oficina Asesora de Planeación la presentación correspondiente, con el análisis respectivo en cuanto al desempeño del indicador.",2019,"Enero"]
["Mejorar continuamente los procesos del Sistema Integrado de Gestión","Gestión Financiera","Administrar los recursos financieros asignados y realizar los respectivos registros, para el cumplimiento de las funciones de la entidad y pago de sus obligaciones con terceros","Oportunidad en la expedición de los certificados presupuestales y en la presentación de los informes de ejecución","Oportunidad en la autorización de giro de los recursos de transferencia",null,"Porcentaje de ejecución presupuestal en gastos de inversión","(Presupuesto de inversión ejecutado/Presupuesto disponible de inversión)*100","Gestión","Eficiencia","Mensual",1,"Porcentaje","Ejecución presupuestal en SEVEN","Positiva","Si","La meta es anual con medición y análisis mensual.\nLa medición está a cargo del Área Financiera y el análisis a cargo de los Ordenadores del Gasto.\nLa medición y el análisis se deben realizar a más tardar el quinto día hábil de cada mes.\nUna vez se realice el Comité Financiero, el Área Financiera debe enviar a la Oficina Asesora de Planeación la presentación correspondiente, con el análisis respectivo en cuanto al desempeño del indicador.",2019,"Enero"]
["Mejorar continuamente los procesos del Sistema Integrado de Gestión","Gestión Financiera","Administrar los recursos financieros asignados y realizar los respectivos registros, para el cumplimiento de las funciones de la entidad y pago de sus obligaciones con terceros","Oportunidad en el pago de las obligaciones financieras de la entidad",null,null,"Porcentaje de ejecución del programa anual de caja","(Recursos ejecutados de reserva, vigencia y pasivos exigibles/Recursos programados de reserva, vigencia y pasivos exigibles)*100","Gestión","Eficiencia","Mensual",1,"Porcentaje","Sistema de información SEVEN","Positiva","Si","La meta es anual con medición y análisis mensual.\nLa medición está a cargo del Área Financiera y el análisis a cargo de los Ordenadores del Gasto.\nLa medición y el análisis se deben realizar a más tardar el quinto día hábil de cada mes.\nUna vez se realice el Comité Financiero, el Área Financiera debe enviar a la Oficina Asesora de Planeación la presentación correspondiente, con el análisis respectivo en cuanto al desempeño del indicador.",2019,"Enero"]
["Mejorar continuamente los procesos del Sistema Integrado de Gestión","Gestión Financiera","Administrar los recursos financieros asignados y realizar los respectivos registros, para el cumplimiento de las funciones de la entidad y pago de sus obligaciones con terceros","Oportunidad en el pago de las obligaciones financieras de la entidad","Oportunidad en la causación de ordenes de pago que cumplan con todos los requisitos establecidos","Oportunidad y veracidad de la información necesaria para la causación de las ordenes de pago reportada por los ordenadores del gasto","Porcentaje de cuentas individuales pagadas dentro del tiempo establecido","(No. de cuentas individuales pagadas en un tiempo menor o igual a 6 días/Total de cuentas de pago individuales tramitadas)*100 ","Gestión","Calidad","Mensual",1,"Porcentaje","Bitácora de cuentas en SEVEN","Positiva","No","La medición y el análisis están a cargo del Área Financiera.\nEn el análisis del indicador se presentará el resultado del tiempo promedio en cada una de las etapas para el pago, según la bitácora de cuentas de SEVEN.",2019,"Enero",24,24,{"$f":"+T31/U31","v":1},{"$f":"+V31/L31","v":1},{"$f":"_xlfn.IFS(W31<=69%,\"Crítico\",W31>=90%,\"Aceptable\",W31>=70%,\"Tolerable\")","v":"Aceptable"}]
["Mejorar continuamente los procesos del Sistema Integrado de Gestión","Gestión Financiera","Administrar los recursos financieros asignados y realizar los respectivos registros, para el cumplimiento de las funciones de la entidad y pago de sus obligaciones con terceros","Oportunidad en el pago de las obligaciones financieras de la entidad","Oportunidad en la causación de ordenes de pago que cumplan con todos los requisitos establecidos","Oportunidad y veracidad de la información necesaria para la causación de las ordenes de pago reportada por los ordenadores del gasto","Porcentaje de cuentas colectivas pagadas dentro del tiempo establecido","(No. de cuentas colectivas pagadas en un tiempo menor o igual a 10 días/Total de cuentas de pago colectivas tramitadas)*100","Gestión","Calidad","Mensual",1,"Porcentaje","Bitácora de cuentas en SEVEN","Positiva","No","La medición y el análisis están a cargo del Área Financiera.\nEn el análisis del indicador se debe presentar el resultado del tiempo promedio en cada una de las etapas para el pago, según la bitácora de cuentas de SEVEN.",2019,"Enero","No se efectuó ningún pago de cuentas colectivas","No se efectuó ningún pago de cuentas colectivas"]
["Implementar las políticas y líneas de acción para la preservación e integridad de la documentación","Gestión Documental","Administrar, conservar y custodiar la documentación generada en la entidad, desde su origen hasta su disposición final, para preservar la memoria institucional","Actualización del inventario documental en el Formato Único de Inventario Documental, con base en la aplicación de las tablas de retención documental","Cumplimiento de los tiempos de retención documental establecidos en las tablas","Actualización de los instrumentos archivísticos","Porcentaje de inventario validado del fondo documental acumulado del archivo central","(No. de metros lineales de inventario validado en cuanto a series, subseries, asuntos y oficinas productoras/Total de metros lineales de archivo inventariado en estado natural del archivo central)*100 ","Gestión","Eficacia","Mensual",1,"Porcentaje","Matriz de seguimiento a inventario documental","Positiva","Si","La meta es anual con medición y análisis mensual",2019,"Enero"]
["Implementar las políticas y líneas de acción para la preservación e integridad de la documentación","Gestión Documental","Administrar, conservar y custodiar la documentación generada en la entidad, desde su origen hasta su disposición final, para preservar la memoria institucional","Oportunidad en las transferencias documentales de acuerdo con los tiempos de retención establecidos en las tablas",null,null,"Porcentaje de transferencias primarias realizadas de acuerdo con los tiempos de retención","(No. de transferencias primarias realizadas de acuerdo con los tiempos de retención establecidos en las TRD/Total de transferencias documentales programadas)*100","Gestión","Eficacia","Mensual",0.8,"Porcentaje","Matriz de seguimiento a transferencias documentales","Positiva","Si","La meta es anual con medición y análisis mensual",2019,"Enero"]
["Implementar las políticas y líneas de acción para la preservación e integridad de la documentación","Gestión Documental","Administrar, conservar y custodiar la documentación generada en la entidad, desde su origen hasta su disposición final, para preservar la memoria institucional","Cumplimiento de los estándares de temperatura, humedad relativa y luminosidad de los espacios de almacenamiento de material documental, dentro de los rangos establecidos en la normatividad vigente",null,null,"Porcentaje de espacios controlados para la conservación documental","(No. de espacios monitoreados e intervenidos/Total de espacios monitoreados)*100","Gestión","Eficacia","Mensual",1,"Porcentaje","Informe de monitoreo de espacios controlados","Positiva","No","La medición es mes vencido",2019,"Enero"]
["Mejorar continuamente los procesos del Sistema Integrado de Gestión","Servicio a la Ciudadanía","Brindar información y atender los requerimientos de los grupos de valor y de interés de la entidad para responder a sus necesidades en cumplimiento de sus derechos","Oportunidad y calidad en la respuesta a los requerimientos de los grupos de valor e interés de la entidad",null,null,"Porcentaje de peticiones, quejas, reclamos y sugerencias contestadas dentro de los términos legales vigentes","(No. de peticiones, quejas, reclamos y sugerencias contestadas en el aplicativo SDQS dentro de los términos legales vigentes/Total de peticiones, quejas, reclamos y sugerencias recibidas)*100","Gestión","Calidad","Mensual",1,"Porcentaje","Sistema SDQS","Positiva","No","La medición es mes vencido",2019,"Enero",208,227,0.91629955947136565,0.91629955947136565,{"$f":"_xlfn.IFS(W36<=69%,\"Crítico\",W36>=90%,\"Aceptable\",W36>=70%,\"Tolerable\")","v":"Aceptable"}]
["Satisfacer las necesidades de los usuarios a través de la prestación de servicios eficientes, eficaces y efectivos","Servicio a la Ciudadanía","Brindar información y atender los requerimientos de los grupos de valor y de interés de la entidad para responder a sus necesidades en cumplimiento de sus derechos","Satisfacción del ciudadano frente a la atención brindada por la entidad",null,null,"Satisfacción del ciudadano con la atención recibida en los SUPERCADE","(No. de ciudadanos satisfechos con la atención recibida en los SUPERCADE/Total de ciudadanos atendidos en los SUPERCADE)*100","Gestión","Efectividad","Mensual",0.95,"Porcentaje","Encuesta de satisfacción con la atención brindada en SUPERCADES","Positiva","No",null,2019,"Enero",1408,1408,1,1.0526315789473684,"Aceptable"]
["Mejorar continuamente los procesos del Sistema Integrado de Gestión","Servicio a la Ciudadanía","Brindar información y atender los requerimientos de los grupos de valor y de interés de la entidad para responder a sus necesidades en cumplimiento de sus derechos","Oportunidad en la actualización de la información publicada en la sección de ley de transparencia en la página web de la entidad",null,null,"Porcentaje de información actualizada en ley de transparencia","(No. de subcategorías con información actualizada en la página web/Total de subcategorías definidas en ley de transparencia)*100","Gestión","Eficacia","Trimestral",1,"Porcentaje","Página web","Positiva","No",null,2019,"Enero"]
["Mejorar continuamente los procesos del Sistema Integrado de Gestión","Servicio a la Ciudadanía","Brindar información y atender los requerimientos de los grupos de valor y de interés de la entidad para responder a sus necesidades en cumplimiento de sus derechos","Coherencia, claridad, solución de fondo, calidez y manejo del sistema en relación con los requerimientos atendidos por la entidad",null,null,"Porcentaje de requerimientos atendidos con oportunidad y calidad","(No. de respuestas a requerimientos sin observaciones en cuanto a los criterios de oportunidad y calidad/Total de requerimientos evaluados en el aplicativo SDQS)*100","Gestión","Eficacia","Mensual",0.8,"Porcentaje","SDQS y base de datos de gestión de PQRS","Positiva","No","La medición es mes vencido",2019,"Enero"]
["Proteger la integridad, confidencialidad y disponibilidad de la información","Gestión de Tecnología de la Información y las Comunicaciones","Proporcionar soluciones estratégicas de tecnologías de la información y las comunicaciones, para contribuir con la eficiencia administrativa, la mejora de los trámites y servicios y la protección de los activos de información de la entidad","Impacto del plan de remediación frente a las vulnerabilidades identificadas","Aseguramiento de incidencias en la seguridad de la información que afecten la confidencialidad, integridad y disponibilidad",null,"Porcentaje de remediación de vulnerabilidades de seguridad de la información","(No. de vulnerabilidades críticas o altas remediadas/Total de vulnerabilidades de seguridad de la información detectadas como críticas o altas)*100 ","Gestión","Eficacia","Anual",0.7,"Porcentaje","Matriz de vulnerabilidades","Positiva","No","La meta está configurada como mínimo 70%.",2019,"Enero"]
["Proteger la integridad, confidencialidad y disponibilidad de la información","Gestión de Tecnología de la Información y las Comunicaciones","Proporcionar soluciones estratégicas de tecnologías de la información y las comunicaciones, para contribuir con la eficiencia administrativa, la mejora de los trámites y servicios y la protección de los activos de información de la entidad","Avances en la implementación de gobierno digital de acuerdo con los componentes evaluados por MINTIC",null,null,"Índice de implementación de gobierno digital","Sumatoria de la calificación obtenida por cada componente/Total de componentes de la política de gobierno digital","Gestión","Eficacia","Anual",0.65,"Porcentaje","Instrumento de medición suministrado para el seguimiento a la política de gobierno digital  ","Positiva","No","En el análisis del indicador se presentará el resultado desagregado de las calificaciones obtenidas en cada componente de la política de seguridad digital.",2019,"Enero"]
["Mejorar continuamente los procesos del Sistema Integrado de Gestión","Gestión de Tecnología de la Información y las Comunicaciones","Proporcionar soluciones estratégicas de tecnologías de la información y las comunicaciones, para contribuir con la eficiencia administrativa, la mejora de los trámites y servicios y la protección de los activos de información de la entidad","Cumplimiento del Plan Estratégico de Tecnologías de la Información PETI",null,null,"Porcentaje de avance en proyectos de TI","(No. de hitos en proyectos de TI alcanzados/Total de hitos en proyectos de TI programados en la vigencia)*100","Gestión","Eficacia","Semestral",1,"Porcentaje","Cronograma de proyectos del PETI","Positiva","Si","La meta es anual con medición y análisis semestral.",2019,"Enero"]
["Proteger la integridad, confidencialidad y disponibilidad de la información","Gestión de Tecnología de la Información y las Comunicaciones","Proporcionar soluciones estratégicas de tecnologías de la información y las comunicaciones, para contribuir con la eficiencia administrativa, la mejora de los trámites y servicios y la protección de los activos de información de la entidad","Disponibilidad de los sistemas de información de la entidad",null,null,"Porcentaje de disponibilidad de los sistemas de información","(No. de horas disponibles de los sistemas de información/Total de horas en servicio de los sistemas de información)*100","Gestión","Eficiencia","Mensual",0.9,"Porcentaje","Herramienta de monitoreo ZABBIX","Positiva","No","En el análisis del indidicador se presentará el resultado desagregado de disponibilidad en ORFEO, SEVEN, KACTUS y SIM.\nLa meta está configurada como mayor o igual a 90%.",2019,"Enero"]
["Mejorar continuamente los procesos del Sistema Integrado de Gestión","Gestión de Tecnología de la Información y las Comunicaciones","Proporcionar soluciones estratégicas de tecnologías de la información y las comunicaciones, para contribuir con la eficiencia administrativa, la mejora de los trámites y servicios y la protección de los activos de información de la entidad","Disponibilidad de los servicios de comunicaciones en la entidad, según los acuerdos de niveles de servicios establecidos",null,null,"Porcentaje de disponibilidad de los servicios de comunicaciones","(No. de horas disponibles de los servicios de comunicaciones /Total de horas de los servicios de comunicaciones)*100","Gestión","Eficiencia","Mensual",0.9,"Porcentaje","Herramienta de monitoreo ZABBIX","Positiva","No","En el análisis del indidicador se presentará el resultado desagregado de disponibilidad en Internet y Telefonía IP.\nLa meta está configurada como mayor o igual a 90%.",2019,"Enero"]
["Mejorar continuamente los procesos del Sistema Integrado de Gestión","Gestión de Tecnología de la Información y las Comunicaciones","Proporcionar soluciones estratégicas de tecnologías de la información y las comunicaciones, para contribuir con la eficiencia administrativa, la mejora de los trámites y servicios y la protección de los activos de información de la entidad","Incidencias reportadas en el funcionamiento del módulo o sistema de información implementado","Cumplimiento de los acuerdos de niveles de servicios establecidos",null,"Porcentaje de solicitudes de servicio tecnológico atendidas dentro de los tiempos establecidos","(No. de solicitudes atendidas dentro de los tiempos establecidos en los acuerdos de nivel de servicio/Total de solicitudes de servicio tecnológico recibidas)*100","Gestión","Calidad","Mensual",0.9,"Porcentaje","Herramienta GLPI","Positiva","No",null,2019,"Enero",1346,1372,0.98104956268221577,1.0900550696469065,{"$f":"_xlfn.IFS(W45<=69%,\"Crítico\",W45>=90%,\"Aceptable\",W45>=70%,\"Tolerable\")","v":"Aceptable"}]
["Mejorar continuamente los procesos del Sistema Integrado de Gestión","Gestión de Talento Humano","Gestionar el potencial del talento humano como factor estratégico, para contribuir con el desarrollo de la entidad en un ambiente seguro y saludable","Cumplimiento de compromisos y competencias del servidor público en el desempeño laboral","Oportunidad en el seguimiento y la evaluación anual u ordinaria del servidor público para continuar su permanencia en el servicio",null,"Índice de desempeño laboral de funcionarios","(Sumatoria de calificaciones finales de la evaluación de desempeño de los funcionarios/Total de funcionarios evaluados)*100","Gestión","Eficacia","Anual",0.9,"Porcentaje","Consolidado de las calificaciones finales de la evaluación de desempeño","Positiva","No","En el análisis del indicador se presentará el resultado desagregado por niveles jerárquicos y comparar con la evaluación de las áreas.\nLa meta está configurada como mayor a 90%.\nNota: Se mide para vigencia 2018-2019.",2019,"Enero"]
["Mejorar continuamente los procesos del Sistema Integrado de Gestión","Gestión de Talento Humano","Gestionar el potencial del talento humano como factor estratégico, para contribuir con el desarrollo de la entidad en un ambiente seguro y saludable","Cobertura de servidores públicos en las actividades del plan de bienestar e incentivos",null,null,"Porcentaje de funcionarios que participan en las actividades del plan de bienestar e incentivos","(No. de funcionarios participantes en las actividades del plan de bienestar e incentivos/Total de funcionarios de la entidad)*100 ","Gestión","Eficacia","Semestral",0.8,"Porcentaje","Registros de asistencia a las actividades del plan de bienestar","Positiva","No",null,2019,"Enero"]
["Mejorar continuamente los procesos del Sistema Integrado de Gestión","Gestión de Talento Humano","Gestionar el potencial del talento humano como factor estratégico, para contribuir con el desarrollo de la entidad en un ambiente seguro y saludable","Cobertura de servidores públicos en las actividades del plan institucional de capacitación",null,null,"Porcentaje de funcionarios que asisten a las actividades del plan institucional de capacitación","(No. de funcionarios asistentes a las actividades del plan institucional de capacitación/Total de funcionarios citados a las actividades del plan institucional de capacitación)*100","Gestión","Eficacia","Semestral",0.8,"Porcentaje","Registros de asistencia a las actividades del plan de capacitación","Positiva","No","Las capacitaciones que se incluyen en el indicador son las que implican recursos.",2019,"Enero"]
["Mejorar continuamente los procesos del Sistema Integrado de Gestión","Gestión de Talento Humano","Gestionar el potencial del talento humano como factor estratégico, para contribuir con el desarrollo de la entidad en un ambiente seguro y saludable","Evaluación del impacto de la capacitación en el desempeño de los servidores públicos y de la entidad",null,null,"Impacto de la capacitación en el desempeño laboral de funcionarios","(No. de funcionarios con capacitaciones efectivas/Total de funcionarios evaluados)*100","Gestión","Eficacia","Trimestral",0.95,"Porcentaje","Consolidado de las evaluaciones de impacto de la capacitación","Positiva","No",null,2019,"Enero"]
["Mejorar continuamente los procesos del Sistema Integrado de Gestión","Gestión de Talento Humano","Gestionar el potencial del talento humano como factor estratégico, para contribuir con el desarrollo de la entidad en un ambiente seguro y saludable","Satisfacción de los servidores públicos frente a las actividades de  bienestar e incentivos","Satisfacción de los servidores públicos frente a las actividades de capacitación",null,"Índice de clima organizacional","Promedio ponderado de las dimensiones evaluadas en la encuesta de medición de clima organizacional","Gestión","Eficacia","Anual",0.8,"Porcentaje","Informe de medición de clima organizacional","Positiva","No","En el análisis del indicador se presentará el resultado desagregado por áreas y/o dependencias, y por las dimensiones evaluadas.",2019,"Enero"]
["Mejorar continuamente los procesos del Sistema Integrado de Gestión","Gestión de Talento Humano","Gestionar el potencial del talento humano como factor estratégico, para contribuir con el desarrollo de la entidad en un ambiente seguro y saludable","Cumplimiento del plan anual de  bienestar e incentivos",null,null,"Porcentaje de ejecución del plan anual de bienestar e incentivos","(No. de actividades de bienestar e incentivos desarrolladas/Total de actividades programadas en el plan anual de bienestar e incentivos)*100","Gestión","Eficacia","Semestral",1,"Porcentaje","Matriz de seguimiento a la ejecución de actividades de bienestar e incentivos","Positiva","Si","La meta es anual con medición y análisis semestral.",2019,"Enero"]
["Mejorar continuamente los procesos del Sistema Integrado de Gestión","Gestión de Talento Humano","Gestionar el potencial del talento humano como factor estratégico, para contribuir con el desarrollo de la entidad en un ambiente seguro y saludable","Cumplimiento del plan institucional de capacitación",null,null,"Porcentaje de ejecución del plan institucional de capacitación","(No. de actividades de capacitación desarrolladas/Total de actividades programadas en el plan institucional de capacitación)*100","Gestión","Eficacia","Semestral",1,"Porcentaje","Matriz de seguimiento a la ejecución de actividades de capacitación","Positiva","Si","La meta es anual con medición y análisis semestral.",2019,"Enero"]
["Prevenir los factores que afecten la salud y seguridad a fin de mejorar las condiciones del ambiente de trabajo","Gestión de Talento Humano","Gestionar el potencial del talento humano como factor estratégico, para contribuir con el desarrollo de la entidad en un ambiente seguro y saludable","Cumplimiento del plan anual de trabajo",null,null,"Porcentaje de ejecución del plan anual de seguridad y salud en el trabajo","(No. de actividades de seguridad y salud desarrolladas/Total de actividades programadas en el plan anual de seguridad y salud en el trabajo)*100","Gestión","Eficacia","Mensual",0.95,"Porcentaje","Plan de trabajo anual del Sistema de Gestión de Seguridad y Salud en el Trabajo","Positiva","No",null,2019,"Enero"]
["Prevenir los factores que afecten la salud y seguridad a fin de mejorar las condiciones del ambiente de trabajo","Gestión de Talento Humano","Gestionar el potencial del talento humano como factor estratégico, para contribuir con el desarrollo de la entidad en un ambiente seguro y saludable","Tasa de accidentalidad",null,null,"Tasa de accidentalidad","(No. de accidentes de trabajo reportados/Total de trabajadores (funcionarios y contratistas)*100","Gestión","Efectividad","Mensual",0.04,"Porcentaje","Matriz de accidentes de trabajo","Negativa","No","La meta está configurada como menor o igual a 4%.",2019,"Enero"]
["Prevenir los factores que afecten la salud y seguridad a fin de mejorar las condiciones del ambiente de trabajo","Gestión de Talento Humano","Gestionar el potencial del talento humano como factor estratégico, para contribuir con el desarrollo de la entidad en un ambiente seguro y saludable","Incidencia y prevalencia de enfermedades laborales",null,null," Prevalencia de la enfermedad laboral","(No. de casos de enfermedad laboral calificada/Total de funcionarios)*100","Gestión","Efectividad","Trimestral",0.02,"Porcentaje","Matriz de seguimiento de enfermedades laborales","Negativa","No","La meta está configurada como menor o igual a 2%.",2019,"Enero"]
["Prevenir los factores que afecten la salud y seguridad a fin de mejorar las condiciones del ambiente de trabajo","Gestión de Talento Humano","Gestionar el potencial del talento humano como factor estratégico, para contribuir con el desarrollo de la entidad en un ambiente seguro y saludable","Incidencia y prevalencia de enfermedades laborales",null,null,"Incidencia de la enfermedad laboral","(No. de casos nuevos de enfermedad laboral calificados/Total de funcionarios)*100","Gestión","Efectividad","Trimestral",0.01,"Porcentaje","Matriz de seguimiento de enfermedades laborales","Negativa","No","La meta está configurada como menor o igual a 1%.",2019,"Enero"]
["Mejorar continuamente los procesos del Sistema Integrado de Gestión","Gestión de Asuntos Locales","Desarrollar acciones a nivel local para promover la participación ciudadana, brindar acompañamiento a las alcaldías locales en temas misionales de la entidad y ofertar sus programas","Cumplimiento de los compromisos adquiridos por la entidad, en el marco de las instancias de participación locales",null,null,"Porcentaje de compromisos atendidos en el marco de las instancias de participación locales","(No. de compromisos atendidos en las instancias Consejo Local de Gobierno, Unidad de Apoyo Técnico y Comisión Local Intersectorial de Participación /Total de compromisos generados en las instancias Consejo Local de Gobierno, Unidad de Apoyo Técnico y Comisión Local Intersectorial de Participación)*100","Gestión","Eficacia","Trimestral",1,"Porcentaje","Matriz de seguimiento a compromisos derivados de instancias de participación locales","Positiva","No",null,2019,"Enero"]
["Mejorar continuamente los procesos del Sistema Integrado de Gestión","Gestión de Asuntos Locales","Desarrollar acciones a nivel local para promover la participación ciudadana, brindar acompañamiento a las alcaldías locales en temas misionales de la entidad y ofertar sus programas","Efectividad en la atención de la demanda de actividades recreodeportivas en las localidades de Bogotá",null,null,"Porcentaje de actividades recreativas programadas por asuntos locales","(No. de actividades recreativas programadas en la plataforma SIM por los gestores locales/Total de actividades recreativas solicitadas por Promoción de la Recreación)*100","Gestión","Eficacia","Mensual",1,"Porcentaje","Sistema de información misional - SIM\nCuadro de metas de actividades recreativas","Positiva","No",null,2019,"Enero"]
["Mejorar continuamente los procesos del Sistema Integrado de Gestión","Gestión de Asuntos Locales","Desarrollar acciones a nivel local para promover la participación ciudadana, brindar acompañamiento a las alcaldías locales en temas misionales de la entidad y ofertar sus programas","Efectividad en la atención de la demanda de actividades recreodeportivas en las localidades de Bogotá",null,null,"Porcentaje de beneficiarios inscritos por asuntos locales en actividades deportivas","(No. de beneficiarios inscritos en actividades deportivas por los gestores locales/Total de beneficiarios de actividades deportivas programados por Fomento al Deporte)*100","Gestión","Eficacia","Trimestral",1,"Porcentaje","Reporte de las distintas plataformas para inscripciones\nCuadro de metas de actividades deportivas","Positiva","No",null,2019,"Enero"]
["Mejorar continuamente los procesos del Sistema Integrado de Gestión","Gestión de Asuntos Locales","Desarrollar acciones a nivel local para promover la participación ciudadana, brindar acompañamiento a las alcaldías locales en temas misionales de la entidad y ofertar sus programas","Cumplimiento de lineamientos y criterios de elegibilidad y viabilidad de los proyectos de contratación",null,null,"Porcentaje de asistencias técnicas realizadas a los Fondos de Desarrollo Local","(No. de asistencias técnicas realizadas a los Fondos de Desarrollo Local/Total de asistencias técnicas programadas a los Fondos de Desarrollo Local en las cuatro líneas de inversión)*100","Gestión","Eficacia","Trimestral",1,"Porcentaje","Cronograma de asistencias técnicas a los Fondos de Desarrollo Local","Positiva","No",null,2019,"Enero"]
["Mejorar continuamente los procesos del Sistema Integrado de Gestión","Gestión de Asuntos Locales","Desarrollar acciones a nivel local para promover la participación ciudadana, brindar acompañamiento a las alcaldías locales en temas misionales de la entidad y ofertar sus programas","Ejecución de los proyectos con recursos de los fondos de desarrollo local, en concordancia con el concepto previo y favorable emitido por la entidad",null,null,"Porcentaje de proyectos viabilizados con seguimiento efectuado","(No. de proyectos contratados con seguimiento efectuado/Total de proyectos viabilizados con contratación por parte de los Fondos de Desarrollo Local)*100","Gestión","Eficacia","Trimestral",1,"Porcentaje","SECOP\nInforme de seguimiento a viabilidades","Positiva","No",null,2019,"Enero"]
["Mejorar continuamente los procesos del Sistema Integrado de Gestión","Control Disciplinario","Investigar conductas presuntamente disciplinables e imponer sanciones cuando haya lugar, tanto a servidores como a ex-servidores públicos de la entidad, con el fin de que éstos cumplan con sus deberes y funciones","Cumplimiento de los términos legales en las distintas etapas procesales",null,null,"Porcentaje de procesos disciplinarios resueltos de fondo","(No. de procesos disciplinarios decididos de fondo/Total de procesos disciplinarios activos)*100","Gestión","Eficacia","Semestral",0.6,"Porcentaje","Matriz de autos","Positiva","No",null,2019,"Enero"]
["Mejorar continuamente los procesos del Sistema Integrado de Gestión","Control Disciplinario","Investigar conductas presuntamente disciplinables e imponer sanciones cuando haya lugar, tanto a servidores como a ex-servidores públicos de la entidad, con el fin de que éstos cumplan con sus deberes y funciones","Garantía del debido proceso en las distintas etapas procesales",null,null,"Porcentaje de procesos disciplinarios sin nulidades decretadas","(No. de procesos disciplinarios sin nulidades decretadas/Total de procesos disciplinarios activos)*100 ","Gestión","Eficacia","Trimestral",1,"Porcentaje","Matriz de autos","Positiva","No",null,2019,"Enero"]
["Mejorar continuamente los procesos del Sistema Integrado de Gestión","Control Disciplinario","Investigar conductas presuntamente disciplinables e imponer sanciones cuando haya lugar, tanto a servidores como a ex-servidores públicos de la entidad, con el fin de que éstos cumplan con sus deberes y funciones","Cumplimiento de los términos legales en las distintas etapas procesales",null,null,"Porcentaje de procesos disciplinarios sin vencimiento de términos","(No. de procesos disciplinarios sin vencimiento de términos/Total de procesos disciplinarios activos)*100","Gestión","Calidad","Trimestral",1,"Porcentaje","Expediente del proceso disciplinario ","Positiva","No",null,2019,"Enero"]
["Mejorar continuamente los procesos del Sistema Integrado de Gestión","Administración y Mantenimiento de Parques y Escenarios","Ofrecer parques y escenarios del Sistema Distrital para el uso y disfrute de la comunidad general, gestionando la sostenibilidad física, social, ambiental y económica","Uso de parques y escenarios con motivación económica que generen recursos para el mantenimiento de los mismos",null,null,"Aprovechamiento económico de parques y/o escenarios","(Ingresos del mes + acumulado de los ingresos del mes anterior/Total presupuesto anual)*100","Gestión","Eficiencia","Mensual",1,"Porcentaje","Sistema de información SEVEN","Positiva","Si","La meta es anual con medición y análisis mensual.\n\nEn el análisis del indicador se presentará la desagregación del aprovechamiento económico por tipo de parque y/o escenario, expresado en ingresos y participación porcentual.",2019,"Enero",2387367,22044017,{"$f":"+T65/U65","v":0.10829999813554853},{"$f":"+V65/L65","v":0.10829999813554853}]
["Satisfacer las necesidades de los usuarios a través de la prestación de servicios eficientes, eficaces y efectivos","Administración y Mantenimiento de Parques y Escenarios","Ofrecer parques y escenarios del Sistema Distrital para el uso y disfrute de la comunidad general, gestionando la sostenibilidad física, social, ambiental y económica","Satisfacción de los usuarios con las actividades de mantenimiento preventivo y correctivo",null,null,"Satisfacción de los usuarios con las obras de mantenimiento de nuevas tendencias","(No. de usuarios satisfechos con las obras de mantenimiento realizadas/Total de usuarios de parques y escenarios encuestados para obras de mantenimiento de nuevas tendencias)*100","Gestión","Efectividad","Anual",0.9,"Porcentaje","Encuesta de satisfacción con las obras de mantenimiento de nuevas tendencias","Positiva","No","En el análisis del indicador se presentará el resultado desagregado por cada uno de los aspectos evaluados en la encuesta de satisfacción.",2019,"Enero"]
["Mejorar continuamente los procesos del Sistema Integrado de Gestión","Administración y Mantenimiento de Parques y Escenarios","Ofrecer parques y escenarios del Sistema Distrital para el uso y disfrute de la comunidad general, gestionando la sostenibilidad física, social, ambiental y económica","Oportunidad y cumplimiento en la generación de compromisos o acuerdos ciudadanos frente al uso y sostenibilidad de los parques administrados",null,null,"Porcentaje de cumplimiento en acuerdos de sostenibilidad social de parques","(No. de compromisos gestionados/Total de compromisos adquiridos mediante acuerdos ciudadanos en parques)*100","Gestión","Eficacia","Trimestral",1,"Porcentaje","Matriz de seguimiento a compromisos o acuerdos ciudadanos","Positiva","No",null,2019,"Enero"]
["Mejorar continuamente los procesos del Sistema Integrado de Gestión","Administración y Mantenimiento de Parques y Escenarios","Ofrecer parques y escenarios del Sistema Distrital para el uso y disfrute de la comunidad general, gestionando la sostenibilidad física, social, ambiental y económica","Disponibilidad de los equipamientos en parques y escenarios","Cumplimiento de las especificaciones técnicas en las actividades de mantenimiento preventivo y correctivo","Cobertura en el mantenimiento de parques y escenarios de acuerdo con la priorización","Porcentaje de avance en la ejecución de contratos de obras de mantenimiento o recuperación","(Porcentaje contrato 1 + Porcentaje contrato 2 +...+ Porcentaje contrato n)/Total de contratos de obras de mantenimiento o recuperación en ejecución\nDonde: \nPorcentaje contrato n = Avance físico ejecutado/Avance físico programado\nn = Número de contratos de obras de mantenimiento o recuperación en ejecución","Gestión","Eficacia","Bimestral",0.9,"Porcentaje","Informes mensuales de interventoría presentados según programación de los contratistas","Positiva","No",null,2019,"Enero"]
["Satisfacer las necesidades de los usuarios a través de la prestación de servicios eficientes, eficaces y efectivos","Diseño y Construcción de Parques y Escenarios","Ampliar y mejorar la infraestructura física recreativa y deportiva del Distrito Capital para el uso de la comunidad en general","Cumplimiento de requisitos técnicos, administrativos, financieros y jurídicos de los proyectos",null,null,"Satisfacción de los usuarios con las obras de construcción y/o adecuación entregadas","(No. de usuarios satisfechos con las obras de construcción y/o adecuación entregadas /Total de usuarios encuestados por proyecto)*100","Gestión","Efectividad","Anual",0.9,"Porcentaje","Resultados de la encuesta de satisfacción entregados por los contratistas de obra","Positiva","No","En el análisis del indicador se presentará el resultado desagregado por cada uno de los aspectos evaluados en la encuesta de satisfacción.",2019,"Enero"]
["Mejorar continuamente los procesos del Sistema Integrado de Gestión","Diseño y Construcción de Parques y Escenarios","Ampliar y mejorar la infraestructura física recreativa y deportiva del Distrito Capital para el uso de la comunidad en general","Oportunidad en el seguimiento y adopción de medidas durante el seguimiento de la estabilidad de la obra","Cumplimiento de especificaciones técnicas conforme a lo establecido en la etapa de construcción",null,"Porcentaje de fallas de calidad o estabilidad de obra atendidas en construcción y adecuación de parques y escenarios","(No. de fallas de calidad o estabilidad de obra atendidas/Total de fallas de calidad o estabilidad de obra detectadas o reportadas por terceros)*100\n\nAtendido = Se genera requerimiento al contratista para establecer compromisos de reparación.","Gestión","Eficacia","Trimestral",0.9,"Porcentaje","Actas de visita o reconocimiento de estabilidad de obra \nActa de compromiso de reparación constructiva\nProgramación de visita\nComunicación oficial- notificación de fallas visita de inspección por estabilidad \nActa de verificación de reparación constructiva","Positiva","No","En el análisis del indicador se presentará la desagregación por parque y escenario.",2019,"Enero"]
["Mejorar continuamente los procesos del Sistema Integrado de Gestión","Diseño y Construcción de Parques y Escenarios","Ampliar y mejorar la infraestructura física recreativa y deportiva del Distrito Capital para el uso de la comunidad en general","Cumplimiento de requisitos técnicos, administrativos, financieros y jurídicos de los proyectos","Oportunidad en el seguimiento y adopción de medidas durante la ejecución de las obras","Cumplimiento del alcance de las obras conforme a los estudios y diseños, especificaciones técnicas y normatividad vigente","Porcentaje de avance en la ejecución de obras de construcción y adecuación de parques y escenarios","((%Ejecutado Obra 1*Plazo de ejecución Obra 1)+(%Ejecutado Obra 2*Plazo de ejecución Obra 2) +...+ (%Ejecutado Obra n*Plazo de ejecución Obra n))/((%Programado Obra 1*Plazo de ejecución Obra 1)+(%Programado Obra 2*Plazo de ejecución Obra 2) +...+ (%Programado Obra n*Plazo de ejecución Obra n))\nDonde:\nn = Número de obras en ejecución","Gestión","Eficacia","Mensual",0.9,"Porcentaje","Informes mensuales de interventoría\n\nInformes mensuales de supervisión","Positiva","No","En el análisis del indicador se presentará la desagregación por parque y escenario.",2019,"Enero"]
["Mejorar continuamente los procesos del Sistema Integrado de Gestión","Diseño y Construcción de Parques y Escenarios","Ampliar y mejorar la infraestructura física recreativa y deportiva del Distrito Capital para el uso de la comunidad en general","\nCumplimiento de requisitos técnicos, administrativos, financieros y legales de los proyectos de estudios y diseños","Oportunidad en el seguimiento y adopción de medidas durante la ejecución de los proyectos de estudios y diseños","Cumplimiento del alcance de los proyectos de estudios y diseños conforme a las necesidades identificadas","Porcentaje de avance en la ejecución de proyectos de estudios y/o diseños de parques y escenarios","(Porcentaje proyecto 1 + Porcentaje proyecto 2 +...+ Porcentaje proyecto n)/Total de proyectos de estudios y/o diseños en ejecución\nDonde: \nPorcentaje proyecto n =(Avance ejecutado de estudios y/o diseños/Avance programado de estudios y/o diseños al corte según forma de pago)\nn = Número de proyectos de estudios y/o diseños en ejecución","Gestión","Eficacia","Mensual",0.9,"Porcentaje","Informes mensuales de interventoría\n\nInformes mensuales de supervisión","Positiva","No","En el análisis del indicador se presentará la desagregación por proyecto.",2019,"Enero"]
["Mejorar continuamente los procesos del Sistema Integrado de Gestión","Gestión Jurídica","Ejercer la defensa judicial y extrajudicial de la entidad y atender requerimientos jurídicos, para salvaguardar sus intereses y cumplir con los requisitos constitucionales y legales","Intervención oportuna en las distintas actuaciones judiciales y extrajudiciales en que sea parte la entidad","Oportunidad en el seguimiento a los procesos en los despachos e instancias judiciales",null,"Porcentaje de procesos judiciales y extrajudiciales atendidos dentro de los términos legales vigentes","(No. de procesos jurídicos atendidos dentro de los términos legales vigentes)/Total de procesos jurídicos notificados)*100","Gestión","Calidad","Trimestral",1,"Porcentaje","SIPROJ Web\nORFEO","Positiva","No","En el análisis del indicador se presentará la desagregación por procesos judiciales y extrajudiciales.",2019,"Enero"]
["Satisfacer las necesidades de los usuarios a través de la prestación de servicios eficientes, eficaces y efectivos","Gestión Jurídica","Ejercer la defensa judicial y extrajudicial de la entidad y atender requerimientos jurídicos, para salvaguardar sus intereses y cumplir con los requisitos constitucionales y legales","Cumplimiento de los requisitos establecidos para el reconocimiento deportivo y el aval de escuelas deportivas",null,null,"Satisfacción de los usuarios con el trámite de reconocimiento deportivo","(No. de usuarios satisfechos con el trámite de reconocimiento deportivo/Total de usuarios encuestados)*100","Gestión","Efectividad","Semestral",0.95,"Porcentaje","Encuesta de satisfacción de usuarios de reconocimiento deportivo","Positiva","No","En el análisis del indicador se presentarán los resultados desagregados por cada uno de los aspectos evaluados en la encuesta de satisfacción.",2019,"Enero"]
["Mejorar continuamente los procesos del Sistema Integrado de Gestión","Gestión Jurídica","Ejercer la defensa judicial y extrajudicial de la entidad y atender requerimientos jurídicos, para salvaguardar sus intereses y cumplir con los requisitos constitucionales y legales","Oportunidad en la respuesta del trámite de otorgamiento deportivo (45 días hábiles siguientes al cumplimiento de requisitos de otorgamiento deportivo)","Vigencia y aplicabilidad de la normatividad empleada para el reconocimiento deportivo y el aval de escuelas deportivas",null,"Porcentaje de trámites de reconocimiento deportivo atendidos dentro del término legal vigente","(No. de trámites de reconocimiento deportivo atendidos dentro del término legal vigente/Total de trámites de reconocimiento deportivo atendidos)*100 ","Gestión","Calidad","Trimestral",0.92,"Porcentaje","Matriz de control de reconocimiento deportivo","Positiva","No",null,2019,"Enero"]
["Mejorar continuamente los procesos del Sistema Integrado de Gestión","Gestión Jurídica","Ejercer la defensa judicial y extrajudicial de la entidad y atender requerimientos jurídicos, para salvaguardar sus intereses y cumplir con los requisitos constitucionales y legales","Oportunidad en la respuesta del trámite de aval de escuelas deportivas (58 días hábiles)","Vigencia y aplicabilidad de la normatividad empleada para el reconocimiento deportivo y el aval de escuelas deportivas",null,"Porcentaje de trámites de aval de escuelas deportivas atendidos dentro del término legal vigente","(No. de trámites de aval de escuelas deportivas atendidos dentro del término legal vigente/Total de trámites de aval de escuelas deportivas atendidos)*100","Gestión","Calidad","Trimestral",0.92,"Porcentaje","Matriz de control de aval de escuelas deportivas","Positiva","No",null,2019,"Enero"]
["Mejorar continuamente los procesos del Sistema Integrado de Gestión","Gestión Jurídica","Ejercer la defensa judicial y extrajudicial de la entidad y atender requerimientos jurídicos, para salvaguardar sus intereses y cumplir con los requisitos constitucionales y legales","Oportunidad en la respuesta a conceptos de proyectos de acuerdo con los tiempos establecidos","Suministro oportuno de la información de carácter técnico, de oportunidad y conveniencia del proyecto por parte de las dependencias y áreas de la entidad",null,"Porcentaje de solicitudes de concepto a proyectos de acuerdo, decreto o ley atendidas dentro del tiempo establecido","(No. de solicitudes de concepto a proyectos de acuerdo, decreto o ley atendidas dentro del tiempo establecido/Total de solicitudes de concepto a proyectos de acuerdo, decreto o ley recibidas)*100","Gestión","Calidad","Semestral",0.9,"Porcentaje","Matriz de seguimiento a solicitudes Congreso y Concejo","Positiva","No","En el análisis del indicador se presentará la desagregación por proyectos de acuerdo, decreto y ley.",2019,"Enero"]
["Mejorar continuamente los procesos del Sistema Integrado de Gestión","Gestión Jurídica","Ejercer la defensa judicial y extrajudicial de la entidad y atender requerimientos jurídicos, para salvaguardar sus intereses y cumplir con los requisitos constitucionales y legales","Recuperación de la cartera en mora",null,null,"Porcentaje de procesos de cobro de cartera efectuados","(No. de procesos con etapas de cobro efectuadas/Total de procesos de cobro remitidos con documentación completa)*100","Gestión","Eficacia","Cuatrimestral",1,"Porcentaje","Matriz de seguimiento cobro de cartera","Positiva","No","Los primeros cinco días hábiles de mayo se reportará el indicador con corte a 31 de diciembre del año anterior. \nLos primeros días de septiembre se reportará con corte 30 de abril de la vigencia.\nLos primeros días de enero se reportará con corte a 31 de agosto del año anterior.\nEn el análisis del indicador se presentará la desagregación por etapa (persuasivo y coactivo), así como también el porcentaje de recuperación de cartera.",2019,"Enero"]
["Mejorar continuamente los procesos del Sistema Integrado de Gestión","Gestión Jurídica","Ejercer la defensa judicial y extrajudicial de la entidad y atender requerimientos jurídicos, para salvaguardar sus intereses y cumplir con los requisitos constitucionales y legales","Intervención oportuna en las distintas actuaciones judiciales y extrajudiciales en que sea parte la entidad - tipos de daño en que se resulte demandado o condenado",null,null,"Índice de condenas adversas","(No. de condenas adversas/Total de procesos judiciales)*100","Gestión","Calidad","Semestral",0.08,"Porcentaje","Informe Siproj web mensual (procesos judiciales)","Negativa","No","El análisis del indicador debe evaluar dentro del comité de conciliación los procesos que cursen o hayan cursado en contra de la entidad, determinando causas generadoras de conflictos y los tipos de daño.",2019,"Enero"]
["Mejorar continuamente los procesos del Sistema Integrado de Gestión","Gestión de Comunicaciones","Dar a conocer interna y externamente las actividades, programas y obras que realiza la entidad, para generar apropiación y participación que contribuyan al posicionamiento de la imagen institucional","Exigencia de la solicitud de servicios para todos los procesos con la información completa y detallada de lo requerido","Veracidad de la información reportada por los solicitantes del servicio ",null,"Porcentaje de solicitudes de servicios de comunicaciones atendidas dentro de los tiempos establecidos","(No. de solicitudes de servicio atendidas dentro de los tiempos establecidos/Total de solicitudes de servicio de comunicaciones recibidas)*100","Gestión","Calidad","Trimestral",0.9,"Porcentaje","Consolidado de solicitudes de servicios de comunicaciones","Positiva","No",null,2019,"Enero"]
["Mejorar continuamente los procesos del Sistema Integrado de Gestión","Gestión de Comunicaciones","Dar a conocer interna y externamente las actividades, programas y obras que realiza la entidad, para generar apropiación y participación que contribuyan al posicionamiento de la imagen institucional","Relacionamiento con medios de comunicación","Análisis de los resultados obtenidos mediante el monitoreo de medios para facilitar la toma de decisiones",null,"Impacto de noticias publicadas en medios de comunicación","(No. de noticias positivas o neutras registradas/Total de noticias publicadas en medios de comunicación)*100","Gestión","Eficacia","Trimestral",1,"Porcentaje","Informes mensuales generados por la empresa contratada para realizar el monitoreo de medios","Positiva","No","En el análisis del indicador se presentará el resultado desagregado de noticias positivas y neutras, indicando los principales medios de comunicación.\nSe colocó una meta de 100%, mientras se levanta la línea base con la primera medición.",2019,"Enero"]
["Mejorar continuamente los procesos del Sistema Integrado de Gestión","Gestión de Comunicaciones","Dar a conocer interna y externamente las actividades, programas y obras que realiza la entidad, para generar apropiación y participación que contribuyan al posicionamiento de la imagen institucional","Seguimiento a los cambios en las condiciones de publicación en redes sociales y página web",null,null,"Tasa de variación en el alcance total de las publicaciones en redes sociales","((Alcance total de publicaciones en el trimestre actual - Alcance total de publicaciones en el trimestre anterior)/Alcance total de publicaciones en el trimestre anterior)*100\n\nDonde:\n\nAlcance total de las publicaciones = Total de usuarios que vieron las publicaciones de redes sociales","Gestión","Eficacia","Trimestral",0.2,"Porcentaje","Métricas nativas de cada red social","Positiva","No","En el análisis del indicador se presentará el resultado desagregado del alcance de las publicaciones por cada red social. ",2019,"Enero"]
["Mejorar continuamente los procesos del Sistema Integrado de Gestión","Gestión de Comunicaciones","Dar a conocer interna y externamente las actividades, programas y obras que realiza la entidad, para generar apropiación y participación que contribuyan al posicionamiento de la imagen institucional","Análisis de los resultados obtenidos mediante el monitoreo de medios para facilitar la toma de decisiones",null,null,"Salidas publicadas en medios de comunicación","N/A","Gestión","Eficacia","Mensual",80,"Número","Informes mensuales generados por la empresa contratada para realizar el monitoreo de medios","Positiva","No","En el análisis del indicador se presentará el valor estimado de las publicaciones en medios de comunicación.",2019,"Enero"]
["Mejorar continuamente los procesos del Sistema Integrado de Gestión","Planeación de la Gestión","Establecer directrices para formular y realizar seguimiento a la planeación estratégica y operativa de la entidad con el propósito de contribuir al desarrollo de la misión y objetivos institucionales, así como facilitar la oportunidad y cumplimiento de los resultados esperados","Oportunidad, veracidad y calidad de la información de inversión y gestión",null,null,"Porcentaje de reportes de información presentados dentro de los tiempos programados","(No. de reportes de información elaborados y presentados/Total de reportes de información programados)*100","Gestión","Calidad","Trimestral",1,"Porcentaje","Cronograma de trabajo interno, plan operativo por dependencias (Oficina Asesora de Planeación), plan de adecuación y sostenibilidad SIGD-MIPG","Positiva","No","En el análisis del indicador se desagregará la programación para cada trimestre.",2019,"Febrero"]
["Mejorar continuamente los procesos del Sistema Integrado de Gestión","Planeación de la Gestión","Establecer directrices para formular y realizar seguimiento a la planeación estratégica y operativa de la entidad con el propósito de contribuir al desarrollo de la misión y objetivos institucionales, así como facilitar la oportunidad y cumplimiento de los resultados esperados","Oportunidad en el seguimiento de las acciones institucionales para la mejora (correcciones, acciones correctivas, oportunidades de mejora, acciones para abordar riesgos)",null,null,"Porcentaje de acciones de mejora con seguimiento efectuado dentro del Sistema de Gestión","[No. de acciones de mejora con seguimiento efectuado dentro del tiempo programado/Total de acciones de mejora abiertas dentro del Sistema de Gestión de la Calidad (correcciones, acciones correctivas, oportunidades de mejora, acciones para abordar riesgos)]*100","Gestión","Eficacia","Mensual",1,"Porcentaje","Isolución","Positiva","No","En el análisis del indicador se presentará el resultado desagregado por cada tipología de mejora (corrección, acciones correctivas, oportunidades de mejora, acciones para abordar riesgos).",2019,"Febrero"]
["Mejorar continuamente los procesos del Sistema Integrado de Gestión","Gestión de Recursos Físicos","Administrar y controlar los bienes muebles y servicios para el funcionamiento administrativo de la entidad","Oportunidad en la atención de requerimientos y necesidades de servicios administrativos",null,null,"Porcentaje de mantenimientos realizados a la infraestructura física de la sede administrativa","(No. de mantenimientos realizados a la infraestructura física/Total de mantenimientos programados a la infraestructura física de la sede administrativa)*100","Gestión","Eficacia","Trimestral",0.9,"Porcentaje","Expendientes contractuales en plataforma ORFEO","Positiva","No",null,2019,"Febrero"]
["Mejorar continuamente los procesos del Sistema Integrado de Gestión","Gestión de Asuntos Locales","Desarrollar acciones a nivel local para promover la participación ciudadana, brindar acompañamiento a las alcaldías locales en temas misionales de la entidad y ofertar sus programas","Oportunidad en la emisión del concepto previo y favorable según los tiempos establecidos en la normatividad vigente",null,null,"Porcentaje de conceptos previos tramitados dentro de los términos legales vigentes","(No. de conceptos previos tramitados dentro de los términos legales vigentes/Total de solicitudes de conceptos previos recibidas)*100","Gestión","Calidad","Trimestral",0.5,"Porcentaje","Matriz de seguimiento a conceptos previos tramitados","Positiva","No",null,2019,"Febrero"]
["Mejorar continuamente los procesos del Sistema Integrado de Gestión","Control, Evaluación y Seguimiento","Evaluar los controles y la gestión de la entidad con el fin de identificar e implementar acciones de mejora, en pro de la sostenibilidad del Sistema de Control Interno","Pertinencia y oportunidad en la entrega de los resultados del seguimiento a las partes interesadas","Oportunidad y calidad en la información reportada a las entidades competentes del orden nacional y distrital",null,"Porcentaje de informes presentados por la tercera línea de defensa dentro de los tiempos programados","(No. de informes de ley y de gestión elaborados y presentados dentro de los tiempos programados/Total de informes de ley y de gestión a cargo de la tercera línea de defensa )*100  ","Gestión","Calidad","Trimestral",1,"Porcentaje","Plan anual de auditoría\nCronograma presentación de informes","Positiva","No","En el análisis del indicador se presentará el resultado desagregado por cada uno de los informes realizados.",2019,"Febrero"]
["Mejorar continuamente los procesos del Sistema Integrado de Gestión","Control, Evaluación y Seguimiento","Evaluar los controles y la gestión de la entidad con el fin de identificar e implementar acciones de mejora, en pro de la sostenibilidad del Sistema de Control Interno","Cumplimiento de los objetivos definidos en el plan de auditoría conforme al plan de pruebas","Cobertura de las unidades a auditar de acuerdo con los parámetros establecidos en la matriz de priorización, en concordancia con los recursos disponibles para la ejecución del Plan Anual de Auditoría",null,"Índice de eficacia de auditorías internas de control interno","(Índice auditoría 1 + índice auditoría 2 +...+Índice auditoría n)/Total de auditorías realizadas\nDonde: \nÍndice auditoría n = Calificación porcentual de la variable Objetivos Específicos*Peso de la variable Objetivos Específicos + Calificación porcentual de la variable Actividad Plan de Auditoría*Peso de la variable Actividad Plan de Auditoría + Calificación porcentual de la variable Oportunidad*Peso de la variable Oportunidad\nPesos de las variables:\nObjetivos Específicos = 40%\nActividades Plan de Auditoría = 30%\nOportunidad = 30%. Esta se medirá tomando como fecha de referencia la de emisión del informe preliminar de auditoría.\nn = número de auditorías realizadas","Gestión","Eficacia","Trimestral",0.85,"Porcentaje","Planes de cada una de las auditorías","Positiva","No","En el análisis del indicador se presentará el resultado desagregado por cada una de las auditorías realizadas.",2019,"Febrero"]
["Mejorar continuamente los procesos del Sistema Integrado de Gestión","Gestión Financiera","Administrar los recursos financieros asignados y realizar los respectivos registros, para el cumplimiento de las funciones de la entidad y pago de sus obligaciones con terceros","Oportunidad en el seguimiento de las partidas pendientes por conciliar",null,null,"Porcentaje de partidas conciliatorias identificadas dentro del tiempo establecido","(No. de partidas conciliatorias identificadas con edad inferior a 60 días/Total de partidas reportadas)*100","Gestión","Calidad","Mensual",0.9,"Porcentaje","Sistema de información SEVEN","Positiva","No",null,2019,"Febrero"]
["Mejorar continuamente los procesos del Sistema Integrado de Gestión","Gestión Financiera","Administrar los recursos financieros asignados y realizar los respectivos registros, para el cumplimiento de las funciones de la entidad y pago de sus obligaciones con terceros","Oportunidad e integridad de la información necesaria para realizar las diferentes conciliaciones",null,null,"Porcentaje de obligaciones contingentes registradas correctamente en la contabilidad","(No. de procesos registrados correctamente en la contabilidad/Total de procesos reportados en SIPROJ Web)*100","Gestión","Calidad","Trimestral",1,"Porcentaje","Sistema de información SEVEN","Positiva","No",null,2019,"Febrero"]
["Mejorar continuamente los procesos del Sistema Integrado de Gestión","Gestión Financiera","Administrar los recursos financieros asignados y realizar los respectivos registros, para el cumplimiento de las funciones de la entidad y pago de sus obligaciones con terceros","Oportunidad en la presentación de informes y estados financieros a los diferentes entes de vigilancia y control",null,null,"Porcentaje de notas a los estados financieros reveladas correctamente","(No. de notas sin observaciones por parte de los órganos de control internos y externos/Total de notas a los estados financieros elaboradas)*100","Gestión","Calidad","Anual",0.95,"Porcentaje","Informes de entes de control y vigilancia","Positiva","No",null,2019,"Febrero"]
["Mejorar continuamente los procesos del Sistema Integrado de Gestión","Gestión Financiera","Administrar los recursos financieros asignados y realizar los respectivos registros, para el cumplimiento de las funciones de la entidad y pago de sus obligaciones con terceros","Oportunidad en la presentación de informes y estados financieros a los diferentes entes de vigilancia y control","Oportunidad en la presentación de las declaraciones tributarias",null,"Porcentaje de informes financieros presentados a los entes de vigilancia y control dentro de los términos legales vigentes","(No. de informes financieros presentados dentro de los términos legales vigentes/Total de informes financieros a reportar a los entes de vigilancia y control)*100","Gestión","Calidad","Trimestral",1,"Porcentaje","Matriz de seguimiento a la presentación de informes ","Positiva","No",null,2019,"Febrero"]
["Satisfacer las necesidades de los usuarios a través de la prestación de servicios eficientes, eficaces y efectivos","Promoción de la Recreación","Desarrollar actividades recreativas en función de las características y necesidades de la población de Bogotá D.C., para promover el aprovechamiento del tiempo libre y el mejoramiento en la calidad de vida","Satisfacción del usuario con las actividades recreativas realizadas",null,null,"Satisfacción de los usuarios con los eventos y/o programas recreativos","(No. de usuarios satisfechos con los eventos y/o programas recreativos/Total de usuarios de eventos y/o programas recreativos encuestados)*100","Gestión","Efectividad","Anual",1,"Porcentaje","Encuesta de satisfacción sobre eventos y/o programas recreativos","Positiva","No","En el análisis del indicador se presentará el resultado desagregado por programa y por cada uno de los aspectos evaluados en la encuesta de satisfacción.\nSe colocó una meta de 100%, mientras se levanta la línea base con la primera medición.",2019,"Febrero"]
["Mejorar continuamente los procesos del Sistema Integrado de Gestión","Promoción de la Recreación","Desarrollar actividades recreativas en función de las características y necesidades de la población de Bogotá D.C., para promover el aprovechamiento del tiempo libre y el mejoramiento en la calidad de vida","Cumplimiento del programa de actividades recreativas, teniendo en cuenta lo establecido en las fichas técnicas o según lo concertado con la comunidad e instituciones",null,null,"Porcentaje de actividades recreativas que cumplen con los requisitos para su ejecución","(No. de actividades recreativas que cumplen con los requisitos definidos para su ejecución/Total de actividades recreativas realizadas)*100","Gestión","Eficacia","Trimestral",0.97,"Porcentaje","Sistema de información misional - SIM","Positiva","No","En el análisis del indicador se presentará el resultado desagregado por programa y por actividad.",2019,"Febrero"]
["Satisfacer las necesidades de los usuarios a través de la prestación de servicios eficientes, eficaces y efectivos","Fomento al Deporte","Desarrollar e implementar programas deportivos y de actividad física, para contribuir con el mejoramiento de la calidad de vida en la población de Bogotá D.C.","Satisfacción del usuario con las actividades deportivas  realizadas",null,null,"Satisfacción de los usuarios con las actividades realizadas en los programas deportivos","(No. de usuarios satisfechos con las actividades deportivas realizadas/Total de usuarios de actividades deportivas encuestados)*100","Gestión","Efectividad","Anual",1,"Porcentaje","Encuesta de satisfacción sobre actividades/programas deportivos","Positiva","No","En el análisis del indicador se presentará el resultado desagregado por programa y por cada uno de los aspectos evaluados en la encuesta de satisfacción.\nSe colocó una meta de 100%, mientras se levanta la línea base con la primera medición.",2019,"Febrero"]
["Mejorar continuamente los procesos del Sistema Integrado de Gestión","Fomento al Deporte","Desarrollar e implementar programas deportivos y de actividad física, para contribuir con el mejoramiento de la calidad de vida en la población de Bogotá D.C.","Cambios comportamentales como resultados de los programas deportivos y de actividad física",null,null,"Cambio comportamental frente a la actividad física y el deporte","(No. de beneficiarios con percepción de cambio comportamental alrededor de las 4 dimensiones de la alfabetización física/Total de beneficiarios de programas deportivos y de actividad física seleccionados en la muestra)*100","Gestión","Efectividad","Anual",1,"Porcentaje","Encuesta para medir las 4 dimensiones de la alfabetización física","Positiva","No","La metodología se aplicará sobre una muestra por cada por cada programa. Se define en 4 tipos de mediciones:\n1. Medición dimensión competencia física. Aplicar test de resistencia, fuerza de torso, habilidades y flexibilidad.\n2. Medición dimensiones: competencia cognitiva, comportamental y motivacional a través de un cuestionario (on-line o presencial).\nSe colocó una meta de 100%, mientras se levanta la línea base con la primera medición.",2019,"Febrero"]
["Satisfacer las necesidades de los usuarios a través de la prestación de servicios eficientes, eficaces y efectivos","Servicio a la Ciudadanía","Brindar información y atender los requerimientos de los grupos de valor y de interés de la entidad para responder a sus necesidades en cumplimiento de sus derechos","Oportunidad y calidad en la respuesta a los requerimientos de los grupos de valor e interés de la entidad","Satisfacción del ciudadano frente a las respuestas a sus requerimientos",null,"Satisfacción de peticionarios con la respuesta dada a sus requerimientos","(No. de peticionarios satisfechos con la respuesta dada a sus peticiones, quejas, reclamos y sugerencias/Total de peticionarios contactados)*100","Gestión","Efectividad","Mensual",0.8,"Porcentaje","Base de datos de gestión de PQRS","Positiva","No",null,2019,"Febrero",19,23,{"$f":"+T98/U98","v":0.82608695652173914},{"$f":"+V98/L98","v":1.0326086956521738},{"$f":"_xlfn.IFS(W98<=69%,\"Crítico\",W98>=90%,\"Aceptable\",W98>=70%,\"Tolerable\")","v":"Aceptable"}]
["Mejorar continuamente los procesos del Sistema Integrado de Gestión","Gestión de Recursos Físicos","Administrar y controlar los bienes muebles y servicios para el funcionamiento administrativo de la entidad","Oportunidad en la atención de requerimientos y necesidades de servicios administrativos",null,null,"Porcentaje de requerimientos de mantenimiento correctivo atendidos en la sede administrativa dentro de los tiempos establecidos","(No. de requerimientos de mantenimiento correctivo atendidos dentro de los tiempos establecidos/Total de requerimientos de mantenimiento correctivo reportados en la sede administrativa)*100","Gestión","Calidad","Trimestral",0.95,"Porcentaje","Aplicativo mesa de ayuda OTRS","Positiva","No",null,2019,"Febrero"]
["Mejorar continuamente los procesos del Sistema Integrado de Gestión","Adquisición de Bienes y Servicios","Realizar actividades contractuales para adquirir bienes y servicios con la oportunidad y de acuerdo con las especificaciones establecidas por la entidad","Cumplimiento de requisitos de acuerdo con la modalidad de selección",null,null,"Porcentaje de procesos de selección publicados dentro del tiempo establecido","(No. de actos de apertura de procesos de selección publicados en un tiempo menor o igual a 30 días hábiles después de la radicación/Total de actos de apertura expedidos)*100","Gestión","Calidad","Trimestral",0.9,"Porcentaje","Plataforma ORFEO y SECOP","Positiva","No","En el análisis del indicador se presentará el resultado desagregado para licitación pública, concurso de méritos y selección abreviada.",2019,"Febrero"]
["Mejorar continuamente los procesos del Sistema Integrado de Gestión","Adquisición de Bienes y Servicios","Realizar actividades contractuales para adquirir bienes y servicios con la oportunidad y de acuerdo con las especificaciones establecidas por la entidad","Oportunidad en la suscripción y legalización del contrato",null,null,"Porcentaje de contratos legalizados dentro del tiempo establecido","(No. de contratos legalizados en un tiempo menor o igual a 10 días hábiles a partir del acto administrativo de adjudicación/Total de procesos de selección adjudicados)*100","Gestión","Calidad","Mensual",0.8,"Porcentaje","SECOP y Plataforma ORFEO ","Positiva","No","En el análisis del indicador se presentará el resultado desagregado para licitación pública, concurso de méritos y selección abreviada.",2019,"Febrero"]
["Mejorar continuamente los procesos del Sistema Integrado de Gestión","Adquisición de Bienes y Servicios","Realizar actividades contractuales para adquirir bienes y servicios con la oportunidad y de acuerdo con las especificaciones establecidas por la entidad","Definición clara y precisa de requisitos técnicos, financieros, económicos, jurídicos y de riesgos de acuerdo con el bien o servicio a adquirir",null,null,"Porcentaje de procesos de obra tramitados en análisis de costos dentro del tiempo establecido","(No. de procesos de obra (todas las Subdirecciones) tramitados en oportunidad al recibo del memorando con la solicitud estudio del sector (20 días)/Total de procesos de obra recibidos)*100","Gestión","Calidad","Trimestral",1,"Porcentaje","Matriz de tráfico ACEE","Positiva","No",null,2019,"Febrero"]
["Mejorar continuamente los procesos del Sistema Integrado de Gestión","Adquisición de Bienes y Servicios","Realizar actividades contractuales para adquirir bienes y servicios con la oportunidad y de acuerdo con las especificaciones establecidas por la entidad","Definición clara y precisa de requisitos técnicos, financieros, económicos, jurídicos y de riesgos de acuerdo con el bien o servicio a adquirir",null,null,"Porcentaje de procesos diferentes a obra tramitados en análisis de costos dentro del tiempo establecido","(No. de procesos diferentes a obra tramitados en oportunidad al recibo del memorando con la solicitud estudio del sector (10 días hábiles)/Total de procesos recibidos diferentes a obra)*100","Gestión","Calidad","Trimestral",0.9,"Porcentaje","Matriz de tráfico ACEE","Positiva","No","En el análisis del indicador se presentará el resultado desagregado para procesos diferentes a obra.",2019,"Febrero"]
["Mejorar continuamente los procesos del Sistema Integrado de Gestión","Adquisición de Bienes y Servicios","Realizar actividades contractuales para adquirir bienes y servicios con la oportunidad y de acuerdo con las especificaciones establecidas por la entidad","Definición clara y precisa de requisitos técnicos, financieros, económicos, jurídicos y de riesgos de acuerdo con el bien o servicio a adquirir",null,null,"Porcentaje de procesos requeridos por precios artificialmente bajos","(No. de procesos (excepto Subastas SAS) requeridos por precios artificialmente bajos/Total de procesos evaluados)*100","Gestión","Calidad","Trimestral",0.15,"Porcentaje","Evaluación económica de los proponentes\n\nAnálisis de precios realizado por la ACEE","Negativa","No","En el análisis del indicador se presentará el resultado desagregado por tipo de proceso.",2019,"Febrero"]
["Mejorar continuamente los procesos del Sistema Integrado de Gestión","Control, Evaluación y Seguimiento","Evaluar los controles y la gestión de la entidad con el fin de identificar e implementar acciones de mejora, en pro de la sostenibilidad del Sistema de Control Interno","Pertinencia y oportunidad en la entrega de los resultados del seguimiento a las partes interesadas",null,null,"Porcentaje de acciones de mejoramiento interno con seguimiento efectuado","(No. de acciones de mejoramiento interno con seguimiento efectuado)/Total de acciones de mejoramiento interno abiertas de auditorías internas de control interno)*100","Gestión","Eficacia","Trimestral",1,"Porcentaje","Plataforma Isolución","Positiva","No","En el análisis del indicador se presentará el resultado desagregado por proceso.",2019,"Febrero"]
["Mejorar continuamente los procesos del Sistema Integrado de Gestión","Control, Evaluación y Seguimiento","Evaluar los controles y la gestión de la entidad con el fin de identificar e implementar acciones de mejora, en pro de la sostenibilidad del Sistema de Control Interno","Pertinencia y oportunidad en la entrega de los resultados del seguimiento a las partes interesadas",null,null,"Porcentaje de acciones de mejoramiento externo con seguimiento efectuado","(No. de acciones de mejoramiento externo con seguimiento efectuado)/Total de acciones de mejoramiento externo abiertas de auditorías externas)*100","Gestión","Eficacia","Trimestral",1,"Porcentaje","Matrices de consolidación del estado de las acciones de los diferentes entes de control y vigilancia","Positiva","No","En el análisis del indicador se presentará el resultado desagregado por auditoría externa.",2019,"Febrero"]
["Mejorar continuamente los procesos del Sistema Integrado de Gestión","Gestión Financiera","Administrar los recursos financieros asignados y realizar los respectivos registros, para el cumplimiento de las funciones de la entidad y pago de sus obligaciones con terceros","Oportunidad en la expedición de los certificados presupuestales y en la presentación de los informes de ejecución",null,null,"Porcentaje de ejecución presupuestal en gastos de funcionamiento","(Presupuesto de funcionamiento ejecutado/Presupuesto disponible de funcionamiento)*100","Gestión","Eficiencia","Mensual",0.95,"Porcentaje","Ejecución presupuestal en SEVEN","Positiva","Si","La meta es anual con medición y análisis mensual.\nLa medición está a cargo del Área Financiera y el análisis a cargo de la Subdirección Administrativa y Financiera.\nLa medición y el análisis se deben realizar a más tardar el quinto día hábil de cada mes.\nUna vez se realice el Comité Financiero, el Área Financiera debe enviar a la Oficina Asesora de Planeación la presentación correspondiente, con el análisis respectivo en cuanto al desempeño del indicador.",2019,"Febrero"]
["Mejorar continuamente los procesos del Sistema Integrado de Gestión","Gestión Financiera","Administrar los recursos financieros asignados y realizar los respectivos registros, para el cumplimiento de las funciones de la entidad y pago de sus obligaciones con terceros","Oportunidad en la expedición de los certificados presupuestales y en la presentación de los informes de ejecución","Oportunidad en la autorización de giro de los recursos de transferencia",null,"Porcentaje de ejecución presupuestal en gastos de inversión","(Presupuesto de inversión ejecutado/Presupuesto disponible de inversión)*100","Gestión","Eficiencia","Mensual",1,"Porcentaje","Ejecución presupuestal en SEVEN","Positiva","Si","La meta es anual con medición y análisis mensual.\nLa medición está a cargo del Área Financiera y el análisis a cargo de los Ordenadores del Gasto.\nLa medición y el análisis se deben realizar a más tardar el quinto día hábil de cada mes.\nUna vez se realice el Comité Financiero, el Área Financiera debe enviar a la Oficina Asesora de Planeación la presentación correspondiente, con el análisis respectivo en cuanto al desempeño del indicador.",2019,"Febrero"]
["Mejorar continuamente los procesos del Sistema Integrado de Gestión","Gestión Financiera","Administrar los recursos financieros asignados y realizar los respectivos registros, para el cumplimiento de las funciones de la entidad y pago de sus obligaciones con terceros","Oportunidad en el pago de las obligaciones financieras de la entidad",null,null,"Porcentaje de ejecución del programa anual de caja","(Recursos ejecutados de reserva, vigencia y pasivos exigibles/Recursos programados de reserva, vigencia y pasivos exigibles)*100","Gestión","Eficiencia","Mensual",1,"Porcentaje","Sistema de información SEVEN","Positiva","Si","La meta es anual con medición y análisis mensual.\nLa medición está a cargo del Área Financiera y el análisis a cargo de los Ordenadores del Gasto.\nLa medición y el análisis se deben realizar a más tardar el quinto día hábil de cada mes.\nUna vez se realice el Comité Financiero, el Área Financiera debe enviar a la Oficina Asesora de Planeación la presentación correspondiente, con el análisis respectivo en cuanto al desempeño del indicador.",2019,"Febrero"]
["Mejorar continuamente los procesos del Sistema Integrado de Gestión","Gestión Financiera","Administrar los recursos financieros asignados y realizar los respectivos registros, para el cumplimiento de las funciones de la entidad y pago de sus obligaciones con terceros","Oportunidad en el pago de las obligaciones financieras de la entidad","Oportunidad en la causación de ordenes de pago que cumplan con todos los requisitos establecidos","Oportunidad y veracidad de la información necesaria para la causación de las ordenes de pago reportada por los ordenadores del gasto","Porcentaje de cuentas individuales pagadas dentro del tiempo establecido","(No. de cuentas individuales pagadas en un tiempo menor o igual a 6 días/Total de cuentas de pago individuales tramitadas)*100 ","Gestión","Calidad","Mensual",1,"Porcentaje","Bitácora de cuentas en SEVEN","Positiva","No","La medición y el análisis están a cargo del Área Financiera.\nEn el análisis del indicador se presentará el resultado del tiempo promedio en cada una de las etapas para el pago, según la bitácora de cuentas de SEVEN.",2019,"Febrero",249,249,{"$f":"+T110/U110","v":1},{"$f":"+V110/L110","v":1},{"$f":"_xlfn.IFS(W110<=69%,\"Crítico\",W110>=90%,\"Aceptable\",W110>=70%,\"Tolerable\")","v":"Aceptable"}]
["Mejorar continuamente los procesos del Sistema Integrado de Gestión","Gestión Financiera","Administrar los recursos financieros asignados y realizar los respectivos registros, para el cumplimiento de las funciones de la entidad y pago de sus obligaciones con terceros","Oportunidad en el pago de las obligaciones financieras de la entidad","Oportunidad en la causación de ordenes de pago que cumplan con todos los requisitos establecidos","Oportunidad y veracidad de la información necesaria para la causación de las ordenes de pago reportada por los ordenadores del gasto","Porcentaje de cuentas colectivas pagadas dentro del tiempo establecido","(No. de cuentas colectivas pagadas en un tiempo menor o igual a 10 días/Total de cuentas de pago colectivas tramitadas)*100","Gestión","Calidad","Mensual",1,"Porcentaje","Bitácora de cuentas en SEVEN","Positiva","No","La medición y el análisis están a cargo del Área Financiera.\nEn el análisis del indicador se debe presentar el resultado del tiempo promedio en cada una de las etapas para el pago, según la bitácora de cuentas de SEVEN.",2019,"Febrero",57,57,1,1,{"$f":"_xlfn.IFS(W111<=69%,\"Crítico\",W111>=90%,\"Aceptable\",W111>=70%,\"Tolerable\")","v":"Aceptable"}]
["Implementar las políticas y líneas de acción para la preservación e integridad de la documentación","Gestión Documental","Administrar, conservar y custodiar la documentación generada en la entidad, desde su origen hasta su disposición final, para preservar la memoria institucional","Actualización del inventario documental en el Formato Único de Inventario Documental, con base en la aplicación de las tablas de retención documental","Cumplimiento de los tiempos de retención documental establecidos en las tablas","Actualización de los instrumentos archivísticos","Porcentaje de inventario validado del fondo documental acumulado del archivo central","(No. de metros lineales de inventario validado en cuanto a series, subseries, asuntos y oficinas productoras/Total de metros lineales de archivo inventariado en estado natural del archivo central)*100 ","Gestión","Eficacia","Mensual",1,"Porcentaje","Matriz de seguimiento a inventario documental","Positiva","Si","La meta es anual con medición y análisis mensual",2019,"Febrero"]
["Implementar las políticas y líneas de acción para la preservación e integridad de la documentación","Gestión Documental","Administrar, conservar y custodiar la documentación generada en la entidad, desde su origen hasta su disposición final, para preservar la memoria institucional","Oportunidad en las transferencias documentales de acuerdo con los tiempos de retención establecidos en las tablas",null,null,"Porcentaje de transferencias primarias realizadas de acuerdo con los tiempos de retención","(No. de transferencias primarias realizadas de acuerdo con los tiempos de retención establecidos en las TRD/Total de transferencias documentales programadas)*100","Gestión","Eficacia","Mensual",0.8,"Porcentaje","Matriz de seguimiento a transferencias documentales","Positiva","Si","La meta es anual con medición y análisis mensual",2019,"Febrero"]
["Implementar las políticas y líneas de acción para la preservación e integridad de la documentación","Gestión Documental","Administrar, conservar y custodiar la documentación generada en la entidad, desde su origen hasta su disposición final, para preservar la memoria institucional","Cumplimiento de los estándares de temperatura, humedad relativa y luminosidad de los espacios de almacenamiento de material documental, dentro de los rangos establecidos en la normatividad vigente",null,null,"Porcentaje de espacios controlados para la conservación documental","(No. de espacios monitoreados e intervenidos/Total de espacios monitoreados)*100","Gestión","Eficacia","Mensual",1,"Porcentaje","Informe de monitoreo de espacios controlados","Positiva","No","La medición es mes vencido",2019,"Febrero"]
["Mejorar continuamente los procesos del Sistema Integrado de Gestión","Servicio a la Ciudadanía","Brindar información y atender los requerimientos de los grupos de valor y de interés de la entidad para responder a sus necesidades en cumplimiento de sus derechos","Oportunidad y calidad en la respuesta a los requerimientos de los grupos de valor e interés de la entidad",null,null,"Porcentaje de peticiones, quejas, reclamos y sugerencias contestadas dentro de los términos legales vigentes","(No. de peticiones, quejas, reclamos y sugerencias contestadas en el aplicativo SDQS dentro de los términos legales vigentes/Total de peticiones, quejas, reclamos y sugerencias recibidas)*100","Gestión","Calidad","Mensual",1,"Porcentaje","Sistema SDQS","Positiva","No","La medición es mes vencido",2019,"Febrero",249,270,0.92222222222222228,0.92222222222222228,{"$f":"_xlfn.IFS(W115<=69%,\"Crítico\",W115>=90%,\"Aceptable\",W115>=70%,\"Tolerable\")","v":"Aceptable"}]
["Satisfacer las necesidades de los usuarios a través de la prestación de servicios eficientes, eficaces y efectivos","Servicio a la Ciudadanía","Brindar información y atender los requerimientos de los grupos de valor y de interés de la entidad para responder a sus necesidades en cumplimiento de sus derechos","Satisfacción del ciudadano frente a la atención brindada por la entidad",null,null,"Satisfacción del ciudadano con la atención recibida en los SUPERCADE","(No. de ciudadanos satisfechos con la atención recibida en los SUPERCADE/Total de ciudadanos atendidos en los SUPERCADE)*100","Gestión","Efectividad","Mensual",0.95,"Porcentaje","Encuesta de satisfacción con la atención brindada en SUPERCADES","Positiva","No",null,2019,"Febrero",1986,1986,1,1.0526315789473684,"Aceptable"]
["Mejorar continuamente los procesos del Sistema Integrado de Gestión","Servicio a la Ciudadanía","Brindar información y atender los requerimientos de los grupos de valor y de interés de la entidad para responder a sus necesidades en cumplimiento de sus derechos","Oportunidad en la actualización de la información publicada en la sección de ley de transparencia en la página web de la entidad",null,null,"Porcentaje de información actualizada en ley de transparencia","(No. de subcategorías con información actualizada en la página web/Total de subcategorías definidas en ley de transparencia)*100","Gestión","Eficacia","Trimestral",1,"Porcentaje","Página web","Positiva","No",null,2019,"Febrero"]
["Mejorar continuamente los procesos del Sistema Integrado de Gestión","Servicio a la Ciudadanía","Brindar información y atender los requerimientos de los grupos de valor y de interés de la entidad para responder a sus necesidades en cumplimiento de sus derechos","Coherencia, claridad, solución de fondo, calidez y manejo del sistema en relación con los requerimientos atendidos por la entidad",null,null,"Porcentaje de requerimientos atendidos con oportunidad y calidad","(No. de respuestas a requerimientos sin observaciones en cuanto a los criterios de oportunidad y calidad/Total de requerimientos evaluados en el aplicativo SDQS)*100","Gestión","Eficacia","Mensual",0.8,"Porcentaje","SDQS y base de datos de gestión de PQRS","Positiva","No","La medición es mes vencido",2019,"Febrero",157,202,0.77722772277227725,0.97153465346534651,"Aceptable"]
["Implementar buenas prácticas ambientales para la prevención de la contaminación en el marco de una Bogotá que defiende lo público en su función administrativa y de desarrollo institucional","Gestión de Recursos Físicos","Administrar y controlar los bienes muebles y servicios para el funcionamiento administrativo de la entidad","Calificación de la implementación del Plan Institucional de Gestión Ambiental, por parte de la Secretaría Distrital de Ambiente","Oportunidad en el reporte de formularios y registros electrónicos del PIGA ante la Secretaría Distrital de Ambiente",null,"Índice de implementación del PIGA","Promedio ponderado de cumplimiento de aspectos normativos y de implementación del PIGA, según auditoría realizada por la Secretaría Distrital de Ambiente en cada vigencia","Gestión","Eficacia","Anual",0.7,"Porcentaje","Informe de auditoría anual realizada por la Secretaría Distrital de Ambiente","Positiva","No","En el análisis del indicador se presentará el resultado desagregado por cada uno de los aspectos evaluados en la visita de control y seguimiento por parte de la Secretaría Distrital de Ambiente.\nLa meta está configurada como mayor a 70%.",2019,"Febrero"]
["Proteger la integridad, confidencialidad y disponibilidad de la información","Gestión de Tecnología de la Información y las Comunicaciones","Proporcionar soluciones estratégicas de tecnologías de la información y las comunicaciones, para contribuir con la eficiencia administrativa, la mejora de los trámites y servicios y la protección de los activos de información de la entidad","Impacto del plan de remediación frente a las vulnerabilidades identificadas","Aseguramiento de incidencias en la seguridad de la información que afecten la confidencialidad, integridad y disponibilidad",null,"Porcentaje de remediación de vulnerabilidades de seguridad de la información","(No. de vulnerabilidades críticas o altas remediadas/Total de vulnerabilidades de seguridad de la información detectadas como críticas o altas)*100 ","Gestión","Eficacia","Anual",0.7,"Porcentaje","Matriz de vulnerabilidades","Positiva","No","La meta está configurada como mínimo 70%.",2019,"Febrero"]
["Proteger la integridad, confidencialidad y disponibilidad de la información","Gestión de Tecnología de la Información y las Comunicaciones","Proporcionar soluciones estratégicas de tecnologías de la información y las comunicaciones, para contribuir con la eficiencia administrativa, la mejora de los trámites y servicios y la protección de los activos de información de la entidad","Avances en la implementación de gobierno digital de acuerdo con los componentes evaluados por MINTIC",null,null,"Índice de implementación de gobierno digital","Sumatoria de la calificación obtenida por cada componente/Total de componentes de la política de gobierno digital","Gestión","Eficacia","Anual",0.65,"Porcentaje","Instrumento de medición suministrado para el seguimiento a la política de gobierno digital  ","Positiva","No","En el análisis del indicador se presentará el resultado desagregado de las calificaciones obtenidas en cada componente de la política de seguridad digital.",2019,"Febrero"]
["Mejorar continuamente los procesos del Sistema Integrado de Gestión","Gestión de Tecnología de la Información y las Comunicaciones","Proporcionar soluciones estratégicas de tecnologías de la información y las comunicaciones, para contribuir con la eficiencia administrativa, la mejora de los trámites y servicios y la protección de los activos de información de la entidad","Cumplimiento del Plan Estratégico de Tecnologías de la Información PETI",null,null,"Porcentaje de avance en proyectos de TI","(No. de hitos en proyectos de TI alcanzados/Total de hitos en proyectos de TI programados en la vigencia)*100","Gestión","Eficacia","Semestral",1,"Porcentaje","Cronograma de proyectos del PETI","Positiva","Si","La meta es anual con medición y análisis semestral.",2019,"Febrero"]
["Proteger la integridad, confidencialidad y disponibilidad de la información","Gestión de Tecnología de la Información y las Comunicaciones","Proporcionar soluciones estratégicas de tecnologías de la información y las comunicaciones, para contribuir con la eficiencia administrativa, la mejora de los trámites y servicios y la protección de los activos de información de la entidad","Disponibilidad de los sistemas de información de la entidad",null,null,"Porcentaje de disponibilidad de los sistemas de información","(No. de horas disponibles de los sistemas de información/Total de horas en servicio de los sistemas de información)*100","Gestión","Eficiencia","Mensual",0.9,"Porcentaje","Herramienta de monitoreo ZABBIX","Positiva","No","En el análisis del indidicador se presentará el resultado desagregado de disponibilidad en ORFEO, SEVEN, KACTUS y SIM.\nLa meta está configurada como mayor o igual a 90%.",2019,"Febrero"]
["Mejorar continuamente los procesos del Sistema Integrado de Gestión","Gestión de Tecnología de la Información y las Comunicaciones","Proporcionar soluciones estratégicas de tecnologías de la información y las comunicaciones, para contribuir con la eficiencia administrativa, la mejora de los trámites y servicios y la protección de los activos de información de la entidad","Disponibilidad de los servicios de comunicaciones en la entidad, según los acuerdos de niveles de servicios establecidos",null,null,"Porcentaje de disponibilidad de los servicios de comunicaciones","(No. de horas disponibles de los servicios de comunicaciones /Total de horas de los servicios de comunicaciones)*100","Gestión","Eficiencia","Mensual",0.9,"Porcentaje","Herramienta de monitoreo ZABBIX","Positiva","No","En el análisis del indidicador se presentará el resultado desagregado de disponibilidad en Internet y Telefonía IP.\nLa meta está configurada como mayor o igual a 90%.",2019,"Febrero"]
["Mejorar continuamente los procesos del Sistema Integrado de Gestión","Gestión de Tecnología de la Información y las Comunicaciones","Proporcionar soluciones estratégicas de tecnologías de la información y las comunicaciones, para contribuir con la eficiencia administrativa, la mejora de los trámites y servicios y la protección de los activos de información de la entidad","Incidencias reportadas en el funcionamiento del módulo o sistema de información implementado","Cumplimiento de los acuerdos de niveles de servicios establecidos",null,"Porcentaje de solicitudes de servicio tecnológico atendidas dentro de los tiempos establecidos","(No. de solicitudes atendidas dentro de los tiempos establecidos en los acuerdos de nivel de servicio/Total de solicitudes de servicio tecnológico recibidas)*100","Gestión","Calidad","Mensual",0.9,"Porcentaje","Herramienta GLPI","Positiva","No",null,2019,"Febrero",1561,1587,0.98361688720856966,1.0929076524539663,{"$f":"_xlfn.IFS(W125<=69%,\"Crítico\",W125>=90%,\"Aceptable\",W125>=70%,\"Tolerable\")","v":"Aceptable"}]
["Mejorar continuamente los procesos del Sistema Integrado de Gestión","Gestión de Talento Humano","Gestionar el potencial del talento humano como factor estratégico, para contribuir con el desarrollo de la entidad en un ambiente seguro y saludable","Cumplimiento de compromisos y competencias del servidor público en el desempeño laboral","Oportunidad en el seguimiento y la evaluación anual u ordinaria del servidor público para continuar su permanencia en el servicio",null,"Índice de desempeño laboral de funcionarios","(Sumatoria de calificaciones finales de la evaluación de desempeño de los funcionarios/Total de funcionarios evaluados)*100","Gestión","Eficacia","Anual",0.9,"Porcentaje","Consolidado de las calificaciones finales de la evaluación de desempeño","Positiva","No","En el análisis del indicador se presentará el resultado desagregado por niveles jerárquicos y comparar con la evaluación de las áreas.\nLa meta está configurada como mayor a 90%.\nNota: Se mide para vigencia 2018-2019.",2019,"Febrero"]
["Mejorar continuamente los procesos del Sistema Integrado de Gestión","Gestión de Talento Humano","Gestionar el potencial del talento humano como factor estratégico, para contribuir con el desarrollo de la entidad en un ambiente seguro y saludable","Cobertura de servidores públicos en las actividades del plan de bienestar e incentivos",null,null,"Porcentaje de funcionarios que participan en las actividades del plan de bienestar e incentivos","(No. de funcionarios participantes en las actividades del plan de bienestar e incentivos/Total de funcionarios de la entidad)*100 ","Gestión","Eficacia","Semestral",0.8,"Porcentaje","Registros de asistencia a las actividades del plan de bienestar","Positiva","No",null,2019,"Febrero"]
["Mejorar continuamente los procesos del Sistema Integrado de Gestión","Gestión de Talento Humano","Gestionar el potencial del talento humano como factor estratégico, para contribuir con el desarrollo de la entidad en un ambiente seguro y saludable","Cobertura de servidores públicos en las actividades del plan institucional de capacitación",null,null,"Porcentaje de funcionarios que asisten a las actividades del plan institucional de capacitación","(No. de funcionarios asistentes a las actividades del plan institucional de capacitación/Total de funcionarios citados a las actividades del plan institucional de capacitación)*100","Gestión","Eficacia","Semestral",0.8,"Porcentaje","Registros de asistencia a las actividades del plan de capacitación","Positiva","No","Las capacitaciones que se incluyen en el indicador son las que implican recursos.",2019,"Febrero"]
["Mejorar continuamente los procesos del Sistema Integrado de Gestión","Gestión de Talento Humano","Gestionar el potencial del talento humano como factor estratégico, para contribuir con el desarrollo de la entidad en un ambiente seguro y saludable","Evaluación del impacto de la capacitación en el desempeño de los servidores públicos y de la entidad",null,null,"Impacto de la capacitación en el desempeño laboral de funcionarios","(No. de funcionarios con capacitaciones efectivas/Total de funcionarios evaluados)*100","Gestión","Eficacia","Trimestral",0.95,"Porcentaje","Consolidado de las evaluaciones de impacto de la capacitación","Positiva","No",null,2019,"Febrero"]
["Mejorar continuamente los procesos del Sistema Integrado de Gestión","Gestión de Talento Humano","Gestionar el potencial del talento humano como factor estratégico, para contribuir con el desarrollo de la entidad en un ambiente seguro y saludable","Satisfacción de los servidores públicos frente a las actividades de  bienestar e incentivos","Satisfacción de los servidores públicos frente a las actividades de capacitación",null,"Índice de clima organizacional","Promedio ponderado de las dimensiones evaluadas en la encuesta de medición de clima organizacional","Gestión","Eficacia","Anual",0.8,"Porcentaje","Informe de medición de clima organizacional","Positiva","No","En el análisis del indicador se presentará el resultado desagregado por áreas y/o dependencias, y por las dimensiones evaluadas.",2019,"Febrero"]
["Mejorar continuamente los procesos del Sistema Integrado de Gestión","Gestión de Talento Humano","Gestionar el potencial del talento humano como factor estratégico, para contribuir con el desarrollo de la entidad en un ambiente seguro y saludable","Cumplimiento del plan anual de  bienestar e incentivos",null,null,"Porcentaje de ejecución del plan anual de bienestar e incentivos","(No. de actividades de bienestar e incentivos desarrolladas/Total de actividades programadas en el plan anual de bienestar e incentivos)*100","Gestión","Eficacia","Semestral",1,"Porcentaje","Matriz de seguimiento a la ejecución de actividades de bienestar e incentivos","Positiva","Si","La meta es anual con medición y análisis semestral.",2019,"Febrero"]
["Mejorar continuamente los procesos del Sistema Integrado de Gestión","Gestión de Talento Humano","Gestionar el potencial del talento humano como factor estratégico, para contribuir con el desarrollo de la entidad en un ambiente seguro y saludable","Cumplimiento del plan institucional de capacitación",null,null,"Porcentaje de ejecución del plan institucional de capacitación","(No. de actividades de capacitación desarrolladas/Total de actividades programadas en el plan institucional de capacitación)*100","Gestión","Eficacia","Semestral",1,"Porcentaje","Matriz de seguimiento a la ejecución de actividades de capacitación","Positiva","Si","La meta es anual con medición y análisis semestral.",2019,"Febrero"]
["Prevenir los factores que afecten la salud y seguridad a fin de mejorar las condiciones del ambiente de trabajo","Gestión de Talento Humano","Gestionar el potencial del talento humano como factor estratégico, para contribuir con el desarrollo de la entidad en un ambiente seguro y saludable","Cumplimiento del plan anual de trabajo",null,null,"Porcentaje de ejecución del plan anual de seguridad y salud en el trabajo","(No. de actividades de seguridad y salud desarrolladas/Total de actividades programadas en el plan anual de seguridad y salud en el trabajo)*100","Gestión","Eficacia","Mensual",0.95,"Porcentaje","Plan de trabajo anual del Sistema de Gestión de Seguridad y Salud en el Trabajo","Positiva","No",null,2019,"Febrero"]
["Prevenir los factores que afecten la salud y seguridad a fin de mejorar las condiciones del ambiente de trabajo","Gestión de Talento Humano","Gestionar el potencial del talento humano como factor estratégico, para contribuir con el desarrollo de la entidad en un ambiente seguro y saludable","Tasa de accidentalidad",null,null,"Tasa de accidentalidad","(No. de accidentes de trabajo reportados/Total de trabajadores (funcionarios y contratistas)*100","Gestión","Efectividad","Mensual",0.04,"Porcentaje","Matriz de accidentes de trabajo","Negativa","No","La meta está configurada como menor o igual a 4%.",2019,"Febrero"]
["Prevenir los factores que afecten la salud y seguridad a fin de mejorar las condiciones del ambiente de trabajo","Gestión de Talento Humano","Gestionar el potencial del talento humano como factor estratégico, para contribuir con el desarrollo de la entidad en un ambiente seguro y saludable","Incidencia y prevalencia de enfermedades laborales",null,null," Prevalencia de la enfermedad laboral","(No. de casos de enfermedad laboral calificada/Total de funcionarios)*100","Gestión","Efectividad","Trimestral",0.02,"Porcentaje","Matriz de seguimiento de enfermedades laborales","Negativa","No","La meta está configurada como menor o igual a 2%.",2019,"Febrero"]
["Prevenir los factores que afecten la salud y seguridad a fin de mejorar las condiciones del ambiente de trabajo","Gestión de Talento Humano","Gestionar el potencial del talento humano como factor estratégico, para contribuir con el desarrollo de la entidad en un ambiente seguro y saludable","Incidencia y prevalencia de enfermedades laborales",null,null,"Incidencia de la enfermedad laboral","(No. de casos nuevos de enfermedad laboral calificados/Total de funcionarios)*100","Gestión","Efectividad","Trimestral",0.01,"Porcentaje","Matriz de seguimiento de enfermedades laborales","Negativa","No","La meta está configurada como menor o igual a 1%.",2019,"Febrero"]
["Mejorar continuamente los procesos del Sistema Integrado de Gestión","Gestión de Recursos Físicos","Administrar y controlar los bienes muebles y servicios para el funcionamiento administrativo de la entidad","Confiabilidad del inventario de bienes devolutivos",null,null,"Porcentaje de inventario individual validado físicamente","(No. de elementos devolutivos del inventario individual validados físicamente/Total de elementos devolutivos del inventario individual registrados en el sistema de información SEVEN)*100 ","Gestión","Eficacia","Anual",1,"Porcentaje","Sistema de información SEVEN","Positiva","No",null,2019,"Febrero"]
["Mejorar continuamente los procesos del Sistema Integrado de Gestión","Gestión de Recursos Físicos","Administrar y controlar los bienes muebles y servicios para el funcionamiento administrativo de la entidad","Confiabilidad del inventario de bienes devolutivos",null,null,"Porcentaje de inventario aleatorio validado físicamente en bodega","(No. de elementos devolutivos y de consumo en bodegas validados físicamente/Muestra de inventario de elementos devolutivos y de consumo registrados en el sistema de información SEVEN)*100 ","Gestión","Eficacia","Trimestral",1,"Porcentaje","Sistema de información SEVEN","Positiva","No",null,2019,"Febrero"]
["Mejorar continuamente los procesos del Sistema Integrado de Gestión","Gestión de Asuntos Locales","Desarrollar acciones a nivel local para promover la participación ciudadana, brindar acompañamiento a las alcaldías locales en temas misionales de la entidad y ofertar sus programas","Cumplimiento de los compromisos adquiridos por la entidad, en el marco de las instancias de participación locales",null,null,"Porcentaje de compromisos atendidos en el marco de las instancias de participación locales","(No. de compromisos atendidos en las instancias Consejo Local de Gobierno, Unidad de Apoyo Técnico y Comisión Local Intersectorial de Participación /Total de compromisos generados en las instancias Consejo Local de Gobierno, Unidad de Apoyo Técnico y Comisión Local Intersectorial de Participación)*100","Gestión","Eficacia","Trimestral",1,"Porcentaje","Matriz de seguimiento a compromisos derivados de instancias de participación locales","Positiva","No",null,2019,"Febrero"]
["Mejorar continuamente los procesos del Sistema Integrado de Gestión","Gestión de Asuntos Locales","Desarrollar acciones a nivel local para promover la participación ciudadana, brindar acompañamiento a las alcaldías locales en temas misionales de la entidad y ofertar sus programas","Efectividad en la atención de la demanda de actividades recreodeportivas en las localidades de Bogotá",null,null,"Porcentaje de actividades recreativas programadas por asuntos locales","(No. de actividades recreativas programadas en la plataforma SIM por los gestores locales/Total de actividades recreativas solicitadas por Promoción de la Recreación)*100","Gestión","Eficacia","Mensual",1,"Porcentaje","Sistema de información misional - SIM\nCuadro de metas de actividades recreativas","Positiva","No",null,2019,"Febrero"]
["Mejorar continuamente los procesos del Sistema Integrado de Gestión","Gestión de Asuntos Locales","Desarrollar acciones a nivel local para promover la participación ciudadana, brindar acompañamiento a las alcaldías locales en temas misionales de la entidad y ofertar sus programas","Efectividad en la atención de la demanda de actividades recreodeportivas en las localidades de Bogotá",null,null,"Porcentaje de beneficiarios inscritos por asuntos locales en actividades deportivas","(No. de beneficiarios inscritos en actividades deportivas por los gestores locales/Total de beneficiarios de actividades deportivas programados por Fomento al Deporte)*100","Gestión","Eficacia","Trimestral",1,"Porcentaje","Reporte de las distintas plataformas para inscripciones\nCuadro de metas de actividades deportivas","Positiva","No",null,2019,"Febrero"]
["Mejorar continuamente los procesos del Sistema Integrado de Gestión","Gestión de Asuntos Locales","Desarrollar acciones a nivel local para promover la participación ciudadana, brindar acompañamiento a las alcaldías locales en temas misionales de la entidad y ofertar sus programas","Cumplimiento de lineamientos y criterios de elegibilidad y viabilidad de los proyectos de contratación",null,null,"Porcentaje de asistencias técnicas realizadas a los Fondos de Desarrollo Local","(No. de asistencias técnicas realizadas a los Fondos de Desarrollo Local/Total de asistencias técnicas programadas a los Fondos de Desarrollo Local en las cuatro líneas de inversión)*100","Gestión","Eficacia","Trimestral",1,"Porcentaje","Cronograma de asistencias técnicas a los Fondos de Desarrollo Local","Positiva","No",null,2019,"Febrero"]
["Mejorar continuamente los procesos del Sistema Integrado de Gestión","Gestión de Asuntos Locales","Desarrollar acciones a nivel local para promover la participación ciudadana, brindar acompañamiento a las alcaldías locales en temas misionales de la entidad y ofertar sus programas","Ejecución de los proyectos con recursos de los fondos de desarrollo local, en concordancia con el concepto previo y favorable emitido por la entidad",null,null,"Porcentaje de proyectos viabilizados con seguimiento efectuado","(No. de proyectos contratados con seguimiento efectuado/Total de proyectos viabilizados con contratación por parte de los Fondos de Desarrollo Local)*100","Gestión","Eficacia","Trimestral",1,"Porcentaje","SECOP\nInforme de seguimiento a viabilidades","Positiva","No",null,2019,"Febrero"]
["Mejorar continuamente los procesos del Sistema Integrado de Gestión","Control Disciplinario","Investigar conductas presuntamente disciplinables e imponer sanciones cuando haya lugar, tanto a servidores como a ex-servidores públicos de la entidad, con el fin de que éstos cumplan con sus deberes y funciones","Cumplimiento de los términos legales en las distintas etapas procesales",null,null,"Porcentaje de procesos disciplinarios resueltos de fondo","(No. de procesos disciplinarios decididos de fondo/Total de procesos disciplinarios activos)*100","Gestión","Eficacia","Semestral",0.6,"Porcentaje","Matriz de autos","Positiva","No",null,2019,"Febrero"]
["Mejorar continuamente los procesos del Sistema Integrado de Gestión","Control Disciplinario","Investigar conductas presuntamente disciplinables e imponer sanciones cuando haya lugar, tanto a servidores como a ex-servidores públicos de la entidad, con el fin de que éstos cumplan con sus deberes y funciones","Garantía del debido proceso en las distintas etapas procesales",null,null,"Porcentaje de procesos disciplinarios sin nulidades decretadas","(No. de procesos disciplinarios sin nulidades decretadas/Total de procesos disciplinarios activos)*100 ","Gestión","Eficacia","Trimestral",1,"Porcentaje","Matriz de autos","Positiva","No",null,2019,"Febrero"]
["Mejorar continuamente los procesos del Sistema Integrado de Gestión","Control Disciplinario","Investigar conductas presuntamente disciplinables e imponer sanciones cuando haya lugar, tanto a servidores como a ex-servidores públicos de la entidad, con el fin de que éstos cumplan con sus deberes y funciones","Cumplimiento de los términos legales en las distintas etapas procesales",null,null,"Porcentaje de procesos disciplinarios sin vencimiento de términos","(No. de procesos disciplinarios sin vencimiento de términos/Total de procesos disciplinarios activos)*100","Gestión","Calidad","Trimestral",1,"Porcentaje","Expediente del proceso disciplinario ","Positiva","No",null,2019,"Febrero"]
["Mejorar continuamente los procesos del Sistema Integrado de Gestión","Administración y Mantenimiento de Parques y Escenarios","Ofrecer parques y escenarios del Sistema Distrital para el uso y disfrute de la comunidad general, gestionando la sostenibilidad física, social, ambiental y económica","Uso de parques y escenarios con motivación económica que generen recursos para el mantenimiento de los mismos",null,null,"Aprovechamiento económico de parques y/o escenarios","(Ingresos del mes + acumulado de los ingresos del mes anterior/Total presupuesto anual)*100","Gestión","Eficiencia","Mensual",1,"Porcentaje","Sistema de información SEVEN","Positiva","Si","La meta es anual con medición y análisis mensual.\n\nEn el análisis del indicador se presentará la desagregación del aprovechamiento económico por tipo de parque y/o escenario, expresado en ingresos y participación porcentual.",2019,"Febrero",4687561,22044017,{"$f":"+T147/U147","v":0.21264549923001783},{"$f":"+V147/L147","v":0.21264549923001783}]
["Satisfacer las necesidades de los usuarios a través de la prestación de servicios eficientes, eficaces y efectivos","Administración y Mantenimiento de Parques y Escenarios","Ofrecer parques y escenarios del Sistema Distrital para el uso y disfrute de la comunidad general, gestionando la sostenibilidad física, social, ambiental y económica","Satisfacción de los usuarios con las actividades de mantenimiento preventivo y correctivo",null,null,"Satisfacción de los usuarios con las obras de mantenimiento de nuevas tendencias","(No. de usuarios satisfechos con las obras de mantenimiento realizadas/Total de usuarios de parques y escenarios encuestados para obras de mantenimiento de nuevas tendencias)*100","Gestión","Efectividad","Anual",0.9,"Porcentaje","Encuesta de satisfacción con las obras de mantenimiento de nuevas tendencias","Positiva","No","En el análisis del indicador se presentará el resultado desagregado por cada uno de los aspectos evaluados en la encuesta de satisfacción.",2019,"Febrero"]
["Mejorar continuamente los procesos del Sistema Integrado de Gestión","Administración y Mantenimiento de Parques y Escenarios","Ofrecer parques y escenarios del Sistema Distrital para el uso y disfrute de la comunidad general, gestionando la sostenibilidad física, social, ambiental y económica","Oportunidad y cumplimiento en la generación de compromisos o acuerdos ciudadanos frente al uso y sostenibilidad de los parques administrados",null,null,"Porcentaje de cumplimiento en acuerdos de sostenibilidad social de parques","(No. de compromisos gestionados/Total de compromisos adquiridos mediante acuerdos ciudadanos en parques)*100","Gestión","Eficacia","Trimestral",1,"Porcentaje","Matriz de seguimiento a compromisos o acuerdos ciudadanos","Positiva","No",null,2019,"Febrero"]
["Mejorar continuamente los procesos del Sistema Integrado de Gestión","Administración y Mantenimiento de Parques y Escenarios","Ofrecer parques y escenarios del Sistema Distrital para el uso y disfrute de la comunidad general, gestionando la sostenibilidad física, social, ambiental y económica","Disponibilidad de los equipamientos en parques y escenarios","Cumplimiento de las especificaciones técnicas en las actividades de mantenimiento preventivo y correctivo","Cobertura en el mantenimiento de parques y escenarios de acuerdo con la priorización","Porcentaje de avance en la ejecución de contratos de obras de mantenimiento o recuperación","(Porcentaje contrato 1 + Porcentaje contrato 2 +...+ Porcentaje contrato n)/Total de contratos de obras de mantenimiento o recuperación en ejecución\nDonde: \nPorcentaje contrato n = Avance físico ejecutado/Avance físico programado\nn = Número de contratos de obras de mantenimiento o recuperación en ejecución","Gestión","Eficacia","Bimestral",0.9,"Porcentaje","Informes mensuales de interventoría presentados según programación de los contratistas","Positiva","No",null,2019,"Febrero"]
["Satisfacer las necesidades de los usuarios a través de la prestación de servicios eficientes, eficaces y efectivos","Diseño y Construcción de Parques y Escenarios","Ampliar y mejorar la infraestructura física recreativa y deportiva del Distrito Capital para el uso de la comunidad en general","Cumplimiento de requisitos técnicos, administrativos, financieros y jurídicos de los proyectos",null,null,"Satisfacción de los usuarios con las obras de construcción y/o adecuación entregadas","(No. de usuarios satisfechos con las obras de construcción y/o adecuación entregadas /Total de usuarios encuestados por proyecto)*100","Gestión","Efectividad","Anual",0.9,"Porcentaje","Resultados de la encuesta de satisfacción entregados por los contratistas de obra","Positiva","No","En el análisis del indicador se presentará el resultado desagregado por cada uno de los aspectos evaluados en la encuesta de satisfacción.",2019,"Febrero"]
["Mejorar continuamente los procesos del Sistema Integrado de Gestión","Diseño y Construcción de Parques y Escenarios","Ampliar y mejorar la infraestructura física recreativa y deportiva del Distrito Capital para el uso de la comunidad en general","Oportunidad en el seguimiento y adopción de medidas durante el seguimiento de la estabilidad de la obra","Cumplimiento de especificaciones técnicas conforme a lo establecido en la etapa de construcción",null,"Porcentaje de fallas de calidad o estabilidad de obra atendidas en construcción y adecuación de parques y escenarios","(No. de fallas de calidad o estabilidad de obra atendidas/Total de fallas de calidad o estabilidad de obra detectadas o reportadas por terceros)*100\n\nAtendido = Se genera requerimiento al contratista para establecer compromisos de reparación.","Gestión","Eficacia","Trimestral",0.9,"Porcentaje","Actas de visita o reconocimiento de estabilidad de obra \nActa de compromiso de reparación constructiva\nProgramación de visita\nComunicación oficial- notificación de fallas visita de inspección por estabilidad \nActa de verificación de reparación constructiva","Positiva","No","En el análisis del indicador se presentará la desagregación por parque y escenario.",2019,"Febrero"]
["Mejorar continuamente los procesos del Sistema Integrado de Gestión","Diseño y Construcción de Parques y Escenarios","Ampliar y mejorar la infraestructura física recreativa y deportiva del Distrito Capital para el uso de la comunidad en general","Cumplimiento de requisitos técnicos, administrativos, financieros y jurídicos de los proyectos","Oportunidad en el seguimiento y adopción de medidas durante la ejecución de las obras","Cumplimiento del alcance de las obras conforme a los estudios y diseños, especificaciones técnicas y normatividad vigente","Porcentaje de avance en la ejecución de obras de construcción y adecuación de parques y escenarios","((%Ejecutado Obra 1*Plazo de ejecución Obra 1)+(%Ejecutado Obra 2*Plazo de ejecución Obra 2) +...+ (%Ejecutado Obra n*Plazo de ejecución Obra n))/((%Programado Obra 1*Plazo de ejecución Obra 1)+(%Programado Obra 2*Plazo de ejecución Obra 2) +...+ (%Programado Obra n*Plazo de ejecución Obra n))\nDonde:\nn = Número de obras en ejecución","Gestión","Eficacia","Mensual",0.9,"Porcentaje","Informes mensuales de interventoría\n\nInformes mensuales de supervisión","Positiva","No","En el análisis del indicador se presentará la desagregación por parque y escenario.",2019,"Febrero"]
["Mejorar continuamente los procesos del Sistema Integrado de Gestión","Diseño y Construcción de Parques y Escenarios","Ampliar y mejorar la infraestructura física recreativa y deportiva del Distrito Capital para el uso de la comunidad en general","\nCumplimiento de requisitos técnicos, administrativos, financieros y legales de los proyectos de estudios y diseños","Oportunidad en el seguimiento y adopción de medidas durante la ejecución de los proyectos de estudios y diseños","Cumplimiento del alcance de los proyectos de estudios y diseños conforme a las necesidades identificadas","Porcentaje de avance en la ejecución de proyectos de estudios y/o diseños de parques y escenarios","(Porcentaje proyecto 1 + Porcentaje proyecto 2 +...+ Porcentaje proyecto n)/Total de proyectos de estudios y/o diseños en ejecución\nDonde: \nPorcentaje proyecto n =(Avance ejecutado de estudios y/o diseños/Avance programado de estudios y/o diseños al corte según forma de pago)\nn = Número de proyectos de estudios y/o diseños en ejecución","Gestión","Eficacia","Mensual",0.9,"Porcentaje","Informes mensuales de interventoría\n\nInformes mensuales de supervisión","Positiva","No","En el análisis del indicador se presentará la desagregación por proyecto.",2019,"Febrero"]
["Mejorar continuamente los procesos del Sistema Integrado de Gestión","Gestión Jurídica","Ejercer la defensa judicial y extrajudicial de la entidad y atender requerimientos jurídicos, para salvaguardar sus intereses y cumplir con los requisitos constitucionales y legales","Intervención oportuna en las distintas actuaciones judiciales y extrajudiciales en que sea parte la entidad","Oportunidad en el seguimiento a los procesos en los despachos e instancias judiciales",null,"Porcentaje de procesos judiciales y extrajudiciales atendidos dentro de los términos legales vigentes","(No. de procesos jurídicos atendidos dentro de los términos legales vigentes)/Total de procesos jurídicos notificados)*100","Gestión","Calidad","Trimestral",1,"Porcentaje","SIPROJ Web\nORFEO","Positiva","No","En el análisis del indicador se presentará la desagregación por procesos judiciales y extrajudiciales.",2019,"Febrero"]
["Satisfacer las necesidades de los usuarios a través de la prestación de servicios eficientes, eficaces y efectivos","Gestión Jurídica","Ejercer la defensa judicial y extrajudicial de la entidad y atender requerimientos jurídicos, para salvaguardar sus intereses y cumplir con los requisitos constitucionales y legales","Cumplimiento de los requisitos establecidos para el reconocimiento deportivo y el aval de escuelas deportivas",null,null,"Satisfacción de los usuarios con el trámite de reconocimiento deportivo","(No. de usuarios satisfechos con el trámite de reconocimiento deportivo/Total de usuarios encuestados)*100","Gestión","Efectividad","Semestral",0.95,"Porcentaje","Encuesta de satisfacción de usuarios de reconocimiento deportivo","Positiva","No","En el análisis del indicador se presentarán los resultados desagregados por cada uno de los aspectos evaluados en la encuesta de satisfacción.",2019,"Febrero"]
["Mejorar continuamente los procesos del Sistema Integrado de Gestión","Gestión Jurídica","Ejercer la defensa judicial y extrajudicial de la entidad y atender requerimientos jurídicos, para salvaguardar sus intereses y cumplir con los requisitos constitucionales y legales","Oportunidad en la respuesta del trámite de otorgamiento deportivo (45 días hábiles siguientes al cumplimiento de requisitos de otorgamiento deportivo)","Vigencia y aplicabilidad de la normatividad empleada para el reconocimiento deportivo y el aval de escuelas deportivas",null,"Porcentaje de trámites de reconocimiento deportivo atendidos dentro del término legal vigente","(No. de trámites de reconocimiento deportivo atendidos dentro del término legal vigente/Total de trámites de reconocimiento deportivo atendidos)*100 ","Gestión","Calidad","Trimestral",0.92,"Porcentaje","Matriz de control de reconocimiento deportivo","Positiva","No",null,2019,"Febrero"]
["Mejorar continuamente los procesos del Sistema Integrado de Gestión","Gestión Jurídica","Ejercer la defensa judicial y extrajudicial de la entidad y atender requerimientos jurídicos, para salvaguardar sus intereses y cumplir con los requisitos constitucionales y legales","Oportunidad en la respuesta del trámite de aval de escuelas deportivas (58 días hábiles)","Vigencia y aplicabilidad de la normatividad empleada para el reconocimiento deportivo y el aval de escuelas deportivas",null,"Porcentaje de trámites de aval de escuelas deportivas atendidos dentro del término legal vigente","(No. de trámites de aval de escuelas deportivas atendidos dentro del término legal vigente/Total de trámites de aval de escuelas deportivas atendidos)*100","Gestión","Calidad","Trimestral",0.92,"Porcentaje","Matriz de control de aval de escuelas deportivas","Positiva","No",null,2019,"Febrero"]
["Mejorar continuamente los procesos del Sistema Integrado de Gestión","Gestión Jurídica","Ejercer la defensa judicial y extrajudicial de la entidad y atender requerimientos jurídicos, para salvaguardar sus intereses y cumplir con los requisitos constitucionales y legales","Oportunidad en la respuesta a conceptos de proyectos de acuerdo con los tiempos establecidos","Suministro oportuno de la información de carácter técnico, de oportunidad y conveniencia del proyecto por parte de las dependencias y áreas de la entidad",null,"Porcentaje de solicitudes de concepto a proyectos de acuerdo, decreto o ley atendidas dentro del tiempo establecido","(No. de solicitudes de concepto a proyectos de acuerdo, decreto o ley atendidas dentro del tiempo establecido/Total de solicitudes de concepto a proyectos de acuerdo, decreto o ley recibidas)*100","Gestión","Calidad","Semestral",0.9,"Porcentaje","Matriz de seguimiento a solicitudes Congreso y Concejo","Positiva","No","En el análisis del indicador se presentará la desagregación por proyectos de acuerdo, decreto y ley.",2019,"Febrero"]
["Mejorar continuamente los procesos del Sistema Integrado de Gestión","Gestión Jurídica","Ejercer la defensa judicial y extrajudicial de la entidad y atender requerimientos jurídicos, para salvaguardar sus intereses y cumplir con los requisitos constitucionales y legales","Recuperación de la cartera en mora",null,null,"Porcentaje de procesos de cobro de cartera efectuados","(No. de procesos con etapas de cobro efectuadas/Total de procesos de cobro remitidos con documentación completa)*100","Gestión","Eficacia","Cuatrimestral",1,"Porcentaje","Matriz de seguimiento cobro de cartera","Positiva","No","Los primeros cinco días hábiles de mayo se reportará el indicador con corte a 31 de diciembre del año anterior. \nLos primeros días de septiembre se reportará con corte 30 de abril de la vigencia.\nLos primeros días de enero se reportará con corte a 31 de agosto del año anterior.\nEn el análisis del indicador se presentará la desagregación por etapa (persuasivo y coactivo), así como también el porcentaje de recuperación de cartera.",2019,"Febrero"]
["Mejorar continuamente los procesos del Sistema Integrado de Gestión","Gestión Jurídica","Ejercer la defensa judicial y extrajudicial de la entidad y atender requerimientos jurídicos, para salvaguardar sus intereses y cumplir con los requisitos constitucionales y legales","Intervención oportuna en las distintas actuaciones judiciales y extrajudiciales en que sea parte la entidad - tipos de daño en que se resulte demandado o condenado",null,null,"Índice de condenas adversas","(No. de condenas adversas/Total de procesos judiciales)*100","Gestión","Calidad","Semestral",0.08,"Porcentaje","Informe Siproj web mensual (procesos judiciales)","Negativa","No","El análisis del indicador debe evaluar dentro del comité de conciliación los procesos que cursen o hayan cursado en contra de la entidad, determinando causas generadoras de conflictos y los tipos de daño.",2019,"Febrero"]
["Mejorar continuamente los procesos del Sistema Integrado de Gestión","Gestión Jurídica","Ejercer la defensa judicial y extrajudicial de la entidad y atender requerimientos jurídicos, para salvaguardar sus intereses y cumplir con los requisitos constitucionales y legales","Intervención oportuna en las distintas actuaciones judiciales y extrajudiciales en que sea parte la entidad - tipos de daño en que se resulte demandado o condenado",null,null,"Índice de condenas adversas","(No. de condenas adversas/Total de procesos judiciales)*100","Gestión","Calidad","Semestral",0.08,"Porcentaje","Informe Siproj web mensual (procesos judiciales)","Negativa","No","El análisis del indicador debe evaluar dentro del comité de conciliación los procesos que cursen o hayan cursado en contra de la entidad, determinando causas generadoras de conflictos y los tipos de daño.",2019,"Marzo"]
["Mejorar continuamente los procesos del Sistema Integrado de Gestión","Gestión de Comunicaciones","Dar a conocer interna y externamente las actividades, programas y obras que realiza la entidad, para generar apropiación y participación que contribuyan al posicionamiento de la imagen institucional","Exigencia de la solicitud de servicios para todos los procesos con la información completa y detallada de lo requerido","Veracidad de la información reportada por los solicitantes del servicio ",null,"Porcentaje de solicitudes de servicios de comunicaciones atendidas dentro de los tiempos establecidos","(No. de solicitudes de servicio atendidas dentro de los tiempos establecidos/Total de solicitudes de servicio de comunicaciones recibidas)*100","Gestión","Calidad","Trimestral",0.9,"Porcentaje","Consolidado de solicitudes de servicios de comunicaciones","Positiva","No",null,2019,"Febrero"]
["Mejorar continuamente los procesos del Sistema Integrado de Gestión","Gestión de Comunicaciones","Dar a conocer interna y externamente las actividades, programas y obras que realiza la entidad, para generar apropiación y participación que contribuyan al posicionamiento de la imagen institucional","Relacionamiento con medios de comunicación","Análisis de los resultados obtenidos mediante el monitoreo de medios para facilitar la toma de decisiones",null,"Impacto de noticias publicadas en medios de comunicación","(No. de noticias positivas o neutras registradas/Total de noticias publicadas en medios de comunicación)*100","Gestión","Eficacia","Trimestral",1,"Porcentaje","Informes mensuales generados por la empresa contratada para realizar el monitoreo de medios","Positiva","No","En el análisis del indicador se presentará el resultado desagregado de noticias positivas y neutras, indicando los principales medios de comunicación.\nSe colocó una meta de 100%, mientras se levanta la línea base con la primera medición.",2019,"Febrero"]
["Mejorar continuamente los procesos del Sistema Integrado de Gestión","Gestión de Comunicaciones","Dar a conocer interna y externamente las actividades, programas y obras que realiza la entidad, para generar apropiación y participación que contribuyan al posicionamiento de la imagen institucional","Seguimiento a los cambios en las condiciones de publicación en redes sociales y página web",null,null,"Tasa de variación en el alcance total de las publicaciones en redes sociales","((Alcance total de publicaciones en el trimestre actual - Alcance total de publicaciones en el trimestre anterior)/Alcance total de publicaciones en el trimestre anterior)*100\n\nDonde:\n\nAlcance total de las publicaciones = Total de usuarios que vieron las publicaciones de redes sociales","Gestión","Eficacia","Trimestral",0.2,"Porcentaje","Métricas nativas de cada red social","Positiva","No","En el análisis del indicador se presentará el resultado desagregado del alcance de las publicaciones por cada red social. ",2019,"Febrero"]
["Mejorar continuamente los procesos del Sistema Integrado de Gestión","Gestión de Comunicaciones","Dar a conocer interna y externamente las actividades, programas y obras que realiza la entidad, para generar apropiación y participación que contribuyan al posicionamiento de la imagen institucional","Análisis de los resultados obtenidos mediante el monitoreo de medios para facilitar la toma de decisiones",null,null,"Salidas publicadas en medios de comunicación","N/A","Gestión","Eficacia","Mensual",80,"Número","Informes mensuales generados por la empresa contratada para realizar el monitoreo de medios","Positiva","No","En el análisis del indicador se presentará el valor estimado de las publicaciones en medios de comunicación.",2019,"Febrero"]
["Mejorar continuamente los procesos del Sistema Integrado de Gestión","Planeación de la Gestión","Establecer directrices para formular y realizar seguimiento a la planeación estratégica y operativa de la entidad con el propósito de contribuir al desarrollo de la misión y objetivos institucionales, así como facilitar la oportunidad y cumplimiento de los resultados esperados","Oportunidad, veracidad y calidad de la información de inversión y gestión",null,null,"Porcentaje de reportes de información presentados dentro de los tiempos programados","(No. de reportes de información elaborados y presentados/Total de reportes de información programados)*100","Gestión","Calidad","Trimestral",1,"Porcentaje","Cronograma de trabajo interno, plan operativo por dependencias (Oficina Asesora de Planeación), plan de adecuación y sostenibilidad SIGD-MIPG","Positiva","No","En el análisis del indicador se desagregará la programación para cada trimestre.",2019,"Marzo"]
["Mejorar continuamente los procesos del Sistema Integrado de Gestión","Planeación de la Gestión","Establecer directrices para formular y realizar seguimiento a la planeación estratégica y operativa de la entidad con el propósito de contribuir al desarrollo de la misión y objetivos institucionales, así como facilitar la oportunidad y cumplimiento de los resultados esperados","Oportunidad en el seguimiento de las acciones institucionales para la mejora (correcciones, acciones correctivas, oportunidades de mejora, acciones para abordar riesgos)",null,null,"Porcentaje de acciones de mejora con seguimiento efectuado dentro del Sistema de Gestión","[No. de acciones de mejora con seguimiento efectuado dentro del tiempo programado/Total de acciones de mejora abiertas dentro del Sistema de Gestión de la Calidad (correcciones, acciones correctivas, oportunidades de mejora, acciones para abordar riesgos)]*100","Gestión","Eficacia","Mensual",1,"Porcentaje","Isolución","Positiva","No","En el análisis del indicador se presentará el resultado desagregado por cada tipología de mejora (corrección, acciones correctivas, oportunidades de mejora, acciones para abordar riesgos).",2019,"Marzo"]
["Mejorar continuamente los procesos del Sistema Integrado de Gestión","Gestión de Recursos Físicos","Administrar y controlar los bienes muebles y servicios para el funcionamiento administrativo de la entidad","Oportunidad en la atención de requerimientos y necesidades de servicios administrativos",null,null,"Porcentaje de mantenimientos realizados a la infraestructura física de la sede administrativa","(No. de mantenimientos realizados a la infraestructura física/Total de mantenimientos programados a la infraestructura física de la sede administrativa)*100","Gestión","Eficacia","Trimestral",0.9,"Porcentaje","Expendientes contractuales en plataforma ORFEO","Positiva","No",null,2019,"Marzo"]
["Mejorar continuamente los procesos del Sistema Integrado de Gestión","Gestión de Asuntos Locales","Desarrollar acciones a nivel local para promover la participación ciudadana, brindar acompañamiento a las alcaldías locales en temas misionales de la entidad y ofertar sus programas","Oportunidad en la emisión del concepto previo y favorable según los tiempos establecidos en la normatividad vigente",null,null,"Porcentaje de conceptos previos tramitados dentro de los términos legales vigentes","(No. de conceptos previos tramitados dentro de los términos legales vigentes/Total de solicitudes de conceptos previos recibidas)*100","Gestión","Calidad","Trimestral",0.5,"Porcentaje","Matriz de seguimiento a conceptos previos tramitados","Positiva","No",null,2019,"Marzo",11,16,{"$f":"+T170/U170","v":0.6875},{"$f":"+V170/L170","v":1.375},{"$f":"_xlfn.IFS(W170<=69%,\"Crítico\",W170>=90%,\"Aceptable\",W170>=70%,\"Tolerable\")","v":"Aceptable"}]
["Mejorar continuamente los procesos del Sistema Integrado de Gestión","Control, Evaluación y Seguimiento","Evaluar los controles y la gestión de la entidad con el fin de identificar e implementar acciones de mejora, en pro de la sostenibilidad del Sistema de Control Interno","Pertinencia y oportunidad en la entrega de los resultados del seguimiento a las partes interesadas","Oportunidad y calidad en la información reportada a las entidades competentes del orden nacional y distrital",null,"Porcentaje de informes presentados por la tercera línea de defensa dentro de los tiempos programados","(No. de informes de ley y de gestión elaborados y presentados dentro de los tiempos programados/Total de informes de ley y de gestión a cargo de la tercera línea de defensa )*100  ","Gestión","Calidad","Trimestral",1,"Porcentaje","Plan anual de auditoría\nCronograma presentación de informes","Positiva","No","En el análisis del indicador se presentará el resultado desagregado por cada uno de los informes realizados.",2019,"Marzo",26,26,1,1,"Aceptable"]
["Mejorar continuamente los procesos del Sistema Integrado de Gestión","Control, Evaluación y Seguimiento","Evaluar los controles y la gestión de la entidad con el fin de identificar e implementar acciones de mejora, en pro de la sostenibilidad del Sistema de Control Interno","Cumplimiento de los objetivos definidos en el plan de auditoría conforme al plan de pruebas","Cobertura de las unidades a auditar de acuerdo con los parámetros establecidos en la matriz de priorización, en concordancia con los recursos disponibles para la ejecución del Plan Anual de Auditoría",null,"Índice de eficacia de auditorías internas de control interno","(Índice auditoría 1 + índice auditoría 2 +...+Índice auditoría n)/Total de auditorías realizadas\nDonde: \nÍndice auditoría n = Calificación porcentual de la variable Objetivos Específicos*Peso de la variable Objetivos Específicos + Calificación porcentual de la variable Actividad Plan de Auditoría*Peso de la variable Actividad Plan de Auditoría + Calificación porcentual de la variable Oportunidad*Peso de la variable Oportunidad\nPesos de las variables:\nObjetivos Específicos = 40%\nActividades Plan de Auditoría = 30%\nOportunidad = 30%. Esta se medirá tomando como fecha de referencia la de emisión del informe preliminar de auditoría.\nn = número de auditorías realizadas","Gestión","Eficacia","Trimestral",0.85,"Porcentaje","Planes de cada una de las auditorías","Positiva","No","En el análisis del indicador se presentará el resultado desagregado por cada una de las auditorías realizadas.",2019,"Marzo",198,300,0.66,0.77647058823529413,"Tolerable"]
["Mejorar continuamente los procesos del Sistema Integrado de Gestión","Gestión Financiera","Administrar los recursos financieros asignados y realizar los respectivos registros, para el cumplimiento de las funciones de la entidad y pago de sus obligaciones con terceros","Oportunidad en el seguimiento de las partidas pendientes por conciliar",null,null,"Porcentaje de partidas conciliatorias identificadas dentro del tiempo establecido","(No. de partidas conciliatorias identificadas con edad inferior a 60 días/Total de partidas reportadas)*100","Gestión","Calidad","Mensual",0.9,"Porcentaje","Sistema de información SEVEN","Positiva","No",null,2019,"Marzo"]
["Mejorar continuamente los procesos del Sistema Integrado de Gestión","Gestión Financiera","Administrar los recursos financieros asignados y realizar los respectivos registros, para el cumplimiento de las funciones de la entidad y pago de sus obligaciones con terceros","Oportunidad e integridad de la información necesaria para realizar las diferentes conciliaciones",null,null,"Porcentaje de obligaciones contingentes registradas correctamente en la contabilidad","(No. de procesos registrados correctamente en la contabilidad/Total de procesos reportados en SIPROJ Web)*100","Gestión","Calidad","Trimestral",1,"Porcentaje","Sistema de información SEVEN","Positiva","No",null,2019,"Marzo"]
["Mejorar continuamente los procesos del Sistema Integrado de Gestión","Gestión Financiera","Administrar los recursos financieros asignados y realizar los respectivos registros, para el cumplimiento de las funciones de la entidad y pago de sus obligaciones con terceros","Oportunidad en la presentación de informes y estados financieros a los diferentes entes de vigilancia y control",null,null,"Porcentaje de notas a los estados financieros reveladas correctamente","(No. de notas sin observaciones por parte de los órganos de control internos y externos/Total de notas a los estados financieros elaboradas)*100","Gestión","Calidad","Anual",0.95,"Porcentaje","Informes de entes de control y vigilancia","Positiva","No",null,2019,"Marzo"]
["Mejorar continuamente los procesos del Sistema Integrado de Gestión","Gestión Financiera","Administrar los recursos financieros asignados y realizar los respectivos registros, para el cumplimiento de las funciones de la entidad y pago de sus obligaciones con terceros","Oportunidad en la presentación de informes y estados financieros a los diferentes entes de vigilancia y control","Oportunidad en la presentación de las declaraciones tributarias",null,"Porcentaje de informes financieros presentados a los entes de vigilancia y control dentro de los términos legales vigentes","(No. de informes financieros presentados dentro de los términos legales vigentes/Total de informes financieros a reportar a los entes de vigilancia y control)*100","Gestión","Calidad","Trimestral",1,"Porcentaje","Matriz de seguimiento a la presentación de informes ","Positiva","No",null,2019,"Marzo"]
["Satisfacer las necesidades de los usuarios a través de la prestación de servicios eficientes, eficaces y efectivos","Promoción de la Recreación","Desarrollar actividades recreativas en función de las características y necesidades de la población de Bogotá D.C., para promover el aprovechamiento del tiempo libre y el mejoramiento en la calidad de vida","Satisfacción del usuario con las actividades recreativas realizadas",null,null,"Satisfacción de los usuarios con los eventos y/o programas recreativos","(No. de usuarios satisfechos con los eventos y/o programas recreativos/Total de usuarios de eventos y/o programas recreativos encuestados)*100","Gestión","Efectividad","Anual",1,"Porcentaje","Encuesta de satisfacción sobre eventos y/o programas recreativos","Positiva","No","En el análisis del indicador se presentará el resultado desagregado por programa y por cada uno de los aspectos evaluados en la encuesta de satisfacción.\nSe colocó una meta de 100%, mientras se levanta la línea base con la primera medición.",2019,"Marzo"]
["Mejorar continuamente los procesos del Sistema Integrado de Gestión","Promoción de la Recreación","Desarrollar actividades recreativas en función de las características y necesidades de la población de Bogotá D.C., para promover el aprovechamiento del tiempo libre y el mejoramiento en la calidad de vida","Cumplimiento del programa de actividades recreativas, teniendo en cuenta lo establecido en las fichas técnicas o según lo concertado con la comunidad e instituciones",null,null,"Porcentaje de actividades recreativas que cumplen con los requisitos para su ejecución","(No. de actividades recreativas que cumplen con los requisitos definidos para su ejecución/Total de actividades recreativas realizadas)*100","Gestión","Eficacia","Trimestral",0.97,"Porcentaje","Sistema de información misional - SIM","Positiva","No","En el análisis del indicador se presentará el resultado desagregado por programa y por actividad.",2019,"Marzo",4453,4465,0.99731243001119818,1.0281571443414415,"Aceptable","Este indicador se venia reportando con frecuencia mensual, a partir del mes de abril se reportara trimestralmente."]
["Satisfacer las necesidades de los usuarios a través de la prestación de servicios eficientes, eficaces y efectivos","Fomento al Deporte","Desarrollar e implementar programas deportivos y de actividad física, para contribuir con el mejoramiento de la calidad de vida en la población de Bogotá D.C.","Satisfacción del usuario con las actividades deportivas  realizadas",null,null,"Satisfacción de los usuarios con las actividades realizadas en los programas deportivos","(No. de usuarios satisfechos con las actividades deportivas realizadas/Total de usuarios de actividades deportivas encuestados)*100","Gestión","Efectividad","Anual",1,"Porcentaje","Encuesta de satisfacción sobre actividades/programas deportivos","Positiva","No","En el análisis del indicador se presentará el resultado desagregado por programa y por cada uno de los aspectos evaluados en la encuesta de satisfacción.\nSe colocó una meta de 100%, mientras se levanta la línea base con la primera medición.",2019,"Marzo"]
["Mejorar continuamente los procesos del Sistema Integrado de Gestión","Fomento al Deporte","Desarrollar e implementar programas deportivos y de actividad física, para contribuir con el mejoramiento de la calidad de vida en la población de Bogotá D.C.","Cambios comportamentales como resultados de los programas deportivos y de actividad física",null,null,"Cambio comportamental frente a la actividad física y el deporte","(No. de beneficiarios con percepción de cambio comportamental alrededor de las 4 dimensiones de la alfabetización física/Total de beneficiarios de programas deportivos y de actividad física seleccionados en la muestra)*100","Gestión","Efectividad","Anual",1,"Porcentaje","Encuesta para medir las 4 dimensiones de la alfabetización física","Positiva","No","La metodología se aplicará sobre una muestra por cada por cada programa. Se define en 4 tipos de mediciones:\n1. Medición dimensión competencia física. Aplicar test de resistencia, fuerza de torso, habilidades y flexibilidad.\n2. Medición dimensiones: competencia cognitiva, comportamental y motivacional a través de un cuestionario (on-line o presencial).\nSe colocó una meta de 100%, mientras se levanta la línea base con la primera medición.",2019,"Marzo"]
["Satisfacer las necesidades de los usuarios a través de la prestación de servicios eficientes, eficaces y efectivos","Servicio a la Ciudadanía","Brindar información y atender los requerimientos de los grupos de valor y de interés de la entidad para responder a sus necesidades en cumplimiento de sus derechos","Oportunidad y calidad en la respuesta a los requerimientos de los grupos de valor e interés de la entidad","Satisfacción del ciudadano frente a las respuestas a sus requerimientos",null,"Satisfacción de peticionarios con la respuesta dada a sus requerimientos","(No. de peticionarios satisfechos con la respuesta dada a sus peticiones, quejas, reclamos y sugerencias/Total de peticionarios contactados)*100","Gestión","Efectividad","Mensual",0.8,"Porcentaje","Base de datos de gestión de PQRS","Positiva","No",null,2019,"Marzo",22,26,0.84615384615384615,1.0576923076923077,"Aceptable"]
["Mejorar continuamente los procesos del Sistema Integrado de Gestión","Gestión de Recursos Físicos","Administrar y controlar los bienes muebles y servicios para el funcionamiento administrativo de la entidad","Oportunidad en la atención de requerimientos y necesidades de servicios administrativos",null,null,"Porcentaje de requerimientos de mantenimiento correctivo atendidos en la sede administrativa dentro de los tiempos establecidos","(No. de requerimientos de mantenimiento correctivo atendidos dentro de los tiempos establecidos/Total de requerimientos de mantenimiento correctivo reportados en la sede administrativa)*100","Gestión","Calidad","Trimestral",0.95,"Porcentaje","Aplicativo mesa de ayuda OTRS","Positiva","No",null,2019,"Marzo",84,84,1,1.0526315789473684,"Aceptable"]
["Mejorar continuamente los procesos del Sistema Integrado de Gestión","Adquisición de Bienes y Servicios","Realizar actividades contractuales para adquirir bienes y servicios con la oportunidad y de acuerdo con las especificaciones establecidas por la entidad","Cumplimiento de requisitos de acuerdo con la modalidad de selección",null,null,"Porcentaje de procesos de selección publicados dentro del tiempo establecido","(No. de actos de apertura de procesos de selección publicados en un tiempo menor o igual a 30 días hábiles después de la radicación/Total de actos de apertura expedidos)*100","Gestión","Calidad","Trimestral",0.9,"Porcentaje","Plataforma ORFEO y SECOP","Positiva","No","En el análisis del indicador se presentará el resultado desagregado para licitación pública, concurso de méritos y selección abreviada.",2019,"Marzo","N.R","N.R"]
["Mejorar continuamente los procesos del Sistema Integrado de Gestión","Adquisición de Bienes y Servicios","Realizar actividades contractuales para adquirir bienes y servicios con la oportunidad y de acuerdo con las especificaciones establecidas por la entidad","Oportunidad en la suscripción y legalización del contrato",null,null,"Porcentaje de contratos legalizados dentro del tiempo establecido","(No. de contratos legalizados en un tiempo menor o igual a 10 días hábiles a partir del acto administrativo de adjudicación/Total de procesos de selección adjudicados)*100","Gestión","Calidad","Mensual",0.8,"Porcentaje","SECOP y Plataforma ORFEO ","Positiva","No","En el análisis del indicador se presentará el resultado desagregado para licitación pública, concurso de méritos y selección abreviada.",2019,"Marzo"]
["Mejorar continuamente los procesos del Sistema Integrado de Gestión","Adquisición de Bienes y Servicios","Realizar actividades contractuales para adquirir bienes y servicios con la oportunidad y de acuerdo con las especificaciones establecidas por la entidad","Definición clara y precisa de requisitos técnicos, financieros, económicos, jurídicos y de riesgos de acuerdo con el bien o servicio a adquirir",null,null,"Porcentaje de procesos de obra tramitados en análisis de costos dentro del tiempo establecido","(No. de procesos de obra (todas las Subdirecciones) tramitados en oportunidad al recibo del memorando con la solicitud estudio del sector (20 días)/Total de procesos de obra recibidos)*100","Gestión","Calidad","Trimestral",1,"Porcentaje","Matriz de tráfico ACEE","Positiva","No",null,2019,"Marzo",14,14,1,1,"Aceptable"]
["Mejorar continuamente los procesos del Sistema Integrado de Gestión","Adquisición de Bienes y Servicios","Realizar actividades contractuales para adquirir bienes y servicios con la oportunidad y de acuerdo con las especificaciones establecidas por la entidad","Definición clara y precisa de requisitos técnicos, financieros, económicos, jurídicos y de riesgos de acuerdo con el bien o servicio a adquirir",null,null,"Porcentaje de procesos diferentes a obra tramitados en análisis de costos dentro del tiempo establecido","(No. de procesos diferentes a obra tramitados en oportunidad al recibo del memorando con la solicitud estudio del sector (10 días hábiles)/Total de procesos recibidos diferentes a obra)*100","Gestión","Calidad","Trimestral",0.9,"Porcentaje","Matriz de tráfico ACEE","Positiva","No","En el análisis del indicador se presentará el resultado desagregado para procesos diferentes a obra.",2019,"Marzo",71,72,0.98611111111111116,1.095679012345679,"Aceptable"]
["Mejorar continuamente los procesos del Sistema Integrado de Gestión","Adquisición de Bienes y Servicios","Realizar actividades contractuales para adquirir bienes y servicios con la oportunidad y de acuerdo con las especificaciones establecidas por la entidad","Definición clara y precisa de requisitos técnicos, financieros, económicos, jurídicos y de riesgos de acuerdo con el bien o servicio a adquirir",null,null,"Porcentaje de procesos requeridos por precios artificialmente bajos","(No. de procesos (excepto Subastas SAS) requeridos por precios artificialmente bajos/Total de procesos evaluados)*100","Gestión","Calidad","Trimestral",0.15,"Porcentaje","Evaluación económica de los proponentes\n\nAnálisis de precios realizado por la ACEE","Negativa","No","En el análisis del indicador se presentará el resultado desagregado por tipo de proceso.",2019,"Marzo",1,6,0.16666666666666666,{"$f":"((L187-V187)+L187)/L187","v":0.88888888888888895},"Tolerable"]
["Mejorar continuamente los procesos del Sistema Integrado de Gestión","Control, Evaluación y Seguimiento","Evaluar los controles y la gestión de la entidad con el fin de identificar e implementar acciones de mejora, en pro de la sostenibilidad del Sistema de Control Interno","Pertinencia y oportunidad en la entrega de los resultados del seguimiento a las partes interesadas",null,null,"Porcentaje de acciones de mejoramiento interno con seguimiento efectuado","(No. de acciones de mejoramiento interno con seguimiento efectuado)/Total de acciones de mejoramiento interno abiertas de auditorías internas de control interno)*100","Gestión","Eficacia","Trimestral",1,"Porcentaje","Plataforma Isolución","Positiva","No","En el análisis del indicador se presentará el resultado desagregado por proceso.",2019,"Marzo",22,28,0.7857142857142857,{"$f":"+V188/L188","v":0.7857142857142857},"Tolerable"]
["Mejorar continuamente los procesos del Sistema Integrado de Gestión","Control, Evaluación y Seguimiento","Evaluar los controles y la gestión de la entidad con el fin de identificar e implementar acciones de mejora, en pro de la sostenibilidad del Sistema de Control Interno","Pertinencia y oportunidad en la entrega de los resultados del seguimiento a las partes interesadas",null,null,"Porcentaje de acciones de mejoramiento externo con seguimiento efectuado","(No. de acciones de mejoramiento externo con seguimiento efectuado)/Total de acciones de mejoramiento externo abiertas de auditorías externas)*100","Gestión","Eficacia","Trimestral",1,"Porcentaje","Matrices de consolidación del estado de las acciones de los diferentes entes de control y vigilancia","Positiva","No","En el análisis del indicador se presentará el resultado desagregado por auditoría externa.",2019,"Marzo",218,218,1,1,"Aceptable"]
["Mejorar continuamente los procesos del Sistema Integrado de Gestión","Gestión Financiera","Administrar los recursos financieros asignados y realizar los respectivos registros, para el cumplimiento de las funciones de la entidad y pago de sus obligaciones con terceros","Oportunidad en la expedición de los certificados presupuestales y en la presentación de los informes de ejecución",null,null,"Porcentaje de ejecución presupuestal en gastos de funcionamiento","(Presupuesto de funcionamiento ejecutado/Presupuesto disponible de funcionamiento)*100","Gestión","Eficiencia","Mensual",0.95,"Porcentaje","Ejecución presupuestal en SEVEN","Positiva","Si","La meta es anual con medición y análisis mensual.\nLa medición está a cargo del Área Financiera y el análisis a cargo de la Subdirección Administrativa y Financiera.\nLa medición y el análisis se deben realizar a más tardar el quinto día hábil de cada mes.\nUna vez se realice el Comité Financiero, el Área Financiera debe enviar a la Oficina Asesora de Planeación la presentación correspondiente, con el análisis respectivo en cuanto al desempeño del indicador.",2019,"Marzo"]
["Mejorar continuamente los procesos del Sistema Integrado de Gestión","Gestión Financiera","Administrar los recursos financieros asignados y realizar los respectivos registros, para el cumplimiento de las funciones de la entidad y pago de sus obligaciones con terceros","Oportunidad en la expedición de los certificados presupuestales y en la presentación de los informes de ejecución","Oportunidad en la autorización de giro de los recursos de transferencia",null,"Porcentaje de ejecución presupuestal en gastos de inversión","(Presupuesto de inversión ejecutado/Presupuesto disponible de inversión)*100","Gestión","Eficiencia","Mensual",1,"Porcentaje","Ejecución presupuestal en SEVEN","Positiva","Si","La meta es anual con medición y análisis mensual.\nLa medición está a cargo del Área Financiera y el análisis a cargo de los Ordenadores del Gasto.\nLa medición y el análisis se deben realizar a más tardar el quinto día hábil de cada mes.\nUna vez se realice el Comité Financiero, el Área Financiera debe enviar a la Oficina Asesora de Planeación la presentación correspondiente, con el análisis respectivo en cuanto al desempeño del indicador.",2019,"Marzo"]
["Mejorar continuamente los procesos del Sistema Integrado de Gestión","Gestión Financiera","Administrar los recursos financieros asignados y realizar los respectivos registros, para el cumplimiento de las funciones de la entidad y pago de sus obligaciones con terceros","Oportunidad en el pago de las obligaciones financieras de la entidad",null,null,"Porcentaje de ejecución del programa anual de caja","(Recursos ejecutados de reserva, vigencia y pasivos exigibles/Recursos programados de reserva, vigencia y pasivos exigibles)*100","Gestión","Eficiencia","Mensual",1,"Porcentaje","Sistema de información SEVEN","Positiva","Si","La meta es anual con medición y análisis mensual.\nLa medición está a cargo del Área Financiera y el análisis a cargo de los Ordenadores del Gasto.\nLa medición y el análisis se deben realizar a más tardar el quinto día hábil de cada mes.\nUna vez se realice el Comité Financiero, el Área Financiera debe enviar a la Oficina Asesora de Planeación la presentación correspondiente, con el análisis respectivo en cuanto al desempeño del indicador.",2019,"Marzo"]
["Mejorar continuamente los procesos del Sistema Integrado de Gestión","Gestión Financiera","Administrar los recursos financieros asignados y realizar los respectivos registros, para el cumplimiento de las funciones de la entidad y pago de sus obligaciones con terceros","Oportunidad en el pago de las obligaciones financieras de la entidad","Oportunidad en la causación de ordenes de pago que cumplan con todos los requisitos establecidos","Oportunidad y veracidad de la información necesaria para la causación de las ordenes de pago reportada por los ordenadores del gasto","Porcentaje de cuentas individuales pagadas dentro del tiempo establecido","(No. de cuentas individuales pagadas en un tiempo menor o igual a 6 días/Total de cuentas de pago individuales tramitadas)*100 ","Gestión","Calidad","Mensual",1,"Porcentaje","Bitácora de cuentas en SEVEN","Positiva","No","La medición y el análisis están a cargo del Área Financiera.\nEn el análisis del indicador se presentará el resultado del tiempo promedio en cada una de las etapas para el pago, según la bitácora de cuentas de SEVEN.",2019,"Marzo",179,180,{"$f":"+T193/U193","v":0.99444444444444446},0.99444444444444446,{"$f":"_xlfn.IFS(W193<=69%,\"Crítico\",W193>=90%,\"Aceptable\",W193>=70%,\"Tolerable\")","v":"Aceptable"}]
["Mejorar continuamente los procesos del Sistema Integrado de Gestión","Gestión Financiera","Administrar los recursos financieros asignados y realizar los respectivos registros, para el cumplimiento de las funciones de la entidad y pago de sus obligaciones con terceros","Oportunidad en el pago de las obligaciones financieras de la entidad","Oportunidad en la causación de ordenes de pago que cumplan con todos los requisitos establecidos","Oportunidad y veracidad de la información necesaria para la causación de las ordenes de pago reportada por los ordenadores del gasto","Porcentaje de cuentas colectivas pagadas dentro del tiempo establecido","(No. de cuentas colectivas pagadas en un tiempo menor o igual a 10 días/Total de cuentas de pago colectivas tramitadas)*100","Gestión","Calidad","Mensual",1,"Porcentaje","Bitácora de cuentas en SEVEN","Positiva","No","La medición y el análisis están a cargo del Área Financiera.\nEn el análisis del indicador se debe presentar el resultado del tiempo promedio en cada una de las etapas para el pago, según la bitácora de cuentas de SEVEN.",2019,"Marzo",78,78,1,1,{"$f":"_xlfn.IFS(W194<=69%,\"Crítico\",W194>=90%,\"Aceptable\",W194>=70%,\"Tolerable\")","v":"Aceptable"}]
["Implementar las políticas y líneas de acción para la preservación e integridad de la documentación","Gestión Documental","Administrar, conservar y custodiar la documentación generada en la entidad, desde su origen hasta su disposición final, para preservar la memoria institucional","Actualización del inventario documental en el Formato Único de Inventario Documental, con base en la aplicación de las tablas de retención documental","Cumplimiento de los tiempos de retención documental establecidos en las tablas","Actualización de los instrumentos archivísticos","Porcentaje de inventario validado del fondo documental acumulado del archivo central","(No. de metros lineales de inventario validado en cuanto a series, subseries, asuntos y oficinas productoras/Total de metros lineales de archivo inventariado en estado natural del archivo central)*100 ","Gestión","Eficacia","Mensual",1,"Porcentaje","Matriz de seguimiento a inventario documental","Positiva","Si","La meta es anual con medición y análisis mensual",2019,"Marzo"]
["Implementar las políticas y líneas de acción para la preservación e integridad de la documentación","Gestión Documental","Administrar, conservar y custodiar la documentación generada en la entidad, desde su origen hasta su disposición final, para preservar la memoria institucional","Oportunidad en las transferencias documentales de acuerdo con los tiempos de retención establecidos en las tablas",null,null,"Porcentaje de transferencias primarias realizadas de acuerdo con los tiempos de retención","(No. de transferencias primarias realizadas de acuerdo con los tiempos de retención establecidos en las TRD/Total de transferencias documentales programadas)*100","Gestión","Eficacia","Mensual",0.8,"Porcentaje","Matriz de seguimiento a transferencias documentales","Positiva","Si","La meta es anual con medición y análisis mensual",2019,"Marzo"]
["Implementar las políticas y líneas de acción para la preservación e integridad de la documentación","Gestión Documental","Administrar, conservar y custodiar la documentación generada en la entidad, desde su origen hasta su disposición final, para preservar la memoria institucional","Cumplimiento de los estándares de temperatura, humedad relativa y luminosidad de los espacios de almacenamiento de material documental, dentro de los rangos establecidos en la normatividad vigente",null,null,"Porcentaje de espacios controlados para la conservación documental","(No. de espacios monitoreados e intervenidos/Total de espacios monitoreados)*100","Gestión","Eficacia","Mensual",1,"Porcentaje","Informe de monitoreo de espacios controlados","Positiva","No","La medición es mes vencido",2019,"Marzo"]
["Mejorar continuamente los procesos del Sistema Integrado de Gestión","Servicio a la Ciudadanía","Brindar información y atender los requerimientos de los grupos de valor y de interés de la entidad para responder a sus necesidades en cumplimiento de sus derechos","Oportunidad y calidad en la respuesta a los requerimientos de los grupos de valor e interés de la entidad",null,null,"Porcentaje de peticiones, quejas, reclamos y sugerencias contestadas dentro de los términos legales vigentes","(No. de peticiones, quejas, reclamos y sugerencias contestadas en el aplicativo SDQS dentro de los términos legales vigentes/Total de peticiones, quejas, reclamos y sugerencias recibidas)*100","Gestión","Calidad","Mensual",1,"Porcentaje","Sistema SDQS","Positiva","No","La medición es mes vencido",2019,"Marzo",242,263,0.92015209125475284,0.92015209125475284,{"$f":"_xlfn.IFS(W198<=69%,\"Crítico\",W198>=90%,\"Aceptable\",W198>=70%,\"Tolerable\")","v":"Aceptable"}]
["Satisfacer las necesidades de los usuarios a través de la prestación de servicios eficientes, eficaces y efectivos","Servicio a la Ciudadanía","Brindar información y atender los requerimientos de los grupos de valor y de interés de la entidad para responder a sus necesidades en cumplimiento de sus derechos","Satisfacción del ciudadano frente a la atención brindada por la entidad",null,null,"Satisfacción del ciudadano con la atención recibida en los SUPERCADE","(No. de ciudadanos satisfechos con la atención recibida en los SUPERCADE/Total de ciudadanos atendidos en los SUPERCADE)*100","Gestión","Efectividad","Mensual",0.95,"Porcentaje","Encuesta de satisfacción con la atención brindada en SUPERCADES","Positiva","No",null,2019,"Marzo",1861,1863,0.99892646269457863,1.0515015396785039,"Aceptable"]
["Mejorar continuamente los procesos del Sistema Integrado de Gestión","Servicio a la Ciudadanía","Brindar información y atender los requerimientos de los grupos de valor y de interés de la entidad para responder a sus necesidades en cumplimiento de sus derechos","Oportunidad en la actualización de la información publicada en la sección de ley de transparencia en la página web de la entidad",null,null,"Porcentaje de información actualizada en ley de transparencia","(No. de subcategorías con información actualizada en la página web/Total de subcategorías definidas en ley de transparencia)*100","Gestión","Eficacia","Trimestral",1,"Porcentaje","Página web","Positiva","No",null,2019,"Marzo"]
["Mejorar continuamente los procesos del Sistema Integrado de Gestión","Servicio a la Ciudadanía","Brindar información y atender los requerimientos de los grupos de valor y de interés de la entidad para responder a sus necesidades en cumplimiento de sus derechos","Coherencia, claridad, solución de fondo, calidez y manejo del sistema en relación con los requerimientos atendidos por la entidad",null,null,"Porcentaje de requerimientos atendidos con oportunidad y calidad","(No. de respuestas a requerimientos sin observaciones en cuanto a los criterios de oportunidad y calidad/Total de requerimientos evaluados en el aplicativo SDQS)*100","Gestión","Eficacia","Mensual",0.8,"Porcentaje","SDQS y base de datos de gestión de PQRS","Positiva","No","La medición es mes vencido",2019,"Marzo",173,216,0.80092592592592593,1.0011574074074074,"Aceptable"]
["Implementar buenas prácticas ambientales para la prevención de la contaminación en el marco de una Bogotá que defiende lo público en su función administrativa y de desarrollo institucional","Gestión de Recursos Físicos","Administrar y controlar los bienes muebles y servicios para el funcionamiento administrativo de la entidad","Calificación de la implementación del Plan Institucional de Gestión Ambiental, por parte de la Secretaría Distrital de Ambiente","Oportunidad en el reporte de formularios y registros electrónicos del PIGA ante la Secretaría Distrital de Ambiente",null,"Índice de implementación del PIGA","Promedio ponderado de cumplimiento de aspectos normativos y de implementación del PIGA, según auditoría realizada por la Secretaría Distrital de Ambiente en cada vigencia","Gestión","Eficacia","Anual",0.7,"Porcentaje","Informe de auditoría anual realizada por la Secretaría Distrital de Ambiente","Positiva","No","En el análisis del indicador se presentará el resultado desagregado por cada uno de los aspectos evaluados en la visita de control y seguimiento por parte de la Secretaría Distrital de Ambiente.\nLa meta está configurada como mayor a 70%.",2019,"Marzo"]
["Proteger la integridad, confidencialidad y disponibilidad de la información","Gestión de Tecnología de la Información y las Comunicaciones","Proporcionar soluciones estratégicas de tecnologías de la información y las comunicaciones, para contribuir con la eficiencia administrativa, la mejora de los trámites y servicios y la protección de los activos de información de la entidad","Impacto del plan de remediación frente a las vulnerabilidades identificadas","Aseguramiento de incidencias en la seguridad de la información que afecten la confidencialidad, integridad y disponibilidad",null,"Porcentaje de remediación de vulnerabilidades de seguridad de la información","(No. de vulnerabilidades críticas o altas remediadas/Total de vulnerabilidades de seguridad de la información detectadas como críticas o altas)*100 ","Gestión","Eficacia","Anual",0.7,"Porcentaje","Matriz de vulnerabilidades","Positiva","No","La meta está configurada como mínimo 70%.",2019,"Marzo"]
["Proteger la integridad, confidencialidad y disponibilidad de la información","Gestión de Tecnología de la Información y las Comunicaciones","Proporcionar soluciones estratégicas de tecnologías de la información y las comunicaciones, para contribuir con la eficiencia administrativa, la mejora de los trámites y servicios y la protección de los activos de información de la entidad","Avances en la implementación de gobierno digital de acuerdo con los componentes evaluados por MINTIC",null,null,"Índice de implementación de gobierno digital","Sumatoria de la calificación obtenida por cada componente/Total de componentes de la política de gobierno digital","Gestión","Eficacia","Anual",0.65,"Porcentaje","Instrumento de medición suministrado para el seguimiento a la política de gobierno digital  ","Positiva","No","En el análisis del indicador se presentará el resultado desagregado de las calificaciones obtenidas en cada componente de la política de seguridad digital.",2019,"Marzo"]
["Mejorar continuamente los procesos del Sistema Integrado de Gestión","Gestión de Tecnología de la Información y las Comunicaciones","Proporcionar soluciones estratégicas de tecnologías de la información y las comunicaciones, para contribuir con la eficiencia administrativa, la mejora de los trámites y servicios y la protección de los activos de información de la entidad","Cumplimiento del Plan Estratégico de Tecnologías de la Información PETI",null,null,"Porcentaje de avance en proyectos de TI","(No. de hitos en proyectos de TI alcanzados/Total de hitos en proyectos de TI programados en la vigencia)*100","Gestión","Eficacia","Semestral",1,"Porcentaje","Cronograma de proyectos del PETI","Positiva","Si","La meta es anual con medición y análisis semestral.",2019,"Marzo"]
["Proteger la integridad, confidencialidad y disponibilidad de la información","Gestión de Tecnología de la Información y las Comunicaciones","Proporcionar soluciones estratégicas de tecnologías de la información y las comunicaciones, para contribuir con la eficiencia administrativa, la mejora de los trámites y servicios y la protección de los activos de información de la entidad","Disponibilidad de los sistemas de información de la entidad",null,null,"Porcentaje de disponibilidad de los sistemas de información","(No. de horas disponibles de los sistemas de información/Total de horas en servicio de los sistemas de información)*100","Gestión","Eficiencia","Mensual",0.9,"Porcentaje","Herramienta de monitoreo ZABBIX","Positiva","No","En el análisis del indidicador se presentará el resultado desagregado de disponibilidad en ORFEO, SEVEN, KACTUS y SIM.\nLa meta está configurada como mayor o igual a 90%.",2019,"Marzo"]
["Mejorar continuamente los procesos del Sistema Integrado de Gestión","Gestión de Tecnología de la Información y las Comunicaciones","Proporcionar soluciones estratégicas de tecnologías de la información y las comunicaciones, para contribuir con la eficiencia administrativa, la mejora de los trámites y servicios y la protección de los activos de información de la entidad","Disponibilidad de los servicios de comunicaciones en la entidad, según los acuerdos de niveles de servicios establecidos",null,null,"Porcentaje de disponibilidad de los servicios de comunicaciones","(No. de horas disponibles de los servicios de comunicaciones /Total de horas de los servicios de comunicaciones)*100","Gestión","Eficiencia","Mensual",0.9,"Porcentaje","Herramienta de monitoreo ZABBIX","Positiva","No","En el análisis del indidicador se presentará el resultado desagregado de disponibilidad en Internet y Telefonía IP.\nLa meta está configurada como mayor o igual a 90%.",2019,"Marzo"]
["Mejorar continuamente los procesos del Sistema Integrado de Gestión","Gestión de Tecnología de la Información y las Comunicaciones","Proporcionar soluciones estratégicas de tecnologías de la información y las comunicaciones, para contribuir con la eficiencia administrativa, la mejora de los trámites y servicios y la protección de los activos de información de la entidad","Incidencias reportadas en el funcionamiento del módulo o sistema de información implementado","Cumplimiento de los acuerdos de niveles de servicios establecidos",null,"Porcentaje de solicitudes de servicio tecnológico atendidas dentro de los tiempos establecidos","(No. de solicitudes atendidas dentro de los tiempos establecidos en los acuerdos de nivel de servicio/Total de solicitudes de servicio tecnológico recibidas)*100","Gestión","Calidad","Mensual",0.9,"Porcentaje","Herramienta GLPI","Positiva","No",null,2019,"Marzo",1083,1119,0.96782841823056298,1.0753649091450699,{"$f":"_xlfn.IFS(W208<=69%,\"Crítico\",W208>=90%,\"Aceptable\",W208>=70%,\"Tolerable\")","v":"Aceptable"}]
["Mejorar continuamente los procesos del Sistema Integrado de Gestión","Gestión de Talento Humano","Gestionar el potencial del talento humano como factor estratégico, para contribuir con el desarrollo de la entidad en un ambiente seguro y saludable","Cumplimiento de compromisos y competencias del servidor público en el desempeño laboral","Oportunidad en el seguimiento y la evaluación anual u ordinaria del servidor público para continuar su permanencia en el servicio",null,"Índice de desempeño laboral de funcionarios","(Sumatoria de calificaciones finales de la evaluación de desempeño de los funcionarios/Total de funcionarios evaluados)*100","Gestión","Eficacia","Anual",0.9,"Porcentaje","Consolidado de las calificaciones finales de la evaluación de desempeño","Positiva","No","En el análisis del indicador se presentará el resultado desagregado por niveles jerárquicos y comparar con la evaluación de las áreas.\nLa meta está configurada como mayor a 90%.\nNota: Se mide para vigencia 2018-2019.",2019,"Marzo"]
["Mejorar continuamente los procesos del Sistema Integrado de Gestión","Gestión de Talento Humano","Gestionar el potencial del talento humano como factor estratégico, para contribuir con el desarrollo de la entidad en un ambiente seguro y saludable","Cobertura de servidores públicos en las actividades del plan de bienestar e incentivos",null,null,"Porcentaje de funcionarios que participan en las actividades del plan de bienestar e incentivos","(No. de funcionarios participantes en las actividades del plan de bienestar e incentivos/Total de funcionarios de la entidad)*100 ","Gestión","Eficacia","Semestral",0.8,"Porcentaje","Registros de asistencia a las actividades del plan de bienestar","Positiva","No",null,2019,"Marzo"]
["Mejorar continuamente los procesos del Sistema Integrado de Gestión","Gestión de Talento Humano","Gestionar el potencial del talento humano como factor estratégico, para contribuir con el desarrollo de la entidad en un ambiente seguro y saludable","Cobertura de servidores públicos en las actividades del plan institucional de capacitación",null,null,"Porcentaje de funcionarios que asisten a las actividades del plan institucional de capacitación","(No. de funcionarios asistentes a las actividades del plan institucional de capacitación/Total de funcionarios citados a las actividades del plan institucional de capacitación)*100","Gestión","Eficacia","Semestral",0.8,"Porcentaje","Registros de asistencia a las actividades del plan de capacitación","Positiva","No","Las capacitaciones que se incluyen en el indicador son las que implican recursos.",2019,"Marzo"]
["Mejorar continuamente los procesos del Sistema Integrado de Gestión","Gestión de Talento Humano","Gestionar el potencial del talento humano como factor estratégico, para contribuir con el desarrollo de la entidad en un ambiente seguro y saludable","Evaluación del impacto de la capacitación en el desempeño de los servidores públicos y de la entidad",null,null,"Impacto de la capacitación en el desempeño laboral de funcionarios","(No. de funcionarios con capacitaciones efectivas/Total de funcionarios evaluados)*100","Gestión","Eficacia","Trimestral",0.95,"Porcentaje","Consolidado de las evaluaciones de impacto de la capacitación","Positiva","No",null,2019,"Marzo","S.M","S.M"]
["Mejorar continuamente los procesos del Sistema Integrado de Gestión","Gestión de Talento Humano","Gestionar el potencial del talento humano como factor estratégico, para contribuir con el desarrollo de la entidad en un ambiente seguro y saludable","Satisfacción de los servidores públicos frente a las actividades de  bienestar e incentivos","Satisfacción de los servidores públicos frente a las actividades de capacitación",null,"Índice de clima organizacional","Promedio ponderado de las dimensiones evaluadas en la encuesta de medición de clima organizacional","Gestión","Eficacia","Anual",0.8,"Porcentaje","Informe de medición de clima organizacional","Positiva","No","En el análisis del indicador se presentará el resultado desagregado por áreas y/o dependencias, y por las dimensiones evaluadas.",2019,"Marzo"]
["Mejorar continuamente los procesos del Sistema Integrado de Gestión","Gestión de Talento Humano","Gestionar el potencial del talento humano como factor estratégico, para contribuir con el desarrollo de la entidad en un ambiente seguro y saludable","Cumplimiento del plan anual de  bienestar e incentivos",null,null,"Porcentaje de ejecución del plan anual de bienestar e incentivos","(No. de actividades de bienestar e incentivos desarrolladas/Total de actividades programadas en el plan anual de bienestar e incentivos)*100","Gestión","Eficacia","Semestral",1,"Porcentaje","Matriz de seguimiento a la ejecución de actividades de bienestar e incentivos","Positiva","Si","La meta es anual con medición y análisis semestral.",2019,"Marzo"]
["Mejorar continuamente los procesos del Sistema Integrado de Gestión","Gestión de Talento Humano","Gestionar el potencial del talento humano como factor estratégico, para contribuir con el desarrollo de la entidad en un ambiente seguro y saludable","Cumplimiento del plan institucional de capacitación",null,null,"Porcentaje de ejecución del plan institucional de capacitación","(No. de actividades de capacitación desarrolladas/Total de actividades programadas en el plan institucional de capacitación)*100","Gestión","Eficacia","Semestral",1,"Porcentaje","Matriz de seguimiento a la ejecución de actividades de capacitación","Positiva","Si","La meta es anual con medición y análisis semestral.",2019,"Marzo"]
["Prevenir los factores que afecten la salud y seguridad a fin de mejorar las condiciones del ambiente de trabajo","Gestión de Talento Humano","Gestionar el potencial del talento humano como factor estratégico, para contribuir con el desarrollo de la entidad en un ambiente seguro y saludable","Cumplimiento del plan anual de trabajo",null,null,"Porcentaje de ejecución del plan anual de seguridad y salud en el trabajo","(No. de actividades de seguridad y salud desarrolladas/Total de actividades programadas en el plan anual de seguridad y salud en el trabajo)*100","Gestión","Eficacia","Mensual",0.95,"Porcentaje","Plan de trabajo anual del Sistema de Gestión de Seguridad y Salud en el Trabajo","Positiva","No",null,2019,"Marzo"]
["Prevenir los factores que afecten la salud y seguridad a fin de mejorar las condiciones del ambiente de trabajo","Gestión de Talento Humano","Gestionar el potencial del talento humano como factor estratégico, para contribuir con el desarrollo de la entidad en un ambiente seguro y saludable","Tasa de accidentalidad",null,null,"Tasa de accidentalidad","(No. de accidentes de trabajo reportados/Total de trabajadores (funcionarios y contratistas)*100","Gestión","Efectividad","Mensual",0.04,"Porcentaje","Matriz de accidentes de trabajo","Negativa","No","La meta está configurada como menor o igual a 4%.",2019,"Marzo"]
["Prevenir los factores que afecten la salud y seguridad a fin de mejorar las condiciones del ambiente de trabajo","Gestión de Talento Humano","Gestionar el potencial del talento humano como factor estratégico, para contribuir con el desarrollo de la entidad en un ambiente seguro y saludable","Incidencia y prevalencia de enfermedades laborales",null,null," Prevalencia de la enfermedad laboral","(No. de casos de enfermedad laboral calificada/Total de funcionarios)*100","Gestión","Efectividad","Trimestral",0.02,"Porcentaje","Matriz de seguimiento de enfermedades laborales","Negativa","No","La meta está configurada como menor o igual a 2%.",2019,"Marzo"]
["Prevenir los factores que afecten la salud y seguridad a fin de mejorar las condiciones del ambiente de trabajo","Gestión de Talento Humano","Gestionar el potencial del talento humano como factor estratégico, para contribuir con el desarrollo de la entidad en un ambiente seguro y saludable","Incidencia y prevalencia de enfermedades laborales",null,null,"Incidencia de la enfermedad laboral","(No. de casos nuevos de enfermedad laboral calificados/Total de funcionarios)*100","Gestión","Efectividad","Trimestral",0.01,"Porcentaje","Matriz de seguimiento de enfermedades laborales","Negativa","No","La meta está configurada como menor o igual a 1%.",2019,"Marzo"]
["Mejorar continuamente los procesos del Sistema Integrado de Gestión","Gestión de Recursos Físicos","Administrar y controlar los bienes muebles y servicios para el funcionamiento administrativo de la entidad","Confiabilidad del inventario de bienes devolutivos",null,null,"Porcentaje de inventario individual validado físicamente","(No. de elementos devolutivos del inventario individual validados físicamente/Total de elementos devolutivos del inventario individual registrados en el sistema de información SEVEN)*100 ","Gestión","Eficacia","Anual",1,"Porcentaje","Sistema de información SEVEN","Positiva","No",null,2019,"Marzo"]
["Mejorar continuamente los procesos del Sistema Integrado de Gestión","Gestión de Recursos Físicos","Administrar y controlar los bienes muebles y servicios para el funcionamiento administrativo de la entidad","Confiabilidad del inventario de bienes devolutivos",null,null,"Porcentaje de inventario aleatorio validado físicamente en bodega","(No. de elementos devolutivos y de consumo en bodegas validados físicamente/Muestra de inventario de elementos devolutivos y de consumo registrados en el sistema de información SEVEN)*100 ","Gestión","Eficacia","Trimestral",1,"Porcentaje","Sistema de información SEVEN","Positiva","No",null,2019,"Marzo"]
["Mejorar continuamente los procesos del Sistema Integrado de Gestión","Gestión de Asuntos Locales","Desarrollar acciones a nivel local para promover la participación ciudadana, brindar acompañamiento a las alcaldías locales en temas misionales de la entidad y ofertar sus programas","Cumplimiento de los compromisos adquiridos por la entidad, en el marco de las instancias de participación locales",null,null,"Porcentaje de compromisos atendidos en el marco de las instancias de participación locales","(No. de compromisos atendidos en las instancias Consejo Local de Gobierno, Unidad de Apoyo Técnico y Comisión Local Intersectorial de Participación /Total de compromisos generados en las instancias Consejo Local de Gobierno, Unidad de Apoyo Técnico y Comisión Local Intersectorial de Participación)*100","Gestión","Eficacia","Trimestral",1,"Porcentaje","Matriz de seguimiento a compromisos derivados de instancias de participación locales","Positiva","No",null,2019,"Marzo"]
["Mejorar continuamente los procesos del Sistema Integrado de Gestión","Gestión de Asuntos Locales","Desarrollar acciones a nivel local para promover la participación ciudadana, brindar acompañamiento a las alcaldías locales en temas misionales de la entidad y ofertar sus programas","Efectividad en la atención de la demanda de actividades recreodeportivas en las localidades de Bogotá",null,null,"Porcentaje de actividades recreativas programadas por asuntos locales","(No. de actividades recreativas programadas en la plataforma SIM por los gestores locales/Total de actividades recreativas solicitadas por Promoción de la Recreación)*100","Gestión","Eficacia","Mensual",1,"Porcentaje","Sistema de información misional - SIM\nCuadro de metas de actividades recreativas","Positiva","No",null,2019,"Marzo"]
["Mejorar continuamente los procesos del Sistema Integrado de Gestión","Gestión de Asuntos Locales","Desarrollar acciones a nivel local para promover la participación ciudadana, brindar acompañamiento a las alcaldías locales en temas misionales de la entidad y ofertar sus programas","Efectividad en la atención de la demanda de actividades recreodeportivas en las localidades de Bogotá",null,null,"Porcentaje de beneficiarios inscritos por asuntos locales en actividades deportivas","(No. de beneficiarios inscritos en actividades deportivas por los gestores locales/Total de beneficiarios de actividades deportivas programados por Fomento al Deporte)*100","Gestión","Eficacia","Trimestral",1,"Porcentaje","Reporte de las distintas plataformas para inscripciones\nCuadro de metas de actividades deportivas","Positiva","No",null,2019,"Marzo"]
["Mejorar continuamente los procesos del Sistema Integrado de Gestión","Gestión de Asuntos Locales","Desarrollar acciones a nivel local para promover la participación ciudadana, brindar acompañamiento a las alcaldías locales en temas misionales de la entidad y ofertar sus programas","Cumplimiento de lineamientos y criterios de elegibilidad y viabilidad de los proyectos de contratación",null,null,"Porcentaje de asistencias técnicas realizadas a los Fondos de Desarrollo Local","(No. de asistencias técnicas realizadas a los Fondos de Desarrollo Local/Total de asistencias técnicas programadas a los Fondos de Desarrollo Local en las cuatro líneas de inversión)*100","Gestión","Eficacia","Trimestral",1,"Porcentaje","Cronograma de asistencias técnicas a los Fondos de Desarrollo Local","Positiva","No",null,2019,"Marzo"]
["Mejorar continuamente los procesos del Sistema Integrado de Gestión","Gestión de Asuntos Locales","Desarrollar acciones a nivel local para promover la participación ciudadana, brindar acompañamiento a las alcaldías locales en temas misionales de la entidad y ofertar sus programas","Ejecución de los proyectos con recursos de los fondos de desarrollo local, en concordancia con el concepto previo y favorable emitido por la entidad",null,null,"Porcentaje de proyectos viabilizados con seguimiento efectuado","(No. de proyectos contratados con seguimiento efectuado/Total de proyectos viabilizados con contratación por parte de los Fondos de Desarrollo Local)*100","Gestión","Eficacia","Trimestral",1,"Porcentaje","SECOP\nInforme de seguimiento a viabilidades","Positiva","No",null,2019,"Marzo"]
["Mejorar continuamente los procesos del Sistema Integrado de Gestión","Control Disciplinario","Investigar conductas presuntamente disciplinables e imponer sanciones cuando haya lugar, tanto a servidores como a ex-servidores públicos de la entidad, con el fin de que éstos cumplan con sus deberes y funciones","Cumplimiento de los términos legales en las distintas etapas procesales",null,null,"Porcentaje de procesos disciplinarios resueltos de fondo","(No. de procesos disciplinarios decididos de fondo/Total de procesos disciplinarios activos)*100","Gestión","Eficacia","Semestral",0.6,"Porcentaje","Matriz de autos","Positiva","No",null,2019,"Marzo"]
["Mejorar continuamente los procesos del Sistema Integrado de Gestión","Control Disciplinario","Investigar conductas presuntamente disciplinables e imponer sanciones cuando haya lugar, tanto a servidores como a ex-servidores públicos de la entidad, con el fin de que éstos cumplan con sus deberes y funciones","Garantía del debido proceso en las distintas etapas procesales",null,null,"Porcentaje de procesos disciplinarios sin nulidades decretadas","(No. de procesos disciplinarios sin nulidades decretadas/Total de procesos disciplinarios activos)*100 ","Gestión","Eficacia","Trimestral",1,"Porcentaje","Matriz de autos","Positiva","No",null,2019,"Marzo"]
["Mejorar continuamente los procesos del Sistema Integrado de Gestión","Control Disciplinario","Investigar conductas presuntamente disciplinables e imponer sanciones cuando haya lugar, tanto a servidores como a ex-servidores públicos de la entidad, con el fin de que éstos cumplan con sus deberes y funciones","Cumplimiento de los términos legales en las distintas etapas procesales",null,null,"Porcentaje de procesos disciplinarios sin vencimiento de términos ","(No. de procesos disciplinarios sin vencimiento de términos/Total de procesos disciplinarios activos)*100","Gestión","Calidad","Trimestral",1,"Porcentaje","Expediente del proceso disciplinario ","Positiva","No",null,2019,"Marzo",101,103,{"$f":"+T229/U229","v":0.98058252427184467},{"$f":"+V229/L229","v":0.98058252427184467},{"$f":"_xlfn.IFS(W229<=69%,\"Crítico\",W229>=90%,\"Aceptable\",W229>=70%,\"Tolerable\")","v":"Aceptable"}]
["Mejorar continuamente los procesos del Sistema Integrado de Gestión","Administración y Mantenimiento de Parques y Escenarios","Ofrecer parques y escenarios del Sistema Distrital para el uso y disfrute de la comunidad general, gestionando la sostenibilidad física, social, ambiental y económica","Uso de parques y escenarios con motivación económica que generen recursos para el mantenimiento de los mismos",null,null,"Aprovechamiento económico de parques y/o escenarios","(Ingresos del mes + acumulado de los ingresos del mes anterior/Total presupuesto anual)*100","Gestión","Eficiencia","Mensual",1,"Porcentaje","Sistema de información SEVEN","Positiva","Si","La meta es anual con medición y análisis mensual.\n\nEn el análisis del indicador se presentará la desagregación del aprovechamiento económico por tipo de parque y/o escenario, expresado en ingresos y participación porcentual.",2019,"Marzo",6570515,22044017,0.2980634155743937,0.2980634155743937]
["Satisfacer las necesidades de los usuarios a través de la prestación de servicios eficientes, eficaces y efectivos","Administración y Mantenimiento de Parques y Escenarios","Ofrecer parques y escenarios del Sistema Distrital para el uso y disfrute de la comunidad general, gestionando la sostenibilidad física, social, ambiental y económica","Satisfacción de los usuarios con las actividades de mantenimiento preventivo y correctivo",null,null,"Satisfacción de los usuarios con las obras de mantenimiento de nuevas tendencias","(No. de usuarios satisfechos con las obras de mantenimiento realizadas/Total de usuarios de parques y escenarios encuestados para obras de mantenimiento de nuevas tendencias)*100","Gestión","Efectividad","Anual",0.9,"Porcentaje","Encuesta de satisfacción con las obras de mantenimiento de nuevas tendencias","Positiva","No","En el análisis del indicador se presentará el resultado desagregado por cada uno de los aspectos evaluados en la encuesta de satisfacción.",2019,"Marzo"]
["Mejorar continuamente los procesos del Sistema Integrado de Gestión","Administración y Mantenimiento de Parques y Escenarios","Ofrecer parques y escenarios del Sistema Distrital para el uso y disfrute de la comunidad general, gestionando la sostenibilidad física, social, ambiental y económica","Oportunidad y cumplimiento en la generación de compromisos o acuerdos ciudadanos frente al uso y sostenibilidad de los parques administrados",null,null,"Porcentaje de cumplimiento en acuerdos de sostenibilidad social de parques","(No. de compromisos gestionados/Total de compromisos adquiridos mediante acuerdos ciudadanos en parques)*100","Gestión","Eficacia","Trimestral",1,"Porcentaje","Matriz de seguimiento a compromisos o acuerdos ciudadanos","Positiva","No",null,2019,"Marzo"]
["Mejorar continuamente los procesos del Sistema Integrado de Gestión","Administración y Mantenimiento de Parques y Escenarios","Ofrecer parques y escenarios del Sistema Distrital para el uso y disfrute de la comunidad general, gestionando la sostenibilidad física, social, ambiental y económica","Disponibilidad de los equipamientos en parques y escenarios","Cumplimiento de las especificaciones técnicas en las actividades de mantenimiento preventivo y correctivo","Cobertura en el mantenimiento de parques y escenarios de acuerdo con la priorización","Porcentaje de avance en la ejecución de contratos de obras de mantenimiento o recuperación","(Porcentaje contrato 1 + Porcentaje contrato 2 +...+ Porcentaje contrato n)/Total de contratos de obras de mantenimiento o recuperación en ejecución\nDonde: \nPorcentaje contrato n = Avance físico ejecutado/Avance físico programado\nn = Número de contratos de obras de mantenimiento o recuperación en ejecución","Gestión","Eficacia","Bimestral",0.9,"Porcentaje","Informes mensuales de interventoría presentados según programación de los contratistas","Positiva","No",null,2019,"Marzo"]
["Satisfacer las necesidades de los usuarios a través de la prestación de servicios eficientes, eficaces y efectivos","Diseño y Construcción de Parques y Escenarios","Ampliar y mejorar la infraestructura física recreativa y deportiva del Distrito Capital para el uso de la comunidad en general","Cumplimiento de requisitos técnicos, administrativos, financieros y jurídicos de los proyectos",null,null,"Satisfacción de los usuarios con las obras de construcción y/o adecuación entregadas","(No. de usuarios satisfechos con las obras de construcción y/o adecuación entregadas /Total de usuarios encuestados por proyecto)*100","Gestión","Efectividad","Anual",0.9,"Porcentaje","Resultados de la encuesta de satisfacción entregados por los contratistas de obra","Positiva","No","En el análisis del indicador se presentará el resultado desagregado por cada uno de los aspectos evaluados en la encuesta de satisfacción.",2019,"Marzo"]
["Mejorar continuamente los procesos del Sistema Integrado de Gestión","Diseño y Construcción de Parques y Escenarios","Ampliar y mejorar la infraestructura física recreativa y deportiva del Distrito Capital para el uso de la comunidad en general","Oportunidad en el seguimiento y adopción de medidas durante el seguimiento de la estabilidad de la obra","Cumplimiento de especificaciones técnicas conforme a lo establecido en la etapa de construcción",null,"Porcentaje de fallas de calidad o estabilidad de obra atendidas en construcción y adecuación de parques y escenarios","(No. de fallas de calidad o estabilidad de obra atendidas/Total de fallas de calidad o estabilidad de obra detectadas o reportadas por terceros)*100\n\nAtendido = Se genera requerimiento al contratista para establecer compromisos de reparación.","Gestión","Eficacia","Trimestral",0.9,"Porcentaje","Actas de visita o reconocimiento de estabilidad de obra \nActa de compromiso de reparación constructiva\nProgramación de visita\nComunicación oficial- notificación de fallas visita de inspección por estabilidad \nActa de verificación de reparación constructiva","Positiva","No","En el análisis del indicador se presentará la desagregación por parque y escenario.",2019,"Marzo"]
["Mejorar continuamente los procesos del Sistema Integrado de Gestión","Diseño y Construcción de Parques y Escenarios","Ampliar y mejorar la infraestructura física recreativa y deportiva del Distrito Capital para el uso de la comunidad en general","Cumplimiento de requisitos técnicos, administrativos, financieros y jurídicos de los proyectos","Oportunidad en el seguimiento y adopción de medidas durante la ejecución de las obras","Cumplimiento del alcance de las obras conforme a los estudios y diseños, especificaciones técnicas y normatividad vigente","Porcentaje de avance en la ejecución de obras de construcción y adecuación de parques y escenarios","((%Ejecutado Obra 1*Plazo de ejecución Obra 1)+(%Ejecutado Obra 2*Plazo de ejecución Obra 2) +...+ (%Ejecutado Obra n*Plazo de ejecución Obra n))/((%Programado Obra 1*Plazo de ejecución Obra 1)+(%Programado Obra 2*Plazo de ejecución Obra 2) +...+ (%Programado Obra n*Plazo de ejecución Obra n))\nDonde:\nn = Número de obras en ejecución","Gestión","Eficacia","Mensual",0.9,"Porcentaje","Informes mensuales de interventoría\n\nInformes mensuales de supervisión","Positiva","No","En el análisis del indicador se presentará la desagregación por parque y escenario.",2019,"Marzo"]
["Mejorar continuamente los procesos del Sistema Integrado de Gestión","Diseño y Construcción de Parques y Escenarios","Ampliar y mejorar la infraestructura física recreativa y deportiva del Distrito Capital para el uso de la comunidad en general","\nCumplimiento de requisitos técnicos, administrativos, financieros y legales de los proyectos de estudios y diseños","Oportunidad en el seguimiento y adopción de medidas durante la ejecución de los proyectos de estudios y diseños","Cumplimiento del alcance de los proyectos de estudios y diseños conforme a las necesidades identificadas","Porcentaje de avance en la ejecución de proyectos de estudios y/o diseños de parques y escenarios","(Porcentaje proyecto 1 + Porcentaje proyecto 2 +...+ Porcentaje proyecto n)/Total de proyectos de estudios y/o diseños en ejecución\nDonde: \nPorcentaje proyecto n =(Avance ejecutado de estudios y/o diseños/Avance programado de estudios y/o diseños al corte según forma de pago)\nn = Número de proyectos de estudios y/o diseños en ejecución","Gestión","Eficacia","Mensual",0.9,"Porcentaje","Informes mensuales de interventoría\n\nInformes mensuales de supervisión","Positiva","No","En el análisis del indicador se presentará la desagregación por proyecto.",2019,"Marzo"]
["Mejorar continuamente los procesos del Sistema Integrado de Gestión","Gestión Jurídica","Ejercer la defensa judicial y extrajudicial de la entidad y atender requerimientos jurídicos, para salvaguardar sus intereses y cumplir con los requisitos constitucionales y legales","Intervención oportuna en las distintas actuaciones judiciales y extrajudiciales en que sea parte la entidad","Oportunidad en el seguimiento a los procesos en los despachos e instancias judiciales",null,"Porcentaje de procesos judiciales y extrajudiciales atendidos dentro de los términos legales vigentes","(No. de procesos jurídicos atendidos dentro de los términos legales vigentes)/Total de procesos jurídicos notificados)*100","Gestión","Calidad","Trimestral",1,"Porcentaje","SIPROJ Web\nORFEO","Positiva","No","En el análisis del indicador se presentará la desagregación por procesos judiciales y extrajudiciales.",2019,"Marzo",14,14,1,1,{"$f":"_xlfn.IFS(W238<=69%,\"Crítico\",W238>=90%,\"Aceptable\",W238>=70%,\"Tolerable\")","v":"Aceptable"}]
["Satisfacer las necesidades de los usuarios a través de la prestación de servicios eficientes, eficaces y efectivos","Gestión Jurídica","Ejercer la defensa judicial y extrajudicial de la entidad y atender requerimientos jurídicos, para salvaguardar sus intereses y cumplir con los requisitos constitucionales y legales","Cumplimiento de los requisitos establecidos para el reconocimiento deportivo y el aval de escuelas deportivas",null,null,"Satisfacción de los usuarios con el trámite de reconocimiento deportivo","(No. de usuarios satisfechos con el trámite de reconocimiento deportivo/Total de usuarios encuestados)*100","Gestión","Efectividad","Semestral",0.95,"Porcentaje","Encuesta de satisfacción de usuarios de reconocimiento deportivo","Positiva","No","En el análisis del indicador se presentarán los resultados desagregados por cada uno de los aspectos evaluados en la encuesta de satisfacción.",2019,"Marzo"]
["Mejorar continuamente los procesos del Sistema Integrado de Gestión","Gestión Jurídica","Ejercer la defensa judicial y extrajudicial de la entidad y atender requerimientos jurídicos, para salvaguardar sus intereses y cumplir con los requisitos constitucionales y legales","Oportunidad en la respuesta del trámite de otorgamiento deportivo (45 días hábiles siguientes al cumplimiento de requisitos de otorgamiento deportivo)","Vigencia y aplicabilidad de la normatividad empleada para el reconocimiento deportivo y el aval de escuelas deportivas",null,"Porcentaje de trámites de reconocimiento deportivo atendidos dentro del término legal vigente","(No. de trámites de reconocimiento deportivo atendidos dentro del término legal vigente/Total de trámites de reconocimiento deportivo atendidos)*100 ","Gestión","Calidad","Trimestral",0.92,"Porcentaje","Matriz de control de reconocimiento deportivo","Positiva","No",null,2019,"Marzo",266,280,0.95,1.0326086956521738,"Aceptable"]
["Mejorar continuamente los procesos del Sistema Integrado de Gestión","Gestión Jurídica","Ejercer la defensa judicial y extrajudicial de la entidad y atender requerimientos jurídicos, para salvaguardar sus intereses y cumplir con los requisitos constitucionales y legales","Oportunidad en la respuesta del trámite de aval de escuelas deportivas (58 días hábiles)","Vigencia y aplicabilidad de la normatividad empleada para el reconocimiento deportivo y el aval de escuelas deportivas",null,"Porcentaje de trámites de aval de escuelas deportivas atendidos dentro del término legal vigente","(No. de trámites de aval de escuelas deportivas atendidos dentro del término legal vigente/Total de trámites de aval de escuelas deportivas atendidos)*100","Gestión","Calidad","Trimestral",0.92,"Porcentaje","Matriz de control de aval de escuelas deportivas","Positiva","No",null,2019,"Marzo"]
["Mejorar continuamente los procesos del Sistema Integrado de Gestión","Gestión Jurídica","Ejercer la defensa judicial y extrajudicial de la entidad y atender requerimientos jurídicos, para salvaguardar sus intereses y cumplir con los requisitos constitucionales y legales","Oportunidad en la respuesta a conceptos de proyectos de acuerdo con los tiempos establecidos","Suministro oportuno de la información de carácter técnico, de oportunidad y conveniencia del proyecto por parte de las dependencias y áreas de la entidad",null,"Porcentaje de solicitudes de concepto a proyectos de acuerdo, decreto o ley atendidas dentro del tiempo establecido","(No. de solicitudes de concepto a proyectos de acuerdo, decreto o ley atendidas dentro del tiempo establecido/Total de solicitudes de concepto a proyectos de acuerdo, decreto o ley recibidas)*100","Gestión","Calidad","Semestral",0.9,"Porcentaje","Matriz de seguimiento a solicitudes Congreso y Concejo","Positiva","No","En el análisis del indicador se presentará la desagregación por proyectos de acuerdo, decreto y ley.",2019,"Marzo"]
["Mejorar continuamente los procesos del Sistema Integrado de Gestión","Gestión Jurídica","Ejercer la defensa judicial y extrajudicial de la entidad y atender requerimientos jurídicos, para salvaguardar sus intereses y cumplir con los requisitos constitucionales y legales","Recuperación de la cartera en mora",null,null,"Porcentaje de procesos de cobro de cartera efectuados","(No. de procesos con etapas de cobro efectuadas/Total de procesos de cobro remitidos con documentación completa)*100","Gestión","Eficacia","Cuatrimestral",1,"Porcentaje","Matriz de seguimiento cobro de cartera","Positiva","No","Los primeros cinco días hábiles de mayo se reportará el indicador con corte a 31 de diciembre del año anterior. \nLos primeros días de septiembre se reportará con corte 30 de abril de la vigencia.\nLos primeros días de enero se reportará con corte a 31 de agosto del año anterior.\nEn el análisis del indicador se presentará la desagregación por etapa (persuasivo y coactivo), así como también el porcentaje de recuperación de cartera.",2019,"Marzo"]
["Mejorar continuamente los procesos del Sistema Integrado de Gestión","Gestión de Comunicaciones","Dar a conocer interna y externamente las actividades, programas y obras que realiza la entidad, para generar apropiación y participación que contribuyan al posicionamiento de la imagen institucional","Exigencia de la solicitud de servicios para todos los procesos con la información completa y detallada de lo requerido","Veracidad de la información reportada por los solicitantes del servicio ",null,"Porcentaje de solicitudes de servicios de comunicaciones atendidas dentro de los tiempos establecidos","(No. de solicitudes de servicio atendidas dentro de los tiempos establecidos/Total de solicitudes de servicio de comunicaciones recibidas)*100","Gestión","Calidad","Trimestral",0.9,"Porcentaje","Consolidado de solicitudes de servicios de comunicaciones","Positiva","No",null,2019,"Marzo",234,238,0.98319327731092432,1.0924369747899159,"Aceptable"]
["Mejorar continuamente los procesos del Sistema Integrado de Gestión","Gestión de Comunicaciones","Dar a conocer interna y externamente las actividades, programas y obras que realiza la entidad, para generar apropiación y participación que contribuyan al posicionamiento de la imagen institucional","Relacionamiento con medios de comunicación","Análisis de los resultados obtenidos mediante el monitoreo de medios para facilitar la toma de decisiones",null,"Impacto de noticias publicadas en medios de comunicación","(No. de noticias positivas o neutras registradas/Total de noticias publicadas en medios de comunicación)*100","Gestión","Eficacia","Trimestral",1,"Porcentaje","Informes mensuales generados por la empresa contratada para realizar el monitoreo de medios","Positiva","No","En el análisis del indicador se presentará el resultado desagregado de noticias positivas y neutras, indicando los principales medios de comunicación.\nSe colocó una meta de 100%, mientras se levanta la línea base con la primera medición.",2019,"Marzo"]
["Mejorar continuamente los procesos del Sistema Integrado de Gestión","Gestión de Comunicaciones","Dar a conocer interna y externamente las actividades, programas y obras que realiza la entidad, para generar apropiación y participación que contribuyan al posicionamiento de la imagen institucional","Seguimiento a los cambios en las condiciones de publicación en redes sociales y página web",null,null,"Tasa de variación en el alcance total de las publicaciones en redes sociales","((Alcance total de publicaciones en el trimestre actual - Alcance total de publicaciones en el trimestre anterior)/Alcance total de publicaciones en el trimestre anterior)*100\n\nDonde:\n\nAlcance total de las publicaciones = Total de usuarios que vieron las publicaciones de redes sociales","Gestión","Eficacia","Trimestral",0.2,"Porcentaje","Métricas nativas de cada red social","Positiva","No","En el análisis del indicador se presentará el resultado desagregado del alcance de las publicaciones por cada red social. ",2019,"Marzo"]
["Mejorar continuamente los procesos del Sistema Integrado de Gestión","Gestión de Comunicaciones","Dar a conocer interna y externamente las actividades, programas y obras que realiza la entidad, para generar apropiación y participación que contribuyan al posicionamiento de la imagen institucional","Análisis de los resultados obtenidos mediante el monitoreo de medios para facilitar la toma de decisiones",null,null,"Salidas publicadas en medios de comunicación","N/A","Gestión","Eficacia","Mensual",80,"Número","Informes mensuales generados por la empresa contratada para realizar el monitoreo de medios","Positiva","No","En el análisis del indicador se presentará el valor estimado de las publicaciones en medios de comunicación.",2019,"Marzo"]
["Mejorar continuamente los procesos del Sistema Integrado de Gestión","Planeación de la Gestión","Establecer directrices para formular y realizar seguimiento a la planeación estratégica y operativa de la entidad con el propósito de contribuir al desarrollo de la misión y objetivos institucionales, así como facilitar la oportunidad y cumplimiento de los resultados esperados","Oportunidad, veracidad y calidad de la información de inversión y gestión",null,null,"Porcentaje de reportes de información presentados dentro de los tiempos programados","(No. de reportes de información elaborados y presentados/Total de reportes de información programados)*100","Gestión","Calidad","Trimestral",1,"Porcentaje","Cronograma de trabajo interno, plan operativo por dependencias (Oficina Asesora de Planeación), plan de adecuación y sostenibilidad SIGD-MIPG","Positiva","No","En el análisis del indicador se desagregará la programación para cada trimestre.",2019,"Abril"]
["Mejorar continuamente los procesos del Sistema Integrado de Gestión","Planeación de la Gestión","Establecer directrices para formular y realizar seguimiento a la planeación estratégica y operativa de la entidad con el propósito de contribuir al desarrollo de la misión y objetivos institucionales, así como facilitar la oportunidad y cumplimiento de los resultados esperados","Oportunidad en el seguimiento de las acciones institucionales para la mejora (correcciones, acciones correctivas, oportunidades de mejora, acciones para abordar riesgos)",null,null,"Porcentaje de acciones de mejora con seguimiento efectuado dentro del Sistema de Gestión","[No. de acciones de mejora con seguimiento efectuado dentro del tiempo programado/Total de acciones de mejora abiertas dentro del Sistema de Gestión de la Calidad (correcciones, acciones correctivas, oportunidades de mejora, acciones para abordar riesgos)]*100","Gestión","Eficacia","Mensual",1,"Porcentaje","Isolución","Positiva","No","En el análisis del indicador se presentará el resultado desagregado por cada tipología de mejora (corrección, acciones correctivas, oportunidades de mejora, acciones para abordar riesgos).",2019,"Abril",80,80,1,1,"Aceptable"]
["Mejorar continuamente los procesos del Sistema Integrado de Gestión","Gestión de Recursos Físicos","Administrar y controlar los bienes muebles y servicios para el funcionamiento administrativo de la entidad","Oportunidad en la atención de requerimientos y necesidades de servicios administrativos",null,null,"Porcentaje de mantenimientos realizados a la infraestructura física de la sede administrativa","(No. de mantenimientos realizados a la infraestructura física/Total de mantenimientos programados a la infraestructura física de la sede administrativa)*100","Gestión","Eficacia","Trimestral",0.9,"Porcentaje","Expendientes contractuales en plataforma ORFEO","Positiva","No",null,2019,"Abril"]
["Mejorar continuamente los procesos del Sistema Integrado de Gestión","Gestión de Asuntos Locales","Desarrollar acciones a nivel local para promover la participación ciudadana, brindar acompañamiento a las alcaldías locales en temas misionales de la entidad y ofertar sus programas","Oportunidad en la emisión del concepto previo y favorable según los tiempos establecidos en la normatividad vigente",null,null,"Porcentaje de conceptos previos tramitados dentro de los términos legales vigentes","(No. de conceptos previos tramitados dentro de los términos legales vigentes/Total de solicitudes de conceptos previos recibidas)*100","Gestión","Calidad","Trimestral",0.5,"Porcentaje","Matriz de seguimiento a conceptos previos tramitados","Positiva","No",null,2019,"Abril"]
["Mejorar continuamente los procesos del Sistema Integrado de Gestión","Control, Evaluación y Seguimiento","Evaluar los controles y la gestión de la entidad con el fin de identificar e implementar acciones de mejora, en pro de la sostenibilidad del Sistema de Control Interno","Pertinencia y oportunidad en la entrega de los resultados del seguimiento a las partes interesadas","Oportunidad y calidad en la información reportada a las entidades competentes del orden nacional y distrital",null,"Porcentaje de informes presentados por la tercera línea de defensa dentro de los tiempos programados","(No. de informes de ley y de gestión elaborados y presentados dentro de los tiempos programados/Total de informes de ley y de gestión a cargo de la tercera línea de defensa )*100  ","Gestión","Calidad","Trimestral",1,"Porcentaje","Plan anual de auditoría\nCronograma presentación de informes","Positiva","No","En el análisis del indicador se presentará el resultado desagregado por cada uno de los informes realizados.",2019,"Abril"]
["Mejorar continuamente los procesos del Sistema Integrado de Gestión","Control, Evaluación y Seguimiento","Evaluar los controles y la gestión de la entidad con el fin de identificar e implementar acciones de mejora, en pro de la sostenibilidad del Sistema de Control Interno","Cumplimiento de los objetivos definidos en el plan de auditoría conforme al plan de pruebas","Cobertura de las unidades a auditar de acuerdo con los parámetros establecidos en la matriz de priorización, en concordancia con los recursos disponibles para la ejecución del Plan Anual de Auditoría",null,"Índice de eficacia de auditorías internas de control interno","(Índice auditoría 1 + índice auditoría 2 +...+Índice auditoría n)/Total de auditorías realizadas\nDonde: \nÍndice auditoría n = Calificación porcentual de la variable Objetivos Específicos*Peso de la variable Objetivos Específicos + Calificación porcentual de la variable Actividad Plan de Auditoría*Peso de la variable Actividad Plan de Auditoría + Calificación porcentual de la variable Oportunidad*Peso de la variable Oportunidad\nPesos de las variables:\nObjetivos Específicos = 40%\nActividades Plan de Auditoría = 30%\nOportunidad = 30%. Esta se medirá tomando como fecha de referencia la de emisión del informe preliminar de auditoría.\nn = número de auditorías realizadas","Gestión","Eficacia","Trimestral",0.85,"Porcentaje","Planes de cada una de las auditorías","Positiva","No","En el análisis del indicador se presentará el resultado desagregado por cada una de las auditorías realizadas.",2019,"Abril",1.94,3,{"$f":"+T253/U253","v":0.64666666666666661},{"$f":"+V253/L253","v":0.76078431372549016},"Tolerable"]
["Mejorar continuamente los procesos del Sistema Integrado de Gestión","Gestión Financiera","Administrar los recursos financieros asignados y realizar los respectivos registros, para el cumplimiento de las funciones de la entidad y pago de sus obligaciones con terceros","Oportunidad en el seguimiento de las partidas pendientes por conciliar",null,null,"Porcentaje de partidas conciliatorias identificadas dentro del tiempo establecido","(No. de partidas conciliatorias identificadas con edad inferior a 60 días/Total de partidas reportadas)*100","Gestión","Calidad","Mensual",0.9,"Porcentaje","Sistema de información SEVEN","Positiva","No",null,2019,"Abril",105,112,0.9375,1.0416666666666667,"Aceptable"]
["Mejorar continuamente los procesos del Sistema Integrado de Gestión","Gestión Financiera","Administrar los recursos financieros asignados y realizar los respectivos registros, para el cumplimiento de las funciones de la entidad y pago de sus obligaciones con terceros","Oportunidad e integridad de la información necesaria para realizar las diferentes conciliaciones",null,null,"Porcentaje de obligaciones contingentes registradas correctamente en la contabilidad","(No. de procesos registrados correctamente en la contabilidad/Total de procesos reportados en SIPROJ Web)*100","Gestión","Calidad","Trimestral",1,"Porcentaje","Sistema de información SEVEN","Positiva","No",null,2019,"Abril"]
["Mejorar continuamente los procesos del Sistema Integrado de Gestión","Gestión Financiera","Administrar los recursos financieros asignados y realizar los respectivos registros, para el cumplimiento de las funciones de la entidad y pago de sus obligaciones con terceros","Oportunidad en la presentación de informes y estados financieros a los diferentes entes de vigilancia y control",null,null,"Porcentaje de notas a los estados financieros reveladas correctamente","(No. de notas sin observaciones por parte de los órganos de control internos y externos/Total de notas a los estados financieros elaboradas)*100","Gestión","Calidad","Anual",0.95,"Porcentaje","Informes de entes de control y vigilancia","Positiva","No",null,2019,"Abril"]
["Mejorar continuamente los procesos del Sistema Integrado de Gestión","Gestión Financiera","Administrar los recursos financieros asignados y realizar los respectivos registros, para el cumplimiento de las funciones de la entidad y pago de sus obligaciones con terceros","Oportunidad en la presentación de informes y estados financieros a los diferentes entes de vigilancia y control","Oportunidad en la presentación de las declaraciones tributarias",null,"Porcentaje de informes financieros presentados a los entes de vigilancia y control dentro de los términos legales vigentes","(No. de informes financieros presentados dentro de los términos legales vigentes/Total de informes financieros a reportar a los entes de vigilancia y control)*100","Gestión","Calidad","Trimestral",1,"Porcentaje","Matriz de seguimiento a la presentación de informes ","Positiva","No",null,2019,"Abril"]
["Satisfacer las necesidades de los usuarios a través de la prestación de servicios eficientes, eficaces y efectivos","Promoción de la Recreación","Desarrollar actividades recreativas en función de las características y necesidades de la población de Bogotá D.C., para promover el aprovechamiento del tiempo libre y el mejoramiento en la calidad de vida","Satisfacción del usuario con las actividades recreativas realizadas",null,null,"Satisfacción de los usuarios con los eventos y/o programas recreativos","(No. de usuarios satisfechos con los eventos y/o programas recreativos/Total de usuarios de eventos y/o programas recreativos encuestados)*100","Gestión","Efectividad","Anual",1,"Porcentaje","Encuesta de satisfacción sobre eventos y/o programas recreativos","Positiva","No","En el análisis del indicador se presentará el resultado desagregado por programa y por cada uno de los aspectos evaluados en la encuesta de satisfacción.\nSe colocó una meta de 100%, mientras se levanta la línea base con la primera medición.",2019,"Abril"]
["Mejorar continuamente los procesos del Sistema Integrado de Gestión","Promoción de la Recreación","Desarrollar actividades recreativas en función de las características y necesidades de la población de Bogotá D.C., para promover el aprovechamiento del tiempo libre y el mejoramiento en la calidad de vida","Cumplimiento del programa de actividades recreativas, teniendo en cuenta lo establecido en las fichas técnicas o según lo concertado con la comunidad e instituciones",null,null,"Porcentaje de actividades recreativas que cumplen con los requisitos para su ejecución","(No. de actividades recreativas que cumplen con los requisitos definidos para su ejecución/Total de actividades recreativas realizadas)*100","Gestión","Eficacia","Trimestral",0.97,"Porcentaje","Sistema de información misional - SIM","Positiva","No","En el análisis del indicador se presentará el resultado desagregado por programa y por actividad.",2019,"Abril"]
["Satisfacer las necesidades de los usuarios a través de la prestación de servicios eficientes, eficaces y efectivos","Fomento al Deporte","Desarrollar e implementar programas deportivos y de actividad física, para contribuir con el mejoramiento de la calidad de vida en la población de Bogotá D.C.","Satisfacción del usuario con las actividades deportivas  realizadas",null,null,"Satisfacción de los usuarios con las actividades realizadas en los programas deportivos","(No. de usuarios satisfechos con las actividades deportivas realizadas/Total de usuarios de actividades deportivas encuestados)*100","Gestión","Efectividad","Anual",1,"Porcentaje","Encuesta de satisfacción sobre actividades/programas deportivos","Positiva","No","En el análisis del indicador se presentará el resultado desagregado por programa y por cada uno de los aspectos evaluados en la encuesta de satisfacción.\nSe colocó una meta de 100%, mientras se levanta la línea base con la primera medición.",2019,"Abril"]
["Mejorar continuamente los procesos del Sistema Integrado de Gestión","Fomento al Deporte","Desarrollar e implementar programas deportivos y de actividad física, para contribuir con el mejoramiento de la calidad de vida en la población de Bogotá D.C.","Cambios comportamentales como resultados de los programas deportivos y de actividad física",null,null,"Cambio comportamental frente a la actividad física y el deporte","(No. de beneficiarios con percepción de cambio comportamental alrededor de las 4 dimensiones de la alfabetización física/Total de beneficiarios de programas deportivos y de actividad física seleccionados en la muestra)*100","Gestión","Efectividad","Anual",1,"Porcentaje","Encuesta para medir las 4 dimensiones de la alfabetización física","Positiva","No","La metodología se aplicará sobre una muestra por cada por cada programa. Se define en 4 tipos de mediciones:\n1. Medición dimensión competencia física. Aplicar test de resistencia, fuerza de torso, habilidades y flexibilidad.\n2. Medición dimensiones: competencia cognitiva, comportamental y motivacional a través de un cuestionario (on-line o presencial).\nSe colocó una meta de 100%, mientras se levanta la línea base con la primera medición.",2019,"Abril"]
["Satisfacer las necesidades de los usuarios a través de la prestación de servicios eficientes, eficaces y efectivos","Servicio a la Ciudadanía","Brindar información y atender los requerimientos de los grupos de valor y de interés de la entidad para responder a sus necesidades en cumplimiento de sus derechos","Oportunidad y calidad en la respuesta a los requerimientos de los grupos de valor e interés de la entidad","Satisfacción del ciudadano frente a las respuestas a sus requerimientos",null,"Satisfacción de peticionarios con la respuesta dada a sus requerimientos","(No. de peticionarios satisfechos con la respuesta dada a sus peticiones, quejas, reclamos y sugerencias/Total de peticionarios contactados)*100","Gestión","Efectividad","Mensual",0.8,"Porcentaje","Base de datos de gestión de PQRS","Positiva","No",null,2019,"Abril",20,24,0.83333333333333337,1.0416666666666667,"Aceptable"]
["Mejorar continuamente los procesos del Sistema Integrado de Gestión","Gestión de Recursos Físicos","Administrar y controlar los bienes muebles y servicios para el funcionamiento administrativo de la entidad","Oportunidad en la atención de requerimientos y necesidades de servicios administrativos",null,null,"Porcentaje de requerimientos de mantenimiento correctivo atendidos en la sede administrativa dentro de los tiempos establecidos","(No. de requerimientos de mantenimiento correctivo atendidos dentro de los tiempos establecidos/Total de requerimientos de mantenimiento correctivo reportados en la sede administrativa)*100","Gestión","Calidad","Trimestral",0.95,"Porcentaje","Aplicativo mesa de ayuda OTRS","Positiva","No",null,2019,"Abril"]
["Mejorar continuamente los procesos del Sistema Integrado de Gestión","Adquisición de Bienes y Servicios","Realizar actividades contractuales para adquirir bienes y servicios con la oportunidad y de acuerdo con las especificaciones establecidas por la entidad","Cumplimiento de requisitos de acuerdo con la modalidad de selección",null,null,"Porcentaje de procesos de selección publicados dentro del tiempo establecido","(No. de actos de apertura de procesos de selección publicados en un tiempo menor o igual a 30 días hábiles después de la radicación/Total de actos de apertura expedidos)*100","Gestión","Calidad","Trimestral",0.9,"Porcentaje","Plataforma ORFEO y SECOP","Positiva","No","En el análisis del indicador se presentará el resultado desagregado para licitación pública, concurso de méritos y selección abreviada.",2019,"Abril"]
["Mejorar continuamente los procesos del Sistema Integrado de Gestión","Adquisición de Bienes y Servicios","Realizar actividades contractuales para adquirir bienes y servicios con la oportunidad y de acuerdo con las especificaciones establecidas por la entidad","Oportunidad en la suscripción y legalización del contrato",null,null,"Porcentaje de contratos legalizados dentro del tiempo establecido","(No. de contratos legalizados en un tiempo menor o igual a 10 días hábiles a partir del acto administrativo de adjudicación/Total de procesos de selección adjudicados)*100","Gestión","Calidad","Mensual",0.8,"Porcentaje","SECOP y Plataforma ORFEO ","Positiva","No","En el análisis del indicador se presentará el resultado desagregado para licitación pública, concurso de méritos y selección abreviada.",2019,"Abril"]
["Mejorar continuamente los procesos del Sistema Integrado de Gestión","Adquisición de Bienes y Servicios","Realizar actividades contractuales para adquirir bienes y servicios con la oportunidad y de acuerdo con las especificaciones establecidas por la entidad","Definición clara y precisa de requisitos técnicos, financieros, económicos, jurídicos y de riesgos de acuerdo con el bien o servicio a adquirir",null,null,"Porcentaje de procesos de obra tramitados en análisis de costos dentro del tiempo establecido","(No. de procesos de obra (todas las Subdirecciones) tramitados en oportunidad al recibo del memorando con la solicitud estudio del sector (20 días)/Total de procesos de obra recibidos)*100","Gestión","Calidad","Trimestral",1,"Porcentaje","Matriz de tráfico ACEE","Positiva","No",null,2019,"Abril"]
["Mejorar continuamente los procesos del Sistema Integrado de Gestión","Adquisición de Bienes y Servicios","Realizar actividades contractuales para adquirir bienes y servicios con la oportunidad y de acuerdo con las especificaciones establecidas por la entidad","Definición clara y precisa de requisitos técnicos, financieros, económicos, jurídicos y de riesgos de acuerdo con el bien o servicio a adquirir",null,null,"Porcentaje de procesos diferentes a obra tramitados en análisis de costos dentro del tiempo establecido","(No. de procesos diferentes a obra tramitados en oportunidad al recibo del memorando con la solicitud estudio del sector (10 días hábiles)/Total de procesos recibidos diferentes a obra)*100","Gestión","Calidad","Trimestral",0.9,"Porcentaje","Matriz de tráfico ACEE","Positiva","No","En el análisis del indicador se presentará el resultado desagregado para procesos diferentes a obra.",2019,"Abril"]
["Mejorar continuamente los procesos del Sistema Integrado de Gestión","Adquisición de Bienes y Servicios","Realizar actividades contractuales para adquirir bienes y servicios con la oportunidad y de acuerdo con las especificaciones establecidas por la entidad","Definición clara y precisa de requisitos técnicos, financieros, económicos, jurídicos y de riesgos de acuerdo con el bien o servicio a adquirir",null,null,"Porcentaje de procesos requeridos por precios artificialmente bajos","(No. de procesos (excepto Subastas SAS) requeridos por precios artificialmente bajos/Total de procesos evaluados)*100","Gestión","Calidad","Trimestral",0.15,"Porcentaje","Evaluación económica de los proponentes\n\nAnálisis de precios realizado por la ACEE","Negativa","No","En el análisis del indicador se presentará el resultado desagregado por tipo de proceso.",2019,"Abril"]
["Mejorar continuamente los procesos del Sistema Integrado de Gestión","Control, Evaluación y Seguimiento","Evaluar los controles y la gestión de la entidad con el fin de identificar e implementar acciones de mejora, en pro de la sostenibilidad del Sistema de Control Interno","Pertinencia y oportunidad en la entrega de los resultados del seguimiento a las partes interesadas",null,null,"Porcentaje de acciones de mejoramiento interno con seguimiento efectuado","(No. de acciones de mejoramiento interno con seguimiento efectuado)/Total de acciones de mejoramiento interno abiertas de auditorías internas de control interno)*100","Gestión","Eficacia","Trimestral",1,"Porcentaje","Plataforma Isolución","Positiva","No","En el análisis del indicador se presentará el resultado desagregado por proceso.",2019,"Abril"]
["Mejorar continuamente los procesos del Sistema Integrado de Gestión","Control, Evaluación y Seguimiento","Evaluar los controles y la gestión de la entidad con el fin de identificar e implementar acciones de mejora, en pro de la sostenibilidad del Sistema de Control Interno","Pertinencia y oportunidad en la entrega de los resultados del seguimiento a las partes interesadas",null,null,"Porcentaje de acciones de mejoramiento externo con seguimiento efectuado","(No. de acciones de mejoramiento externo con seguimiento efectuado)/Total de acciones de mejoramiento externo abiertas de auditorías externas)*100","Gestión","Eficacia","Trimestral",1,"Porcentaje","Matrices de consolidación del estado de las acciones de los diferentes entes de control y vigilancia","Positiva","No","En el análisis del indicador se presentará el resultado desagregado por auditoría externa.",2019,"Abril"]
["Mejorar continuamente los procesos del Sistema Integrado de Gestión","Gestión Financiera","Administrar los recursos financieros asignados y realizar los respectivos registros, para el cumplimiento de las funciones de la entidad y pago de sus obligaciones con terceros","Oportunidad en la expedición de los certificados presupuestales y en la presentación de los informes de ejecución",null,null,"Porcentaje de ejecución presupuestal en gastos de funcionamiento","(Presupuesto de funcionamiento ejecutado/Presupuesto disponible de funcionamiento)*100","Gestión","Eficiencia","Mensual",0.95,"Porcentaje","Ejecución presupuestal en SEVEN","Positiva","Si","La meta es anual con medición y análisis mensual.\nLa medición está a cargo del Área Financiera y el análisis a cargo de la Subdirección Administrativa y Financiera.\nLa medición y el análisis se deben realizar a más tardar el quinto día hábil de cada mes.\nUna vez se realice el Comité Financiero, el Área Financiera debe enviar a la Oficina Asesora de Planeación la presentación correspondiente, con el análisis respectivo en cuanto al desempeño del indicador.",2019,"Abril",10750659033,35208442000,0.30534321947560189,{"$f":"+V271/L271","v":0.3214139152374757},null,"La ejecución presupuestal de los gastos de funcionamiento se presenta de manera positiva  de acuerdo al tiempo trascurrido  a la fecha de la medición. "]
["Mejorar continuamente los procesos del Sistema Integrado de Gestión","Gestión Financiera","Administrar los recursos financieros asignados y realizar los respectivos registros, para el cumplimiento de las funciones de la entidad y pago de sus obligaciones con terceros","Oportunidad en la expedición de los certificados presupuestales y en la presentación de los informes de ejecución","Oportunidad en la autorización de giro de los recursos de transferencia",null,"Porcentaje de ejecución presupuestal en gastos de inversión","(Presupuesto de inversión ejecutado/Presupuesto disponible de inversión)*100","Gestión","Eficiencia","Mensual",1,"Porcentaje","Ejecución presupuestal en SEVEN","Positiva","Si","La meta es anual con medición y análisis mensual.\nLa medición está a cargo del Área Financiera y el análisis a cargo de los Ordenadores del Gasto.\nLa medición y el análisis se deben realizar a más tardar el quinto día hábil de cada mes.\nUna vez se realice el Comité Financiero, el Área Financiera debe enviar a la Oficina Asesora de Planeación la presentación correspondiente, con el análisis respectivo en cuanto al desempeño del indicador.",2019,"Abril",269557310638,742020022000,0.36327498267694991,0.36327498267694991,null,"La ejecución presupuestal de los gastos de inversión al cierre de abril de 2019, presenta un acumulado de 36,33%, lo cual se encuentra acorde con el mes objeto de medición."]
["Mejorar continuamente los procesos del Sistema Integrado de Gestión","Gestión Financiera","Administrar los recursos financieros asignados y realizar los respectivos registros, para el cumplimiento de las funciones de la entidad y pago de sus obligaciones con terceros","Oportunidad en el pago de las obligaciones financieras de la entidad",null,null,"Porcentaje de ejecución del programa anual de caja","(Recursos ejecutados de reserva, vigencia y pasivos exigibles/Recursos programados de reserva, vigencia y pasivos exigibles)*100","Gestión","Eficiencia","Mensual",1,"Porcentaje","Sistema de información SEVEN","Positiva","Si","La meta es anual con medición y análisis mensual.\nLa medición está a cargo del Área Financiera y el análisis a cargo de los Ordenadores del Gasto.\nLa medición y el análisis se deben realizar a más tardar el quinto día hábil de cada mes.\nUna vez se realice el Comité Financiero, el Área Financiera debe enviar a la Oficina Asesora de Planeación la presentación correspondiente, con el análisis respectivo en cuanto al desempeño del indicador.",2019,"Abril",43668,45344,0.96303810868031048,0.96303810868031048]
["Mejorar continuamente los procesos del Sistema Integrado de Gestión","Gestión Financiera","Administrar los recursos financieros asignados y realizar los respectivos registros, para el cumplimiento de las funciones de la entidad y pago de sus obligaciones con terceros","Oportunidad en el pago de las obligaciones financieras de la entidad","Oportunidad en la causación de ordenes de pago que cumplan con todos los requisitos establecidos","Oportunidad y veracidad de la información necesaria para la causación de las ordenes de pago reportada por los ordenadores del gasto","Porcentaje de cuentas individuales pagadas dentro del tiempo establecido","(No. de cuentas individuales pagadas en un tiempo menor o igual a 6 días/Total de cuentas de pago individuales tramitadas)*100 ","Gestión","Calidad","Mensual",1,"Porcentaje","Bitácora de cuentas en SEVEN","Positiva","No","La medición y el análisis están a cargo del Área Financiera.\nEn el análisis del indicador se presentará el resultado del tiempo promedio en cada una de las etapas para el pago, según la bitácora de cuentas de SEVEN.",2019,"Abril",239,240,0.99583333333333335,0.99583333333333335,{"$f":"_xlfn.IFS(W274<=69%,\"Crítico\",W274>=90%,\"Aceptable\",W274>=70%,\"Tolerable\")","v":"Aceptable"}]
["Mejorar continuamente los procesos del Sistema Integrado de Gestión","Gestión Financiera","Administrar los recursos financieros asignados y realizar los respectivos registros, para el cumplimiento de las funciones de la entidad y pago de sus obligaciones con terceros","Oportunidad en el pago de las obligaciones financieras de la entidad","Oportunidad en la causación de ordenes de pago que cumplan con todos los requisitos establecidos","Oportunidad y veracidad de la información necesaria para la causación de las ordenes de pago reportada por los ordenadores del gasto","Porcentaje de cuentas colectivas pagadas dentro del tiempo establecido","(No. de cuentas colectivas pagadas en un tiempo menor o igual a 10 días/Total de cuentas de pago colectivas tramitadas)*100","Gestión","Calidad","Mensual",1,"Porcentaje","Bitácora de cuentas en SEVEN","Positiva","No","La medición y el análisis están a cargo del Área Financiera.\nEn el análisis del indicador se debe presentar el resultado del tiempo promedio en cada una de las etapas para el pago, según la bitácora de cuentas de SEVEN.",2019,"Abril",78,78,1,1,{"$f":"_xlfn.IFS(W275<=69%,\"Crítico\",W275>=90%,\"Aceptable\",W275>=70%,\"Tolerable\")","v":"Aceptable"}]
["Implementar las políticas y líneas de acción para la preservación e integridad de la documentación","Gestión Documental","Administrar, conservar y custodiar la documentación generada en la entidad, desde su origen hasta su disposición final, para preservar la memoria institucional","Actualización del inventario documental en el Formato Único de Inventario Documental, con base en la aplicación de las tablas de retención documental","Cumplimiento de los tiempos de retención documental establecidos en las tablas","Actualización de los instrumentos archivísticos","Porcentaje de inventario validado del fondo documental acumulado del archivo central","(No. de metros lineales de inventario validado en cuanto a series, subseries, asuntos y oficinas productoras/Total de metros lineales de archivo inventariado en estado natural del archivo central)*100 ","Gestión","Eficacia","Mensual",1,"Porcentaje","Matriz de seguimiento a inventario documental","Positiva","Si","La meta es anual con medición y análisis mensual",2019,"Abril",667.9,2180.5,0.30630589314377438,0.30630589314377438,null,"El avance del inventario validado (control de calidad) del fondo documental acumulado del archivo central ubicado en la sede, muestra un avance significativo del 30,63% de los inventarios cotejados durante el periodo febrero-marzo-abril. "]
["Implementar las políticas y líneas de acción para la preservación e integridad de la documentación","Gestión Documental","Administrar, conservar y custodiar la documentación generada en la entidad, desde su origen hasta su disposición final, para preservar la memoria institucional","Oportunidad en las transferencias documentales de acuerdo con los tiempos de retención establecidos en las tablas",null,null,"Porcentaje de transferencias primarias realizadas de acuerdo con los tiempos de retención","(No. de transferencias primarias realizadas de acuerdo con los tiempos de retención establecidos en las TRD/Total de transferencias documentales programadas)*100","Gestión","Eficacia","Mensual",0.8,"Porcentaje","Matriz de seguimiento a transferencias documentales","Positiva","Si","La meta es anual con medición y análisis mensual",2019,"Abril",12,33,0.36363636363636365,0.45454545454545453,null,"El avance del Plan de Transferencias primarias 2019, alcanzo un 36,36% de avance representado en 12 transferencias que se consolidaron entre el periodo enero a abril de 2019 que comprometió 7 oficinas dentro de las que se cuentan Dirección General(2), Tesorería(4), Promoción de Servicios, Admón. de Escenarios(2), Subdirección de Contratación, Presupuesto y el Área Técnica de Construcciones, de las cuales se suscribió el Acta respectiva por cada una, transferencias autorizadas por Archivo de acuerdo a la aplicación de la TRD de cada dependencia y el tiempo de retención de la serie. Se anexa cuadro resumen que detalla cada una de ellas"]
["Implementar las políticas y líneas de acción para la preservación e integridad de la documentación","Gestión Documental","Administrar, conservar y custodiar la documentación generada en la entidad, desde su origen hasta su disposición final, para preservar la memoria institucional","Cumplimiento de los estándares de temperatura, humedad relativa y luminosidad de los espacios de almacenamiento de material documental, dentro de los rangos establecidos en la normatividad vigente",null,null,"Porcentaje de espacios controlados para la conservación documental","(No. de espacios monitoreados e intervenidos/Total de espacios monitoreados)*100","Gestión","Eficacia","Mensual",1,"Porcentaje","Informe de monitoreo de espacios controlados","Positiva","No","La medición es mes vencido",2019,"Abril",8,8,1,1,{"$f":"_xlfn.IFS(W278<=69%,\"Crítico\",W278>=90%,\"Aceptable\",W278>=70%,\"Tolerable\")","v":"Aceptable"},"En el mes de abril se monitorearon 8 espacios de los cuales en 6 hubo necesidad de intervenir para controlar los picos de temperatura y/o humedad relativa, debido a las constantes lluvias que se dieron en este mes, mostrando el indicador que en 2 depósitos estas variables presentaron un comportamiento estable; El análisis muestra en cuadro adjunto el detalle de cada uno, al igual que en los archivos en Excel de los monitoreos de cada espacio."]
["Mejorar continuamente los procesos del Sistema Integrado de Gestión","Servicio a la Ciudadanía","Brindar información y atender los requerimientos de los grupos de valor y de interés de la entidad para responder a sus necesidades en cumplimiento de sus derechos","Oportunidad y calidad en la respuesta a los requerimientos de los grupos de valor e interés de la entidad",null,null,"Porcentaje de peticiones, quejas, reclamos y sugerencias contestadas dentro de los términos legales vigentes","(No. de peticiones, quejas, reclamos y sugerencias contestadas en el aplicativo SDQS dentro de los términos legales vigentes/Total de peticiones, quejas, reclamos y sugerencias recibidas)*100","Gestión","Calidad","Mensual",1,"Porcentaje","Sistema SDQS","Positiva","No","La medición es mes vencido",2019,"Abril",250,280,0.8928571428571429,0.8928571428571429,"Tolerable"]
["Satisfacer las necesidades de los usuarios a través de la prestación de servicios eficientes, eficaces y efectivos","Servicio a la Ciudadanía","Brindar información y atender los requerimientos de los grupos de valor y de interés de la entidad para responder a sus necesidades en cumplimiento de sus derechos","Satisfacción del ciudadano frente a la atención brindada por la entidad",null,null,"Satisfacción del ciudadano con la atención recibida en los SUPERCADE","(No. de ciudadanos satisfechos con la atención recibida en los SUPERCADE/Total de ciudadanos atendidos en los SUPERCADE)*100","Gestión","Efectividad","Mensual",0.95,"Porcentaje","Encuesta de satisfacción con la atención brindada en SUPERCADES","Positiva","No",null,2019,"Abril",2357,2358,0.99957591178965222,1.0521851703048972,"Aceptable"]
["Mejorar continuamente los procesos del Sistema Integrado de Gestión","Servicio a la Ciudadanía","Brindar información y atender los requerimientos de los grupos de valor y de interés de la entidad para responder a sus necesidades en cumplimiento de sus derechos","Oportunidad en la actualización de la información publicada en la sección de ley de transparencia en la página web de la entidad",null,null,"Porcentaje de información actualizada en ley de transparencia","(No. de subcategorías con información actualizada en la página web/Total de subcategorías definidas en ley de transparencia)*100","Gestión","Eficacia","Trimestral",1,"Porcentaje","Página web","Positiva","No",null,2019,"Abril",52,56,0.9285714285714286,0.9285714285714286,"Aceptable"]
["Mejorar continuamente los procesos del Sistema Integrado de Gestión","Servicio a la Ciudadanía","Brindar información y atender los requerimientos de los grupos de valor y de interés de la entidad para responder a sus necesidades en cumplimiento de sus derechos","Coherencia, claridad, solución de fondo, calidez y manejo del sistema en relación con los requerimientos atendidos por la entidad",null,null,"Porcentaje de requerimientos atendidos con oportunidad y calidad","(No. de respuestas a requerimientos sin observaciones en cuanto a los criterios de oportunidad y calidad/Total de requerimientos evaluados en el aplicativo SDQS)*100","Gestión","Eficacia","Mensual",0.8,"Porcentaje","SDQS y base de datos de gestión de PQRS","Positiva","No","La medición es mes vencido",2019,"Abril",194,238,0.81512605042016806,1.01890756302521,"Aceptable"]
["Implementar buenas prácticas ambientales para la prevención de la contaminación en el marco de una Bogotá que defiende lo público en su función administrativa y de desarrollo institucional","Gestión de Recursos Físicos","Administrar y controlar los bienes muebles y servicios para el funcionamiento administrativo de la entidad","Calificación de la implementación del Plan Institucional de Gestión Ambiental, por parte de la Secretaría Distrital de Ambiente","Oportunidad en el reporte de formularios y registros electrónicos del PIGA ante la Secretaría Distrital de Ambiente",null,"Índice de implementación del PIGA","Promedio ponderado de cumplimiento de aspectos normativos y de implementación del PIGA, según auditoría realizada por la Secretaría Distrital de Ambiente en cada vigencia","Gestión","Eficacia","Anual",0.7,"Porcentaje","Informe de auditoría anual realizada por la Secretaría Distrital de Ambiente","Positiva","No","En el análisis del indicador se presentará el resultado desagregado por cada uno de los aspectos evaluados en la visita de control y seguimiento por parte de la Secretaría Distrital de Ambiente.\nLa meta está configurada como mayor a 70%.",2019,"Abril"]
["Proteger la integridad, confidencialidad y disponibilidad de la información","Gestión de Tecnología de la Información y las Comunicaciones","Proporcionar soluciones estratégicas de tecnologías de la información y las comunicaciones, para contribuir con la eficiencia administrativa, la mejora de los trámites y servicios y la protección de los activos de información de la entidad","Impacto del plan de remediación frente a las vulnerabilidades identificadas","Aseguramiento de incidencias en la seguridad de la información que afecten la confidencialidad, integridad y disponibilidad",null,"Porcentaje de remediación de vulnerabilidades de seguridad de la información","(No. de vulnerabilidades críticas o altas remediadas/Total de vulnerabilidades de seguridad de la información detectadas como críticas o altas)*100 ","Gestión","Eficacia","Anual",0.7,"Porcentaje","Matriz de vulnerabilidades","Positiva","No","La meta está configurada como mínimo 70%.",2019,"Abril"]
["Proteger la integridad, confidencialidad y disponibilidad de la información","Gestión de Tecnología de la Información y las Comunicaciones","Proporcionar soluciones estratégicas de tecnologías de la información y las comunicaciones, para contribuir con la eficiencia administrativa, la mejora de los trámites y servicios y la protección de los activos de información de la entidad","Avances en la implementación de gobierno digital de acuerdo con los componentes evaluados por MINTIC",null,null,"Índice de implementación de gobierno digital","Sumatoria de la calificación obtenida por cada componente/Total de componentes de la política de gobierno digital","Gestión","Eficacia","Anual",0.65,"Porcentaje","Instrumento de medición suministrado para el seguimiento a la política de gobierno digital  ","Positiva","No","En el análisis del indicador se presentará el resultado desagregado de las calificaciones obtenidas en cada componente de la política de seguridad digital.",2019,"Abril"]
["Mejorar continuamente los procesos del Sistema Integrado de Gestión","Gestión de Tecnología de la Información y las Comunicaciones","Proporcionar soluciones estratégicas de tecnologías de la información y las comunicaciones, para contribuir con la eficiencia administrativa, la mejora de los trámites y servicios y la protección de los activos de información de la entidad","Cumplimiento del Plan Estratégico de Tecnologías de la Información PETI",null,null,"Porcentaje de avance en proyectos de TI","(No. de hitos en proyectos de TI alcanzados/Total de hitos en proyectos de TI programados en la vigencia)*100","Gestión","Eficacia","Semestral",1,"Porcentaje","Cronograma de proyectos del PETI","Positiva","Si","La meta es anual con medición y análisis semestral.",2019,"Abril"]
["Proteger la integridad, confidencialidad y disponibilidad de la información","Gestión de Tecnología de la Información y las Comunicaciones","Proporcionar soluciones estratégicas de tecnologías de la información y las comunicaciones, para contribuir con la eficiencia administrativa, la mejora de los trámites y servicios y la protección de los activos de información de la entidad","Disponibilidad de los sistemas de información de la entidad",null,null,"Porcentaje de disponibilidad de los sistemas de información","(No. de horas disponibles de los sistemas de información/Total de horas en servicio de los sistemas de información)*100","Gestión","Eficiencia","Mensual",0.9,"Porcentaje","Herramienta de monitoreo ZABBIX","Positiva","No","En el análisis del indidicador se presentará el resultado desagregado de disponibilidad en ORFEO, SEVEN, KACTUS y SIM.\nLa meta está configurada como mayor o igual a 90%.",2019,"Abril",717.625,720,{"$f":"+T287/U287","v":0.99670138888888893},1.107445987654321,{"$f":"_xlfn.IFS(W287<=69%,\"Crítico\",W287>=90%,\"Aceptable\",W287>=70%,\"Tolerable\")","v":"Aceptable"}]
["Mejorar continuamente los procesos del Sistema Integrado de Gestión","Gestión de Tecnología de la Información y las Comunicaciones","Proporcionar soluciones estratégicas de tecnologías de la información y las comunicaciones, para contribuir con la eficiencia administrativa, la mejora de los trámites y servicios y la protección de los activos de información de la entidad","Disponibilidad de los servicios de comunicaciones en la entidad, según los acuerdos de niveles de servicios establecidos",null,null,"Porcentaje de disponibilidad de los servicios de comunicaciones","(No. de horas disponibles de los servicios de comunicaciones /Total de horas de los servicios de comunicaciones)*100","Gestión","Eficiencia","Mensual",0.9,"Porcentaje","Herramienta de monitoreo ZABBIX","Positiva","No","En el análisis del indidicador se presentará el resultado desagregado de disponibilidad en Internet y Telefonía IP.\nLa meta está configurada como mayor o igual a 90%.",2019,"Abril",719.99,720,0.99998611111111113,1.1110956790123456,"Aceptable"]
["Mejorar continuamente los procesos del Sistema Integrado de Gestión","Gestión de Tecnología de la Información y las Comunicaciones","Proporcionar soluciones estratégicas de tecnologías de la información y las comunicaciones, para contribuir con la eficiencia administrativa, la mejora de los trámites y servicios y la protección de los activos de información de la entidad","Incidencias reportadas en el funcionamiento del módulo o sistema de información implementado","Cumplimiento de los acuerdos de niveles de servicios establecidos",null,"Porcentaje de solicitudes de servicio tecnológico atendidas dentro de los tiempos establecidos","(No. de solicitudes atendidas dentro de los tiempos establecidos en los acuerdos de nivel de servicio/Total de solicitudes de servicio tecnológico recibidas)*100","Gestión","Calidad","Mensual",0.9,"Porcentaje","Herramienta GLPI","Positiva","No",null,2019,"Abril",824,842,0.97862232779097391,1.0873581419899709,"Aceptable"]
["Mejorar continuamente los procesos del Sistema Integrado de Gestión","Gestión de Talento Humano","Gestionar el potencial del talento humano como factor estratégico, para contribuir con el desarrollo de la entidad en un ambiente seguro y saludable","Cumplimiento de compromisos y competencias del servidor público en el desempeño laboral","Oportunidad en el seguimiento y la evaluación anual u ordinaria del servidor público para continuar su permanencia en el servicio",null,"Índice de desempeño laboral de funcionarios","(Sumatoria de calificaciones finales de la evaluación de desempeño de los funcionarios/Total de funcionarios evaluados)*100","Gestión","Eficacia","Anual",0.9,"Porcentaje","Consolidado de las calificaciones finales de la evaluación de desempeño","Positiva","No","En el análisis del indicador se presentará el resultado desagregado por niveles jerárquicos y comparar con la evaluación de las áreas.\nLa meta está configurada como mayor a 90%.\nNota: Se mide para vigencia 2018-2019.",2019,"Abril"]
["Mejorar continuamente los procesos del Sistema Integrado de Gestión","Gestión de Talento Humano","Gestionar el potencial del talento humano como factor estratégico, para contribuir con el desarrollo de la entidad en un ambiente seguro y saludable","Cobertura de servidores públicos en las actividades del plan de bienestar e incentivos",null,null,"Porcentaje de funcionarios que participan en las actividades del plan de bienestar e incentivos","(No. de funcionarios participantes en las actividades del plan de bienestar e incentivos/Total de funcionarios de la entidad)*100 ","Gestión","Eficacia","Semestral",0.8,"Porcentaje","Registros de asistencia a las actividades del plan de bienestar","Positiva","No",null,2019,"Abril"]
["Mejorar continuamente los procesos del Sistema Integrado de Gestión","Gestión de Talento Humano","Gestionar el potencial del talento humano como factor estratégico, para contribuir con el desarrollo de la entidad en un ambiente seguro y saludable","Cobertura de servidores públicos en las actividades del plan institucional de capacitación",null,null,"Porcentaje de funcionarios que asisten a las actividades del plan institucional de capacitación","(No. de funcionarios asistentes a las actividades del plan institucional de capacitación/Total de funcionarios citados a las actividades del plan institucional de capacitación)*100","Gestión","Eficacia","Semestral",0.8,"Porcentaje","Registros de asistencia a las actividades del plan de capacitación","Positiva","No","Las capacitaciones que se incluyen en el indicador son las que implican recursos.",2019,"Abril"]
["Mejorar continuamente los procesos del Sistema Integrado de Gestión","Gestión de Talento Humano","Gestionar el potencial del talento humano como factor estratégico, para contribuir con el desarrollo de la entidad en un ambiente seguro y saludable","Evaluación del impacto de la capacitación en el desempeño de los servidores públicos y de la entidad",null,null,"Impacto de la capacitación en el desempeño laboral de funcionarios","(No. de funcionarios con capacitaciones efectivas/Total de funcionarios evaluados)*100","Gestión","Eficacia","Trimestral",0.95,"Porcentaje","Consolidado de las evaluaciones de impacto de la capacitación","Positiva","No",null,2019,"Abril"]
["Mejorar continuamente los procesos del Sistema Integrado de Gestión","Gestión de Talento Humano","Gestionar el potencial del talento humano como factor estratégico, para contribuir con el desarrollo de la entidad en un ambiente seguro y saludable","Satisfacción de los servidores públicos frente a las actividades de  bienestar e incentivos","Satisfacción de los servidores públicos frente a las actividades de capacitación",null,"Índice de clima organizacional","Promedio ponderado de las dimensiones evaluadas en la encuesta de medición de clima organizacional","Gestión","Eficacia","Anual",0.8,"Porcentaje","Informe de medición de clima organizacional","Positiva","No","En el análisis del indicador se presentará el resultado desagregado por áreas y/o dependencias, y por las dimensiones evaluadas.",2019,"Abril"]
["Mejorar continuamente los procesos del Sistema Integrado de Gestión","Gestión de Talento Humano","Gestionar el potencial del talento humano como factor estratégico, para contribuir con el desarrollo de la entidad en un ambiente seguro y saludable","Cumplimiento del plan anual de  bienestar e incentivos",null,null,"Porcentaje de ejecución del plan anual de bienestar e incentivos","(No. de actividades de bienestar e incentivos desarrolladas/Total de actividades programadas en el plan anual de bienestar e incentivos)*100","Gestión","Eficacia","Semestral",1,"Porcentaje","Matriz de seguimiento a la ejecución de actividades de bienestar e incentivos","Positiva","Si","La meta es anual con medición y análisis semestral.",2019,"Abril"]
["Mejorar continuamente los procesos del Sistema Integrado de Gestión","Gestión de Talento Humano","Gestionar el potencial del talento humano como factor estratégico, para contribuir con el desarrollo de la entidad en un ambiente seguro y saludable","Cumplimiento del plan institucional de capacitación",null,null,"Porcentaje de ejecución del plan institucional de capacitación","(No. de actividades de capacitación desarrolladas/Total de actividades programadas en el plan institucional de capacitación)*100","Gestión","Eficacia","Semestral",1,"Porcentaje","Matriz de seguimiento a la ejecución de actividades de capacitación","Positiva","Si","La meta es anual con medición y análisis semestral.",2019,"Abril"]
["Prevenir los factores que afecten la salud y seguridad a fin de mejorar las condiciones del ambiente de trabajo","Gestión de Talento Humano","Gestionar el potencial del talento humano como factor estratégico, para contribuir con el desarrollo de la entidad en un ambiente seguro y saludable","Cumplimiento del plan anual de trabajo",null,null,"Porcentaje de ejecución del plan anual de seguridad y salud en el trabajo","(No. de actividades de seguridad y salud desarrolladas/Total de actividades programadas en el plan anual de seguridad y salud en el trabajo)*100","Gestión","Eficacia","Mensual",0.95,"Porcentaje","Plan de trabajo anual del Sistema de Gestión de Seguridad y Salud en el Trabajo","Positiva","No",null,2019,"Abril",117,132,0.88636363636363635,0.93301435406698563,{"$f":"_xlfn.IFS(W297<=69%,\"Crítico\",W297>=90%,\"Aceptable\",W297>=70%,\"Tolerable\")","v":"Aceptable"}]
["Prevenir los factores que afecten la salud y seguridad a fin de mejorar las condiciones del ambiente de trabajo","Gestión de Talento Humano","Gestionar el potencial del talento humano como factor estratégico, para contribuir con el desarrollo de la entidad en un ambiente seguro y saludable","Tasa de accidentalidad",null,null,"Tasa de accidentalidad","(No. de accidentes de trabajo reportados/Total de trabajadores (funcionarios y contratistas)*100","Gestión","Efectividad","Mensual",0.04,"Porcentaje","Matriz de accidentes de trabajo","Negativa","No","La meta está configurada como menor o igual a 4%.",2019,"Abril",29,2825,1.0265486725663717E-2,{"$f":"((L298-V298)+L298)/L298","v":1.7433628318584071},"Aceptable"]
["Prevenir los factores que afecten la salud y seguridad a fin de mejorar las condiciones del ambiente de trabajo","Gestión de Talento Humano","Gestionar el potencial del talento humano como factor estratégico, para contribuir con el desarrollo de la entidad en un ambiente seguro y saludable","Incidencia y prevalencia de enfermedades laborales",null,null," Prevalencia de la enfermedad laboral","(No. de casos de enfermedad laboral calificada/Total de funcionarios)*100","Gestión","Efectividad","Trimestral",0.02,"Porcentaje","Matriz de seguimiento de enfermedades laborales","Negativa","No","La meta está configurada como menor o igual a 2%.",2019,"Abril"]
["Prevenir los factores que afecten la salud y seguridad a fin de mejorar las condiciones del ambiente de trabajo","Gestión de Talento Humano","Gestionar el potencial del talento humano como factor estratégico, para contribuir con el desarrollo de la entidad en un ambiente seguro y saludable","Incidencia y prevalencia de enfermedades laborales",null,null,"Incidencia de la enfermedad laboral","(No. de casos nuevos de enfermedad laboral calificados/Total de funcionarios)*100","Gestión","Efectividad","Trimestral",0.01,"Porcentaje","Matriz de seguimiento de enfermedades laborales","Negativa","No","La meta está configurada como menor o igual a 1%.",2019,"Abril"]
["Mejorar continuamente los procesos del Sistema Integrado de Gestión","Gestión de Recursos Físicos","Administrar y controlar los bienes muebles y servicios para el funcionamiento administrativo de la entidad","Confiabilidad del inventario de bienes devolutivos",null,null,"Porcentaje de inventario individual validado físicamente","(No. de elementos devolutivos del inventario individual validados físicamente/Total de elementos devolutivos del inventario individual registrados en el sistema de información SEVEN)*100 ","Gestión","Eficacia","Anual",1,"Porcentaje","Sistema de información SEVEN","Positiva","No",null,2019,"Abril"]
["Mejorar continuamente los procesos del Sistema Integrado de Gestión","Gestión de Recursos Físicos","Administrar y controlar los bienes muebles y servicios para el funcionamiento administrativo de la entidad","Confiabilidad del inventario de bienes devolutivos",null,null,"Porcentaje de inventario aleatorio validado físicamente en bodega","(No. de elementos devolutivos y de consumo en bodegas validados físicamente/Muestra de inventario de elementos devolutivos y de consumo registrados en el sistema de información SEVEN)*100 ","Gestión","Eficacia","Trimestral",1,"Porcentaje","Sistema de información SEVEN","Positiva","No",null,2019,"Abril"]
["Mejorar continuamente los procesos del Sistema Integrado de Gestión","Gestión de Asuntos Locales","Desarrollar acciones a nivel local para promover la participación ciudadana, brindar acompañamiento a las alcaldías locales en temas misionales de la entidad y ofertar sus programas","Cumplimiento de los compromisos adquiridos por la entidad, en el marco de las instancias de participación locales",null,null,"Porcentaje de compromisos atendidos en el marco de las instancias de participación locales","(No. de compromisos atendidos en las instancias Consejo Local de Gobierno, Unidad de Apoyo Técnico y Comisión Local Intersectorial de Participación /Total de compromisos generados en las instancias Consejo Local de Gobierno, Unidad de Apoyo Técnico y Comisión Local Intersectorial de Participación)*100","Gestión","Eficacia","Trimestral",1,"Porcentaje","Matriz de seguimiento a compromisos derivados de instancias de participación locales","Positiva","No",null,2019,"Abril"]
["Mejorar continuamente los procesos del Sistema Integrado de Gestión","Gestión de Asuntos Locales","Desarrollar acciones a nivel local para promover la participación ciudadana, brindar acompañamiento a las alcaldías locales en temas misionales de la entidad y ofertar sus programas","Efectividad en la atención de la demanda de actividades recreodeportivas en las localidades de Bogotá",null,null,"Porcentaje de actividades recreativas programadas por asuntos locales","(No. de actividades recreativas programadas en la plataforma SIM por los gestores locales/Total de actividades recreativas solicitadas por Promoción de la Recreación)*100","Gestión","Eficacia","Mensual",1,"Porcentaje","Sistema de información misional - SIM\nCuadro de metas de actividades recreativas","Positiva","No",null,2019,"Abril",2344,2593,0.90397223293482454,{"$f":"+V304/L304","v":0.90397223293482454},"Aceptable"]
["Mejorar continuamente los procesos del Sistema Integrado de Gestión","Gestión de Asuntos Locales","Desarrollar acciones a nivel local para promover la participación ciudadana, brindar acompañamiento a las alcaldías locales en temas misionales de la entidad y ofertar sus programas","Efectividad en la atención de la demanda de actividades recreodeportivas en las localidades de Bogotá",null,null,"Porcentaje de beneficiarios inscritos por asuntos locales en actividades deportivas","(No. de beneficiarios inscritos en actividades deportivas por los gestores locales/Total de beneficiarios de actividades deportivas programados por Fomento al Deporte)*100","Gestión","Eficacia","Trimestral",1,"Porcentaje","Reporte de las distintas plataformas para inscripciones\nCuadro de metas de actividades deportivas","Positiva","No",null,2019,"Abril"]
["Mejorar continuamente los procesos del Sistema Integrado de Gestión","Gestión de Asuntos Locales","Desarrollar acciones a nivel local para promover la participación ciudadana, brindar acompañamiento a las alcaldías locales en temas misionales de la entidad y ofertar sus programas","Cumplimiento de lineamientos y criterios de elegibilidad y viabilidad de los proyectos de contratación",null,null,"Porcentaje de asistencias técnicas realizadas a los Fondos de Desarrollo Local","(No. de asistencias técnicas realizadas a los Fondos de Desarrollo Local/Total de asistencias técnicas programadas a los Fondos de Desarrollo Local en las cuatro líneas de inversión)*100","Gestión","Eficacia","Trimestral",1,"Porcentaje","Cronograma de asistencias técnicas a los Fondos de Desarrollo Local","Positiva","No",null,2019,"Abril"]
["Mejorar continuamente los procesos del Sistema Integrado de Gestión","Gestión de Asuntos Locales","Desarrollar acciones a nivel local para promover la participación ciudadana, brindar acompañamiento a las alcaldías locales en temas misionales de la entidad y ofertar sus programas","Ejecución de los proyectos con recursos de los fondos de desarrollo local, en concordancia con el concepto previo y favorable emitido por la entidad",null,null,"Porcentaje de proyectos viabilizados con seguimiento efectuado","(No. de proyectos contratados con seguimiento efectuado/Total de proyectos viabilizados con contratación por parte de los Fondos de Desarrollo Local)*100","Gestión","Eficacia","Trimestral",1,"Porcentaje","SECOP\nInforme de seguimiento a viabilidades","Positiva","No",null,2019,"Abril"]
["Mejorar continuamente los procesos del Sistema Integrado de Gestión","Control Disciplinario","Investigar conductas presuntamente disciplinables e imponer sanciones cuando haya lugar, tanto a servidores como a ex-servidores públicos de la entidad, con el fin de que éstos cumplan con sus deberes y funciones","Cumplimiento de los términos legales en las distintas etapas procesales",null,null,"Porcentaje de procesos disciplinarios resueltos de fondo","(No. de procesos disciplinarios decididos de fondo/Total de procesos disciplinarios activos)*100","Gestión","Eficacia","Semestral",0.6,"Porcentaje","Matriz de autos","Positiva","No",null,2019,"Abril"]
["Mejorar continuamente los procesos del Sistema Integrado de Gestión","Control Disciplinario","Investigar conductas presuntamente disciplinables e imponer sanciones cuando haya lugar, tanto a servidores como a ex-servidores públicos de la entidad, con el fin de que éstos cumplan con sus deberes y funciones","Garantía del debido proceso en las distintas etapas procesales",null,null,"Porcentaje de procesos disciplinarios sin nulidades decretadas","(No. de procesos disciplinarios sin nulidades decretadas/Total de procesos disciplinarios activos)*100 ","Gestión","Eficacia","Trimestral",1,"Porcentaje","Matriz de autos","Positiva","No",null,2019,"Abril"]
["Mejorar continuamente los procesos del Sistema Integrado de Gestión","Control Disciplinario","Investigar conductas presuntamente disciplinables e imponer sanciones cuando haya lugar, tanto a servidores como a ex-servidores públicos de la entidad, con el fin de que éstos cumplan con sus deberes y funciones","Cumplimiento de los términos legales en las distintas etapas procesales",null,null,"Porcentaje de procesos disciplinarios sin vencimiento de términos ","(No. de procesos disciplinarios sin vencimiento de términos/Total de procesos disciplinarios activos)*100","Gestión","Calidad","Trimestral",1,"Porcentaje","Expediente del proceso disciplinario ","Positiva","No",null,2019,"Abril"]
["Mejorar continuamente los procesos del Sistema Integrado de Gestión","Administración y Mantenimiento de Parques y Escenarios","Ofrecer parques y escenarios del Sistema Distrital para el uso y disfrute de la comunidad general, gestionando la sostenibilidad física, social, ambiental y económica","Uso de parques y escenarios con motivación económica que generen recursos para el mantenimiento de los mismos",null,null,"Aprovechamiento económico de parques y/o escenarios","(Ingresos del mes + acumulado de los ingresos del mes anterior/Total presupuesto anual)*100","Gestión","Eficiencia","Mensual",1,"Porcentaje","Sistema de información SEVEN","Positiva","Si","La meta es anual con medición y análisis mensual.\n\nEn el análisis del indicador se presentará la desagregación del aprovechamiento económico por tipo de parque y/o escenario, expresado en ingresos y participación porcentual.",2019,"Abril",8268365,22044017,0.3750843142608718,0.3750843142608718,null,"La medición de este indicador es mensual, siendo de carácter acumulativo.\nLos ingresos por aprovechamiento económico para abril de 2019 fueron $1.738.110.970, equivalente al 21,02% del total de los ingresos para el año 2019, y en lo corrido del año los ingresos por aprovechamiento económico ascienden a $8.268.365.542"]
["Satisfacer las necesidades de los usuarios a través de la prestación de servicios eficientes, eficaces y efectivos","Administración y Mantenimiento de Parques y Escenarios","Ofrecer parques y escenarios del Sistema Distrital para el uso y disfrute de la comunidad general, gestionando la sostenibilidad física, social, ambiental y económica","Satisfacción de los usuarios con las actividades de mantenimiento preventivo y correctivo",null,null,"Satisfacción de los usuarios con las obras de mantenimiento de nuevas tendencias","(No. de usuarios satisfechos con las obras de mantenimiento realizadas/Total de usuarios de parques y escenarios encuestados para obras de mantenimiento de nuevas tendencias)*100","Gestión","Efectividad","Anual",0.9,"Porcentaje","Encuesta de satisfacción con las obras de mantenimiento de nuevas tendencias","Positiva","No","En el análisis del indicador se presentará el resultado desagregado por cada uno de los aspectos evaluados en la encuesta de satisfacción.",2019,"Abril"]
["Mejorar continuamente los procesos del Sistema Integrado de Gestión","Administración y Mantenimiento de Parques y Escenarios","Ofrecer parques y escenarios del Sistema Distrital para el uso y disfrute de la comunidad general, gestionando la sostenibilidad física, social, ambiental y económica","Oportunidad y cumplimiento en la generación de compromisos o acuerdos ciudadanos frente al uso y sostenibilidad de los parques administrados",null,null,"Porcentaje de cumplimiento en acuerdos de sostenibilidad social de parques","(No. de compromisos gestionados/Total de compromisos adquiridos mediante acuerdos ciudadanos en parques)*100","Gestión","Eficacia","Trimestral",1,"Porcentaje","Matriz de seguimiento a compromisos o acuerdos ciudadanos","Positiva","No",null,2019,"Abril"]
["Mejorar continuamente los procesos del Sistema Integrado de Gestión","Administración y Mantenimiento de Parques y Escenarios","Ofrecer parques y escenarios del Sistema Distrital para el uso y disfrute de la comunidad general, gestionando la sostenibilidad física, social, ambiental y económica","Disponibilidad de los equipamientos en parques y escenarios","Cumplimiento de las especificaciones técnicas en las actividades de mantenimiento preventivo y correctivo","Cobertura en el mantenimiento de parques y escenarios de acuerdo con la priorización","Porcentaje de avance en la ejecución de contratos de obras de mantenimiento o recuperación","(Porcentaje contrato 1 + Porcentaje contrato 2 +...+ Porcentaje contrato n)/Total de contratos de obras de mantenimiento o recuperación en ejecución\nDonde: \nPorcentaje contrato n = Avance físico ejecutado/Avance físico programado\nn = Número de contratos de obras de mantenimiento o recuperación en ejecución","Gestión","Eficacia","Bimestral",0.9,"Porcentaje","Informes mensuales de interventoría presentados según programación de los contratistas","Positiva","No",null,2019,"Abril",4.78,6,0.79666666666666675,0.8851851851851853,{"$f":"_xlfn.IFS(W314<=69%,\"Crítico\",W314>=90%,\"Aceptable\",W314>=70%,\"Tolerable\")","v":"Tolerable"}]
["Satisfacer las necesidades de los usuarios a través de la prestación de servicios eficientes, eficaces y efectivos","Diseño y Construcción de Parques y Escenarios","Ampliar y mejorar la infraestructura física recreativa y deportiva del Distrito Capital para el uso de la comunidad en general","Cumplimiento de requisitos técnicos, administrativos, financieros y jurídicos de los proyectos",null,null,"Satisfacción de los usuarios con las obras de construcción y/o adecuación entregadas","(No. de usuarios satisfechos con las obras de construcción y/o adecuación entregadas /Total de usuarios encuestados por proyecto)*100","Gestión","Efectividad","Anual",0.9,"Porcentaje","Resultados de la encuesta de satisfacción entregados por los contratistas de obra","Positiva","No","En el análisis del indicador se presentará el resultado desagregado por cada uno de los aspectos evaluados en la encuesta de satisfacción.",2019,"Abril"]
["Mejorar continuamente los procesos del Sistema Integrado de Gestión","Diseño y Construcción de Parques y Escenarios","Ampliar y mejorar la infraestructura física recreativa y deportiva del Distrito Capital para el uso de la comunidad en general","Oportunidad en el seguimiento y adopción de medidas durante el seguimiento de la estabilidad de la obra","Cumplimiento de especificaciones técnicas conforme a lo establecido en la etapa de construcción",null,"Porcentaje de fallas de calidad o estabilidad de obra atendidas en construcción y adecuación de parques y escenarios","(No. de fallas de calidad o estabilidad de obra atendidas/Total de fallas de calidad o estabilidad de obra detectadas o reportadas por terceros)*100\n\nAtendido = Se genera requerimiento al contratista para establecer compromisos de reparación.","Gestión","Eficacia","Trimestral",0.9,"Porcentaje","Actas de visita o reconocimiento de estabilidad de obra \nActa de compromiso de reparación constructiva\nProgramación de visita\nComunicación oficial- notificación de fallas visita de inspección por estabilidad \nActa de verificación de reparación constructiva","Positiva","No","En el análisis del indicador se presentará la desagregación por parque y escenario.",2019,"Abril"]
["Mejorar continuamente los procesos del Sistema Integrado de Gestión","Diseño y Construcción de Parques y Escenarios","Ampliar y mejorar la infraestructura física recreativa y deportiva del Distrito Capital para el uso de la comunidad en general","Cumplimiento de requisitos técnicos, administrativos, financieros y jurídicos de los proyectos","Oportunidad en el seguimiento y adopción de medidas durante la ejecución de las obras","Cumplimiento del alcance de las obras conforme a los estudios y diseños, especificaciones técnicas y normatividad vigente","Porcentaje de avance en la ejecución de obras de construcción y adecuación de parques y escenarios","((%Ejecutado Obra 1*Plazo de ejecución Obra 1)+(%Ejecutado Obra 2*Plazo de ejecución Obra 2) +...+ (%Ejecutado Obra n*Plazo de ejecución Obra n))/((%Programado Obra 1*Plazo de ejecución Obra 1)+(%Programado Obra 2*Plazo de ejecución Obra 2) +...+ (%Programado Obra n*Plazo de ejecución Obra n))\nDonde:\nn = Número de obras en ejecución","Gestión","Eficacia","Mensual",0.9,"Porcentaje","Informes mensuales de interventoría\n\nInformes mensuales de supervisión","Positiva","No","En el análisis del indicador se presentará la desagregación por parque y escenario.",2019,"Abril",39.96,40.99,{"$f":"+T317/U317","v":0.97487191998048306},1.0831910222005368,"Aceptable"]
["Mejorar continuamente los procesos del Sistema Integrado de Gestión","Diseño y Construcción de Parques y Escenarios","Ampliar y mejorar la infraestructura física recreativa y deportiva del Distrito Capital para el uso de la comunidad en general","\nCumplimiento de requisitos técnicos, administrativos, financieros y legales de los proyectos de estudios y diseños","Oportunidad en el seguimiento y adopción de medidas durante la ejecución de los proyectos de estudios y diseños","Cumplimiento del alcance de los proyectos de estudios y diseños conforme a las necesidades identificadas","Porcentaje de avance en la ejecución de proyectos de estudios y/o diseños de parques y escenarios","(Porcentaje proyecto 1 + Porcentaje proyecto 2 +...+ Porcentaje proyecto n)/Total de proyectos de estudios y/o diseños en ejecución\nDonde: \nPorcentaje proyecto n =(Avance ejecutado de estudios y/o diseños/Avance programado de estudios y/o diseños al corte según forma de pago)\nn = Número de proyectos de estudios y/o diseños en ejecución","Gestión","Eficacia","Mensual",0.9,"Porcentaje","Informes mensuales de interventoría\n\nInformes mensuales de supervisión","Positiva","No","En el análisis del indicador se presentará la desagregación por proyecto.",2019,"Abril",68.290000000000006,69.05,0.98899348298334555,1.0988816477592729,"Aceptable"]
["Mejorar continuamente los procesos del Sistema Integrado de Gestión","Gestión Jurídica","Ejercer la defensa judicial y extrajudicial de la entidad y atender requerimientos jurídicos, para salvaguardar sus intereses y cumplir con los requisitos constitucionales y legales","Intervención oportuna en las distintas actuaciones judiciales y extrajudiciales en que sea parte la entidad","Oportunidad en el seguimiento a los procesos en los despachos e instancias judiciales",null,"Porcentaje de procesos judiciales y extrajudiciales atendidos dentro de los términos legales vigentes","(No. de procesos jurídicos atendidos dentro de los términos legales vigentes)/Total de procesos jurídicos notificados)*100","Gestión","Calidad","Trimestral",1,"Porcentaje","SIPROJ Web\nORFEO","Positiva","No","En el análisis del indicador se presentará la desagregación por procesos judiciales y extrajudiciales.",2019,"Abril"]
["Satisfacer las necesidades de los usuarios a través de la prestación de servicios eficientes, eficaces y efectivos","Gestión Jurídica","Ejercer la defensa judicial y extrajudicial de la entidad y atender requerimientos jurídicos, para salvaguardar sus intereses y cumplir con los requisitos constitucionales y legales","Cumplimiento de los requisitos establecidos para el reconocimiento deportivo y el aval de escuelas deportivas",null,null,"Satisfacción de los usuarios con el trámite de reconocimiento deportivo","(No. de usuarios satisfechos con el trámite de reconocimiento deportivo/Total de usuarios encuestados)*100","Gestión","Efectividad","Semestral",0.95,"Porcentaje","Encuesta de satisfacción de usuarios de reconocimiento deportivo","Positiva","No","En el análisis del indicador se presentarán los resultados desagregados por cada uno de los aspectos evaluados en la encuesta de satisfacción.",2019,"Abril"]
["Mejorar continuamente los procesos del Sistema Integrado de Gestión","Gestión Jurídica","Ejercer la defensa judicial y extrajudicial de la entidad y atender requerimientos jurídicos, para salvaguardar sus intereses y cumplir con los requisitos constitucionales y legales","Oportunidad en la respuesta del trámite de otorgamiento deportivo (45 días hábiles siguientes al cumplimiento de requisitos de otorgamiento deportivo)","Vigencia y aplicabilidad de la normatividad empleada para el reconocimiento deportivo y el aval de escuelas deportivas",null,"Porcentaje de trámites de reconocimiento deportivo atendidos dentro del término legal vigente","(No. de trámites de reconocimiento deportivo atendidos dentro del término legal vigente/Total de trámites de reconocimiento deportivo atendidos)*100 ","Gestión","Calidad","Trimestral",0.92,"Porcentaje","Matriz de control de reconocimiento deportivo","Positiva","No",null,2019,"Abril"]
["Mejorar continuamente los procesos del Sistema Integrado de Gestión","Gestión Jurídica","Ejercer la defensa judicial y extrajudicial de la entidad y atender requerimientos jurídicos, para salvaguardar sus intereses y cumplir con los requisitos constitucionales y legales","Oportunidad en la respuesta del trámite de aval de escuelas deportivas (58 días hábiles)","Vigencia y aplicabilidad de la normatividad empleada para el reconocimiento deportivo y el aval de escuelas deportivas",null,"Porcentaje de trámites de aval de escuelas deportivas atendidos dentro del término legal vigente","(No. de trámites de aval de escuelas deportivas atendidos dentro del término legal vigente/Total de trámites de aval de escuelas deportivas atendidos)*100","Gestión","Calidad","Trimestral",0.92,"Porcentaje","Matriz de control de aval de escuelas deportivas","Positiva","No",null,2019,"Abril"]
["Mejorar continuamente los procesos del Sistema Integrado de Gestión","Gestión Jurídica","Ejercer la defensa judicial y extrajudicial de la entidad y atender requerimientos jurídicos, para salvaguardar sus intereses y cumplir con los requisitos constitucionales y legales","Oportunidad en la respuesta a conceptos de proyectos de acuerdo con los tiempos establecidos","Suministro oportuno de la información de carácter técnico, de oportunidad y conveniencia del proyecto por parte de las dependencias y áreas de la entidad",null,"Porcentaje de solicitudes de concepto a proyectos de acuerdo, decreto o ley atendidas dentro del tiempo establecido","(No. de solicitudes de concepto a proyectos de acuerdo, decreto o ley atendidas dentro del tiempo establecido/Total de solicitudes de concepto a proyectos de acuerdo, decreto o ley recibidas)*100","Gestión","Calidad","Semestral",0.9,"Porcentaje","Matriz de seguimiento a solicitudes Congreso y Concejo","Positiva","No","En el análisis del indicador se presentará la desagregación por proyectos de acuerdo, decreto y ley.",2019,"Abril"]
["Mejorar continuamente los procesos del Sistema Integrado de Gestión","Gestión Jurídica","Ejercer la defensa judicial y extrajudicial de la entidad y atender requerimientos jurídicos, para salvaguardar sus intereses y cumplir con los requisitos constitucionales y legales","Recuperación de la cartera en mora",null,null,"Porcentaje de procesos de cobro de cartera efectuados","(No. de procesos con etapas de cobro efectuadas/Total de procesos de cobro remitidos con documentación completa)*100","Gestión","Eficacia","Cuatrimestral",1,"Porcentaje","Matriz de seguimiento cobro de cartera","Positiva","No","Los primeros cinco días hábiles de mayo se reportará el indicador con corte a 31 de diciembre del año anterior. \nLos primeros días de septiembre se reportará con corte 30 de abril de la vigencia.\nLos primeros días de enero se reportará con corte a 31 de agosto del año anterior.\nEn el análisis del indicador se presentará la desagregación por etapa (persuasivo y coactivo), así como también el porcentaje de recuperación de cartera.",2019,"Abril",8,8,1,1,"Aceptable"]
["Mejorar continuamente los procesos del Sistema Integrado de Gestión","Gestión Jurídica","Ejercer la defensa judicial y extrajudicial de la entidad y atender requerimientos jurídicos, para salvaguardar sus intereses y cumplir con los requisitos constitucionales y legales","Intervención oportuna en las distintas actuaciones judiciales y extrajudiciales en que sea parte la entidad - tipos de daño en que se resulte demandado o condenado",null,null,"Índice de condenas adversas","(No. de condenas adversas/Total de procesos judiciales)*100","Gestión","Calidad","Semestral",0.08,"Porcentaje","Informe Siproj web mensual (procesos judiciales)","Negativa","No","El análisis del indicador debe evaluar dentro del comité de conciliación los procesos que cursen o hayan cursado en contra de la entidad, determinando causas generadoras de conflictos y los tipos de daño.",2019,"Abril"]
["Mejorar continuamente los procesos del Sistema Integrado de Gestión","Gestión de Comunicaciones","Dar a conocer interna y externamente las actividades, programas y obras que realiza la entidad, para generar apropiación y participación que contribuyan al posicionamiento de la imagen institucional","Exigencia de la solicitud de servicios para todos los procesos con la información completa y detallada de lo requerido","Veracidad de la información reportada por los solicitantes del servicio ",null,"Porcentaje de solicitudes de servicios de comunicaciones atendidas dentro de los tiempos establecidos","(No. de solicitudes de servicio atendidas dentro de los tiempos establecidos/Total de solicitudes de servicio de comunicaciones recibidas)*100","Gestión","Calidad","Trimestral",0.9,"Porcentaje","Consolidado de solicitudes de servicios de comunicaciones","Positiva","No",null,2019,"Abril"]
["Mejorar continuamente los procesos del Sistema Integrado de Gestión","Gestión de Comunicaciones","Dar a conocer interna y externamente las actividades, programas y obras que realiza la entidad, para generar apropiación y participación que contribuyan al posicionamiento de la imagen institucional","Relacionamiento con medios de comunicación","Análisis de los resultados obtenidos mediante el monitoreo de medios para facilitar la toma de decisiones",null,"Impacto de noticias publicadas en medios de comunicación","(No. de noticias positivas o neutras registradas/Total de noticias publicadas en medios de comunicación)*100","Gestión","Eficacia","Trimestral",1,"Porcentaje","Informes mensuales generados por la empresa contratada para realizar el monitoreo de medios","Positiva","No","En el análisis del indicador se presentará el resultado desagregado de noticias positivas y neutras, indicando los principales medios de comunicación.\nSe colocó una meta de 100%, mientras se levanta la línea base con la primera medición.",2019,"Abril"]
["Mejorar continuamente los procesos del Sistema Integrado de Gestión","Gestión de Comunicaciones","Dar a conocer interna y externamente las actividades, programas y obras que realiza la entidad, para generar apropiación y participación que contribuyan al posicionamiento de la imagen institucional","Seguimiento a los cambios en las condiciones de publicación en redes sociales y página web",null,null,"Tasa de variación en el alcance total de las publicaciones en redes sociales","((Alcance total de publicaciones en el trimestre actual - Alcance total de publicaciones en el trimestre anterior)/Alcance total de publicaciones en el trimestre anterior)*100\n\nDonde:\n\nAlcance total de las publicaciones = Total de usuarios que vieron las publicaciones de redes sociales","Gestión","Eficacia","Trimestral",0.2,"Porcentaje","Métricas nativas de cada red social","Positiva","No","En el análisis del indicador se presentará el resultado desagregado del alcance de las publicaciones por cada red social. ",2019,"Abril"]
["Mejorar continuamente los procesos del Sistema Integrado de Gestión","Gestión de Comunicaciones","Dar a conocer interna y externamente las actividades, programas y obras que realiza la entidad, para generar apropiación y participación que contribuyan al posicionamiento de la imagen institucional","Análisis de los resultados obtenidos mediante el monitoreo de medios para facilitar la toma de decisiones",null,null,"Salidas publicadas en medios de comunicación","N/A","Gestión","Eficacia","Mensual",80,"Número","Informes mensuales generados por la empresa contratada para realizar el monitoreo de medios","Positiva","No","En el análisis del indicador se presentará el valor estimado de las publicaciones en medios de comunicación.",2019,"Abril",85,1,{"$f":"+T329/U329","v":85},{"$f":"+V329/L329","v":1.0625},{"$f":"_xlfn.IFS(W329<=69%,\"Crítico\",W329>=90%,\"Aceptable\",W329>=70%,\"Tolerable\")","v":"Aceptable"}]
["Mejorar continuamente los procesos del Sistema Integrado de Gestión","Planeación de la Gestión","Establecer directrices para formular y realizar seguimiento a la planeación estratégica y operativa de la entidad con el propósito de contribuir al desarrollo de la misión y objetivos institucionales, así como facilitar la oportunidad y cumplimiento de los resultados esperados","Oportunidad, veracidad y calidad de la información de inversión y gestión",null,null,"Porcentaje de reportes de información presentados dentro de los tiempos programados","(No. de reportes de información elaborados y presentados/Total de reportes de información programados)*100","Gestión","Calidad","Trimestral",1,"Porcentaje","Cronograma de trabajo interno, plan operativo por dependencias (Oficina Asesora de Planeación), plan de adecuación y sostenibilidad SIGD-MIPG","Positiva","No","En el análisis del indicador se desagregará la programación para cada trimestre.",2019,"Mayo"]
["Mejorar continuamente los procesos del Sistema Integrado de Gestión","Planeación de la Gestión","Establecer directrices para formular y realizar seguimiento a la planeación estratégica y operativa de la entidad con el propósito de contribuir al desarrollo de la misión y objetivos institucionales, así como facilitar la oportunidad y cumplimiento de los resultados esperados","Oportunidad en el seguimiento de las acciones institucionales para la mejora (correcciones, acciones correctivas, oportunidades de mejora, acciones para abordar riesgos)",null,null,"Porcentaje de acciones de mejora con seguimiento efectuado dentro del Sistema de Gestión","[No. de acciones de mejora con seguimiento efectuado dentro del tiempo programado/Total de acciones de mejora abiertas dentro del Sistema de Gestión de la Calidad (correcciones, acciones correctivas, oportunidades de mejora, acciones para abordar riesgos)]*100","Gestión","Eficacia","Mensual",1,"Porcentaje","Isolución","Positiva","No","En el análisis del indicador se presentará el resultado desagregado por cada tipología de mejora (corrección, acciones correctivas, oportunidades de mejora, acciones para abordar riesgos).",2019,"Mayo",34,34,1,{"$f":"+V331/L331","v":1},"Aceptable"]
["Mejorar continuamente los procesos del Sistema Integrado de Gestión","Gestión de Recursos Físicos","Administrar y controlar los bienes muebles y servicios para el funcionamiento administrativo de la entidad","Oportunidad en la atención de requerimientos y necesidades de servicios administrativos",null,null,"Porcentaje de mantenimientos realizados a la infraestructura física de la sede administrativa","(No. de mantenimientos realizados a la infraestructura física/Total de mantenimientos programados a la infraestructura física de la sede administrativa)*100","Gestión","Eficacia","Trimestral",0.9,"Porcentaje","Expendientes contractuales en plataforma ORFEO","Positiva","No",null,2019,"Mayo"]
["Mejorar continuamente los procesos del Sistema Integrado de Gestión","Gestión de Asuntos Locales","Desarrollar acciones a nivel local para promover la participación ciudadana, brindar acompañamiento a las alcaldías locales en temas misionales de la entidad y ofertar sus programas","Oportunidad en la emisión del concepto previo y favorable según los tiempos establecidos en la normatividad vigente",null,null,"Porcentaje de conceptos previos tramitados dentro de los términos legales vigentes","(No. de conceptos previos tramitados dentro de los términos legales vigentes/Total de solicitudes de conceptos previos recibidas)*100","Gestión","Calidad","Trimestral",0.5,"Porcentaje","Matriz de seguimiento a conceptos previos tramitados","Positiva","No",null,2019,"Mayo"]
["Mejorar continuamente los procesos del Sistema Integrado de Gestión","Control, Evaluación y Seguimiento","Evaluar los controles y la gestión de la entidad con el fin de identificar e implementar acciones de mejora, en pro de la sostenibilidad del Sistema de Control Interno","Pertinencia y oportunidad en la entrega de los resultados del seguimiento a las partes interesadas","Oportunidad y calidad en la información reportada a las entidades competentes del orden nacional y distrital",null,"Porcentaje de informes presentados por la tercera línea de defensa dentro de los tiempos programados","(No. de informes de ley y de gestión elaborados y presentados dentro de los tiempos programados/Total de informes de ley y de gestión a cargo de la tercera línea de defensa )*100  ","Gestión","Calidad","Trimestral",1,"Porcentaje","Plan anual de auditoría\nCronograma presentación de informes","Positiva","No","En el análisis del indicador se presentará el resultado desagregado por cada uno de los informes realizados.",2019,"Mayo"]
["Mejorar continuamente los procesos del Sistema Integrado de Gestión","Control, Evaluación y Seguimiento","Evaluar los controles y la gestión de la entidad con el fin de identificar e implementar acciones de mejora, en pro de la sostenibilidad del Sistema de Control Interno","Cumplimiento de los objetivos definidos en el plan de auditoría conforme al plan de pruebas","Cobertura de las unidades a auditar de acuerdo con los parámetros establecidos en la matriz de priorización, en concordancia con los recursos disponibles para la ejecución del Plan Anual de Auditoría",null,"Índice de eficacia de auditorías internas de control interno","(Índice auditoría 1 + índice auditoría 2 +...+Índice auditoría n)/Total de auditorías realizadas\nDonde: \nÍndice auditoría n = Calificación porcentual de la variable Objetivos Específicos*Peso de la variable Objetivos Específicos + Calificación porcentual de la variable Actividad Plan de Auditoría*Peso de la variable Actividad Plan de Auditoría + Calificación porcentual de la variable Oportunidad*Peso de la variable Oportunidad\nPesos de las variables:\nObjetivos Específicos = 40%\nActividades Plan de Auditoría = 30%\nOportunidad = 30%. Esta se medirá tomando como fecha de referencia la de emisión del informe preliminar de auditoría.\nn = número de auditorías realizadas","Gestión","Eficacia","Trimestral",0.85,"Porcentaje","Planes de cada una de las auditorías","Positiva","No","En el análisis del indicador se presentará el resultado desagregado por cada una de las auditorías realizadas.",2019,"Mayo"]
["Mejorar continuamente los procesos del Sistema Integrado de Gestión","Gestión Financiera","Administrar los recursos financieros asignados y realizar los respectivos registros, para el cumplimiento de las funciones de la entidad y pago de sus obligaciones con terceros","Oportunidad en el seguimiento de las partidas pendientes por conciliar",null,null,"Porcentaje de partidas conciliatorias identificadas dentro del tiempo establecido","(No. de partidas conciliatorias identificadas con edad inferior a 60 días/Total de partidas reportadas)*100","Gestión","Calidad","Mensual",0.9,"Porcentaje","Sistema de información SEVEN","Positiva","No",null,2019,"Mayo",16,21,0.76190476190476186,0.84656084656084651,"Tolerable","El número de partidas conciliatorias fueron 21, de las cuales 5 partidas con más de 60 días presentan el siguiente estado: 4 a Gravámen a los movimientos financieros (conciliadas en el mes de mayo) y 1 consignación pendiente por registrar en libros (conciliada en el mes de mayo). No se carga evidencia de las partidas conciliadas debido a que la información contenida es de caracter reservado para la entidad. "]
["Mejorar continuamente los procesos del Sistema Integrado de Gestión","Gestión Financiera","Administrar los recursos financieros asignados y realizar los respectivos registros, para el cumplimiento de las funciones de la entidad y pago de sus obligaciones con terceros","Oportunidad e integridad de la información necesaria para realizar las diferentes conciliaciones",null,null,"Porcentaje de obligaciones contingentes registradas correctamente en la contabilidad","(No. de procesos registrados correctamente en la contabilidad/Total de procesos reportados en SIPROJ Web)*100","Gestión","Calidad","Trimestral",1,"Porcentaje","Sistema de información SEVEN","Positiva","No",null,2019,"Mayo"]
["Mejorar continuamente los procesos del Sistema Integrado de Gestión","Gestión Financiera","Administrar los recursos financieros asignados y realizar los respectivos registros, para el cumplimiento de las funciones de la entidad y pago de sus obligaciones con terceros","Oportunidad en la presentación de informes y estados financieros a los diferentes entes de vigilancia y control",null,null,"Porcentaje de notas a los estados financieros reveladas correctamente","(No. de notas sin observaciones por parte de los órganos de control internos y externos/Total de notas a los estados financieros elaboradas)*100","Gestión","Calidad","Anual",0.95,"Porcentaje","Informes de entes de control y vigilancia","Positiva","No",null,2019,"Mayo"]
["Mejorar continuamente los procesos del Sistema Integrado de Gestión","Gestión Financiera","Administrar los recursos financieros asignados y realizar los respectivos registros, para el cumplimiento de las funciones de la entidad y pago de sus obligaciones con terceros","Oportunidad en la presentación de informes y estados financieros a los diferentes entes de vigilancia y control","Oportunidad en la presentación de las declaraciones tributarias",null,"Porcentaje de informes financieros presentados a los entes de vigilancia y control dentro de los términos legales vigentes","(No. de informes financieros presentados dentro de los términos legales vigentes/Total de informes financieros a reportar a los entes de vigilancia y control)*100","Gestión","Calidad","Trimestral",1,"Porcentaje","Matriz de seguimiento a la presentación de informes ","Positiva","No",null,2019,"Mayo"]
["Satisfacer las necesidades de los usuarios a través de la prestación de servicios eficientes, eficaces y efectivos","Promoción de la Recreación","Desarrollar actividades recreativas en función de las características y necesidades de la población de Bogotá D.C., para promover el aprovechamiento del tiempo libre y el mejoramiento en la calidad de vida","Satisfacción del usuario con las actividades recreativas realizadas",null,null,"Satisfacción de los usuarios con los eventos y/o programas recreativos","(No. de usuarios satisfechos con los eventos y/o programas recreativos/Total de usuarios de eventos y/o programas recreativos encuestados)*100","Gestión","Efectividad","Anual",1,"Porcentaje","Encuesta de satisfacción sobre eventos y/o programas recreativos","Positiva","No","En el análisis del indicador se presentará el resultado desagregado por programa y por cada uno de los aspectos evaluados en la encuesta de satisfacción.\nSe colocó una meta de 100%, mientras se levanta la línea base con la primera medición.",2019,"Mayo"]
["Mejorar continuamente los procesos del Sistema Integrado de Gestión","Promoción de la Recreación","Desarrollar actividades recreativas en función de las características y necesidades de la población de Bogotá D.C., para promover el aprovechamiento del tiempo libre y el mejoramiento en la calidad de vida","Cumplimiento del programa de actividades recreativas, teniendo en cuenta lo establecido en las fichas técnicas o según lo concertado con la comunidad e instituciones",null,null,"Porcentaje de actividades recreativas que cumplen con los requisitos para su ejecución","(No. de actividades recreativas que cumplen con los requisitos definidos para su ejecución/Total de actividades recreativas realizadas)*100","Gestión","Eficacia","Trimestral",0.97,"Porcentaje","Sistema de información misional - SIM","Positiva","No","En el análisis del indicador se presentará el resultado desagregado por programa y por actividad.",2019,"Mayo"]
["Satisfacer las necesidades de los usuarios a través de la prestación de servicios eficientes, eficaces y efectivos","Fomento al Deporte","Desarrollar e implementar programas deportivos y de actividad física, para contribuir con el mejoramiento de la calidad de vida en la población de Bogotá D.C.","Satisfacción del usuario con las actividades deportivas  realizadas",null,null,"Satisfacción de los usuarios con las actividades realizadas en los programas deportivos","(No. de usuarios satisfechos con las actividades deportivas realizadas/Total de usuarios de actividades deportivas encuestados)*100","Gestión","Efectividad","Anual",1,"Porcentaje","Encuesta de satisfacción sobre actividades/programas deportivos","Positiva","No","En el análisis del indicador se presentará el resultado desagregado por programa y por cada uno de los aspectos evaluados en la encuesta de satisfacción.\nSe colocó una meta de 100%, mientras se levanta la línea base con la primera medición.",2019,"Mayo"]
["Mejorar continuamente los procesos del Sistema Integrado de Gestión","Fomento al Deporte","Desarrollar e implementar programas deportivos y de actividad física, para contribuir con el mejoramiento de la calidad de vida en la población de Bogotá D.C.","Cambios comportamentales como resultados de los programas deportivos y de actividad física",null,null,"Cambio comportamental frente a la actividad física y el deporte","(No. de beneficiarios con percepción de cambio comportamental alrededor de las 4 dimensiones de la alfabetización física/Total de beneficiarios de programas deportivos y de actividad física seleccionados en la muestra)*100","Gestión","Efectividad","Anual",1,"Porcentaje","Encuesta para medir las 4 dimensiones de la alfabetización física","Positiva","No","La metodología se aplicará sobre una muestra por cada por cada programa. Se define en 4 tipos de mediciones:\n1. Medición dimensión competencia física. Aplicar test de resistencia, fuerza de torso, habilidades y flexibilidad.\n2. Medición dimensiones: competencia cognitiva, comportamental y motivacional a través de un cuestionario (on-line o presencial).\nSe colocó una meta de 100%, mientras se levanta la línea base con la primera medición.",2019,"Mayo"]
["Satisfacer las necesidades de los usuarios a través de la prestación de servicios eficientes, eficaces y efectivos","Servicio a la Ciudadanía","Brindar información y atender los requerimientos de los grupos de valor y de interés de la entidad para responder a sus necesidades en cumplimiento de sus derechos","Oportunidad y calidad en la respuesta a los requerimientos de los grupos de valor e interés de la entidad","Satisfacción del ciudadano frente a las respuestas a sus requerimientos",null,"Satisfacción de peticionarios con la respuesta dada a sus requerimientos","(No. de peticionarios satisfechos con la respuesta dada a sus peticiones, quejas, reclamos y sugerencias/Total de peticionarios contactados)*100","Gestión","Efectividad","Mensual",0.8,"Porcentaje","Base de datos de gestión de PQRS","Positiva","No",null,2019,"Mayo",21,26,0.80769230769230771,1.0096153846153846,"Aceptable"]
["Mejorar continuamente los procesos del Sistema Integrado de Gestión","Gestión de Recursos Físicos","Administrar y controlar los bienes muebles y servicios para el funcionamiento administrativo de la entidad","Oportunidad en la atención de requerimientos y necesidades de servicios administrativos",null,null,"Porcentaje de requerimientos de mantenimiento correctivo atendidos en la sede administrativa dentro de los tiempos establecidos","(No. de requerimientos de mantenimiento correctivo atendidos dentro de los tiempos establecidos/Total de requerimientos de mantenimiento correctivo reportados en la sede administrativa)*100","Gestión","Calidad","Trimestral",0.95,"Porcentaje","Aplicativo mesa de ayuda OTRS","Positiva","No",null,2019,"Mayo"]
["Mejorar continuamente los procesos del Sistema Integrado de Gestión","Adquisición de Bienes y Servicios","Realizar actividades contractuales para adquirir bienes y servicios con la oportunidad y de acuerdo con las especificaciones establecidas por la entidad","Cumplimiento de requisitos de acuerdo con la modalidad de selección",null,null,"Porcentaje de procesos de selección publicados dentro del tiempo establecido","(No. de actos de apertura de procesos de selección publicados en un tiempo menor o igual a 30 días hábiles después de la radicación/Total de actos de apertura expedidos)*100","Gestión","Calidad","Trimestral",0.9,"Porcentaje","Plataforma ORFEO y SECOP","Positiva","No","En el análisis del indicador se presentará el resultado desagregado para licitación pública, concurso de méritos y selección abreviada.",2019,"Mayo"]
["Mejorar continuamente los procesos del Sistema Integrado de Gestión","Adquisición de Bienes y Servicios","Realizar actividades contractuales para adquirir bienes y servicios con la oportunidad y de acuerdo con las especificaciones establecidas por la entidad","Oportunidad en la suscripción y legalización del contrato",null,null,"Porcentaje de contratos legalizados dentro del tiempo establecido","(No. de contratos legalizados en un tiempo menor o igual a 10 días hábiles a partir del acto administrativo de adjudicación/Total de procesos de selección adjudicados)*100","Gestión","Calidad","Mensual",0.8,"Porcentaje","SECOP y Plataforma ORFEO ","Positiva","No","En el análisis del indicador se presentará el resultado desagregado para licitación pública, concurso de méritos y selección abreviada.",2019,"Mayo",1,3,0.33333333333333331,0.41666666666666663,"Crítico"]
["Mejorar continuamente los procesos del Sistema Integrado de Gestión","Adquisición de Bienes y Servicios","Realizar actividades contractuales para adquirir bienes y servicios con la oportunidad y de acuerdo con las especificaciones establecidas por la entidad","Definición clara y precisa de requisitos técnicos, financieros, económicos, jurídicos y de riesgos de acuerdo con el bien o servicio a adquirir",null,null,"Porcentaje de procesos de obra tramitados en análisis de costos dentro del tiempo establecido","(No. de procesos de obra (todas las Subdirecciones) tramitados en oportunidad al recibo del memorando con la solicitud estudio del sector (20 días)/Total de procesos de obra recibidos)*100","Gestión","Calidad","Trimestral",1,"Porcentaje","Matriz de tráfico ACEE","Positiva","No",null,2019,"Mayo"]
["Mejorar continuamente los procesos del Sistema Integrado de Gestión","Adquisición de Bienes y Servicios","Realizar actividades contractuales para adquirir bienes y servicios con la oportunidad y de acuerdo con las especificaciones establecidas por la entidad","Definición clara y precisa de requisitos técnicos, financieros, económicos, jurídicos y de riesgos de acuerdo con el bien o servicio a adquirir",null,null,"Porcentaje de procesos diferentes a obra tramitados en análisis de costos dentro del tiempo establecido","(No. de procesos diferentes a obra tramitados en oportunidad al recibo del memorando con la solicitud estudio del sector (10 días hábiles)/Total de procesos recibidos diferentes a obra)*100","Gestión","Calidad","Trimestral",0.9,"Porcentaje","Matriz de tráfico ACEE","Positiva","No","En el análisis del indicador se presentará el resultado desagregado para procesos diferentes a obra.",2019,"Mayo"]
["Mejorar continuamente los procesos del Sistema Integrado de Gestión","Adquisición de Bienes y Servicios","Realizar actividades contractuales para adquirir bienes y servicios con la oportunidad y de acuerdo con las especificaciones establecidas por la entidad","Definición clara y precisa de requisitos técnicos, financieros, económicos, jurídicos y de riesgos de acuerdo con el bien o servicio a adquirir",null,null,"Porcentaje de procesos requeridos por precios artificialmente bajos","(No. de procesos (excepto Subastas SAS) requeridos por precios artificialmente bajos/Total de procesos evaluados)*100","Gestión","Calidad","Trimestral",0.15,"Porcentaje","Evaluación económica de los proponentes\n\nAnálisis de precios realizado por la ACEE","Negativa","No","En el análisis del indicador se presentará el resultado desagregado por tipo de proceso.",2019,"Mayo"]
["Mejorar continuamente los procesos del Sistema Integrado de Gestión","Control, Evaluación y Seguimiento","Evaluar los controles y la gestión de la entidad con el fin de identificar e implementar acciones de mejora, en pro de la sostenibilidad del Sistema de Control Interno","Pertinencia y oportunidad en la entrega de los resultados del seguimiento a las partes interesadas",null,null,"Porcentaje de acciones de mejoramiento interno con seguimiento efectuado","(No. de acciones de mejoramiento interno con seguimiento efectuado)/Total de acciones de mejoramiento interno abiertas de auditorías internas de control interno)*100","Gestión","Eficacia","Trimestral",1,"Porcentaje","Plataforma Isolución","Positiva","No","En el análisis del indicador se presentará el resultado desagregado por proceso.",2019,"Mayo"]
["Mejorar continuamente los procesos del Sistema Integrado de Gestión","Control, Evaluación y Seguimiento","Evaluar los controles y la gestión de la entidad con el fin de identificar e implementar acciones de mejora, en pro de la sostenibilidad del Sistema de Control Interno","Pertinencia y oportunidad en la entrega de los resultados del seguimiento a las partes interesadas",null,null,"Porcentaje de acciones de mejoramiento externo con seguimiento efectuado","(No. de acciones de mejoramiento externo con seguimiento efectuado)/Total de acciones de mejoramiento externo abiertas de auditorías externas)*100","Gestión","Eficacia","Trimestral",1,"Porcentaje","Matrices de consolidación del estado de las acciones de los diferentes entes de control y vigilancia","Positiva","No","En el análisis del indicador se presentará el resultado desagregado por auditoría externa.",2019,"Mayo"]
["Mejorar continuamente los procesos del Sistema Integrado de Gestión","Gestión Financiera","Administrar los recursos financieros asignados y realizar los respectivos registros, para el cumplimiento de las funciones de la entidad y pago de sus obligaciones con terceros","Oportunidad en la expedición de los certificados presupuestales y en la presentación de los informes de ejecución",null,null,"Porcentaje de ejecución presupuestal en gastos de funcionamiento","(Presupuesto de funcionamiento ejecutado/Presupuesto disponible de funcionamiento)*100","Gestión","Eficiencia","Mensual",0.95,"Porcentaje","Ejecución presupuestal en SEVEN","Positiva","Si","La meta es anual con medición y análisis mensual.\nLa medición está a cargo del Área Financiera y el análisis a cargo de la Subdirección Administrativa y Financiera.\nLa medición y el análisis se deben realizar a más tardar el quinto día hábil de cada mes.\nUna vez se realice el Comité Financiero, el Área Financiera debe enviar a la Oficina Asesora de Planeación la presentación correspondiente, con el análisis respectivo en cuanto al desempeño del indicador.",2019,"Mayo",13279950848,35208442000,0.37718087179205489,{"$f":"+V353/L353","v":0.39703249662321571}]
["Mejorar continuamente los procesos del Sistema Integrado de Gestión","Gestión Financiera","Administrar los recursos financieros asignados y realizar los respectivos registros, para el cumplimiento de las funciones de la entidad y pago de sus obligaciones con terceros","Oportunidad en la expedición de los certificados presupuestales y en la presentación de los informes de ejecución","Oportunidad en la autorización de giro de los recursos de transferencia",null,"Porcentaje de ejecución presupuestal en gastos de inversión","(Presupuesto de inversión ejecutado/Presupuesto disponible de inversión)*100","Gestión","Eficiencia","Mensual",1,"Porcentaje","Ejecución presupuestal en SEVEN","Positiva","Si","La meta es anual con medición y análisis mensual.\nLa medición está a cargo del Área Financiera y el análisis a cargo de los Ordenadores del Gasto.\nLa medición y el análisis se deben realizar a más tardar el quinto día hábil de cada mes.\nUna vez se realice el Comité Financiero, el Área Financiera debe enviar a la Oficina Asesora de Planeación la presentación correspondiente, con el análisis respectivo en cuanto al desempeño del indicador.",2019,"Mayo",282630325028,742020022000,0.38089312504831574,0.38089312504831574]
["Mejorar continuamente los procesos del Sistema Integrado de Gestión","Gestión Financiera","Administrar los recursos financieros asignados y realizar los respectivos registros, para el cumplimiento de las funciones de la entidad y pago de sus obligaciones con terceros","Oportunidad en el pago de las obligaciones financieras de la entidad",null,null,"Porcentaje de ejecución del programa anual de caja","(Recursos ejecutados de reserva, vigencia y pasivos exigibles/Recursos programados de reserva, vigencia y pasivos exigibles)*100","Gestión","Eficiencia","Mensual",1,"Porcentaje","Sistema de información SEVEN","Positiva","Si","La meta es anual con medición y análisis mensual.\nLa medición está a cargo del Área Financiera y el análisis a cargo de los Ordenadores del Gasto.\nLa medición y el análisis se deben realizar a más tardar el quinto día hábil de cada mes.\nUna vez se realice el Comité Financiero, el Área Financiera debe enviar a la Oficina Asesora de Planeación la presentación correspondiente, con el análisis respectivo en cuanto al desempeño del indicador.",2019,"Mayo",15000245,15853762,{"$f":"+T355/U355","v":0.94616312519388146},0.94616312519388146]
["Mejorar continuamente los procesos del Sistema Integrado de Gestión","Gestión Financiera","Administrar los recursos financieros asignados y realizar los respectivos registros, para el cumplimiento de las funciones de la entidad y pago de sus obligaciones con terceros","Oportunidad en el pago de las obligaciones financieras de la entidad","Oportunidad en la causación de ordenes de pago que cumplan con todos los requisitos establecidos","Oportunidad y veracidad de la información necesaria para la causación de las ordenes de pago reportada por los ordenadores del gasto","Porcentaje de cuentas individuales pagadas dentro del tiempo establecido","(No. de cuentas individuales pagadas en un tiempo menor o igual a 6 días/Total de cuentas de pago individuales tramitadas)*100 ","Gestión","Calidad","Mensual",1,"Porcentaje","Bitácora de cuentas en SEVEN","Positiva","No","La medición y el análisis están a cargo del Área Financiera.\nEn el análisis del indicador se presentará el resultado del tiempo promedio en cada una de las etapas para el pago, según la bitácora de cuentas de SEVEN.",2019,"Mayo",260,261,0.99616858237547889,0.99616858237547889,{"$f":"_xlfn.IFS(W356<=69%,\"Crítico\",W356>=90%,\"Aceptable\",W356>=70%,\"Tolerable\")","v":"Aceptable"}]
["Mejorar continuamente los procesos del Sistema Integrado de Gestión","Gestión Financiera","Administrar los recursos financieros asignados y realizar los respectivos registros, para el cumplimiento de las funciones de la entidad y pago de sus obligaciones con terceros","Oportunidad en el pago de las obligaciones financieras de la entidad","Oportunidad en la causación de ordenes de pago que cumplan con todos los requisitos establecidos","Oportunidad y veracidad de la información necesaria para la causación de las ordenes de pago reportada por los ordenadores del gasto","Porcentaje de cuentas colectivas pagadas dentro del tiempo establecido","(No. de cuentas colectivas pagadas en un tiempo menor o igual a 10 días/Total de cuentas de pago colectivas tramitadas)*100","Gestión","Calidad","Mensual",1,"Porcentaje","Bitácora de cuentas en SEVEN","Positiva","No","La medición y el análisis están a cargo del Área Financiera.\nEn el análisis del indicador se debe presentar el resultado del tiempo promedio en cada una de las etapas para el pago, según la bitácora de cuentas de SEVEN.",2019,"Mayo",71,71,1,1,{"$f":"_xlfn.IFS(W357<=69%,\"Crítico\",W357>=90%,\"Aceptable\",W357>=70%,\"Tolerable\")","v":"Aceptable"}]
["Implementar las políticas y líneas de acción para la preservación e integridad de la documentación","Gestión Documental","Administrar, conservar y custodiar la documentación generada en la entidad, desde su origen hasta su disposición final, para preservar la memoria institucional","Actualización del inventario documental en el Formato Único de Inventario Documental, con base en la aplicación de las tablas de retención documental","Cumplimiento de los tiempos de retención documental establecidos en las tablas","Actualización de los instrumentos archivísticos","Porcentaje de inventario validado del fondo documental acumulado del archivo central","(No. de metros lineales de inventario validado en cuanto a series, subseries, asuntos y oficinas productoras/Total de metros lineales de archivo inventariado en estado natural del archivo central)*100 ","Gestión","Eficacia","Mensual",1,"Porcentaje","Matriz de seguimiento a inventario documental","Positiva","Si","La meta es anual con medición y análisis mensual",2019,"Mayo",895.38,2180.5,0.41063058931437746,0.41063058931437746]
["Implementar las políticas y líneas de acción para la preservación e integridad de la documentación","Gestión Documental","Administrar, conservar y custodiar la documentación generada en la entidad, desde su origen hasta su disposición final, para preservar la memoria institucional","Oportunidad en las transferencias documentales de acuerdo con los tiempos de retención establecidos en las tablas",null,null,"Porcentaje de transferencias primarias realizadas de acuerdo con los tiempos de retención","(No. de transferencias primarias realizadas de acuerdo con los tiempos de retención establecidos en las TRD/Total de transferencias documentales programadas)*100","Gestión","Eficacia","Mensual",0.8,"Porcentaje","Matriz de seguimiento a transferencias documentales","Positiva","Si","La meta es anual con medición y análisis mensual",2019,"Mayo",18,33,0.54545454545454541,0.68181818181818177]
["Implementar las políticas y líneas de acción para la preservación e integridad de la documentación","Gestión Documental","Administrar, conservar y custodiar la documentación generada en la entidad, desde su origen hasta su disposición final, para preservar la memoria institucional","Cumplimiento de los estándares de temperatura, humedad relativa y luminosidad de los espacios de almacenamiento de material documental, dentro de los rangos establecidos en la normatividad vigente",null,null,"Porcentaje de espacios controlados para la conservación documental","(No. de espacios monitoreados e intervenidos/Total de espacios monitoreados)*100","Gestión","Eficacia","Mensual",1,"Porcentaje","Informe de monitoreo de espacios controlados","Positiva","No","La medición es mes vencido",2019,"Mayo",9,9,1,1,{"$f":"_xlfn.IFS(W360<=69%,\"Crítico\",W360>=90%,\"Aceptable\",W360>=70%,\"Tolerable\")","v":"Aceptable"}]
["Mejorar continuamente los procesos del Sistema Integrado de Gestión","Servicio a la Ciudadanía","Brindar información y atender los requerimientos de los grupos de valor y de interés de la entidad para responder a sus necesidades en cumplimiento de sus derechos","Oportunidad y calidad en la respuesta a los requerimientos de los grupos de valor e interés de la entidad",null,null,"Porcentaje de peticiones, quejas, reclamos y sugerencias contestadas dentro de los términos legales vigentes","(No. de peticiones, quejas, reclamos y sugerencias contestadas en el aplicativo SDQS dentro de los términos legales vigentes/Total de peticiones, quejas, reclamos y sugerencias recibidas)*100","Gestión","Calidad","Mensual",1,"Porcentaje","Sistema SDQS","Positiva","No","La medición es mes vencido",2019,"Mayo",258,460,0.56086956521739129,0.56086956521739129,"Crítico"]
["Satisfacer las necesidades de los usuarios a través de la prestación de servicios eficientes, eficaces y efectivos","Servicio a la Ciudadanía","Brindar información y atender los requerimientos de los grupos de valor y de interés de la entidad para responder a sus necesidades en cumplimiento de sus derechos","Satisfacción del ciudadano frente a la atención brindada por la entidad",null,null,"Satisfacción del ciudadano con la atención recibida en los SUPERCADE","(No. de ciudadanos satisfechos con la atención recibida en los SUPERCADE/Total de ciudadanos atendidos en los SUPERCADE)*100","Gestión","Efectividad","Mensual",0.95,"Porcentaje","Encuesta de satisfacción con la atención brindada en SUPERCADES","Positiva","No",null,2019,"Mayo",2139,2140,0.99953271028037383,1.0521396950319726,"Aceptable"]
["Mejorar continuamente los procesos del Sistema Integrado de Gestión","Servicio a la Ciudadanía","Brindar información y atender los requerimientos de los grupos de valor y de interés de la entidad para responder a sus necesidades en cumplimiento de sus derechos","Oportunidad en la actualización de la información publicada en la sección de ley de transparencia en la página web de la entidad",null,null,"Porcentaje de información actualizada en ley de transparencia","(No. de subcategorías con información actualizada en la página web/Total de subcategorías definidas en ley de transparencia)*100","Gestión","Eficacia","Trimestral",1,"Porcentaje","Página web","Positiva","No",null,2019,"Mayo"]
["Mejorar continuamente los procesos del Sistema Integrado de Gestión","Servicio a la Ciudadanía","Brindar información y atender los requerimientos de los grupos de valor y de interés de la entidad para responder a sus necesidades en cumplimiento de sus derechos","Coherencia, claridad, solución de fondo, calidez y manejo del sistema en relación con los requerimientos atendidos por la entidad",null,null,"Porcentaje de requerimientos atendidos con oportunidad y calidad","(No. de respuestas a requerimientos sin observaciones en cuanto a los criterios de oportunidad y calidad/Total de requerimientos evaluados en el aplicativo SDQS)*100","Gestión","Eficacia","Mensual",0.8,"Porcentaje","SDQS y base de datos de gestión de PQRS","Positiva","No","La medición es mes vencido",2019,"Mayo",128,167,0.76646706586826352,0.95808383233532934,"Aceptable"]
["Implementar buenas prácticas ambientales para la prevención de la contaminación en el marco de una Bogotá que defiende lo público en su función administrativa y de desarrollo institucional","Gestión de Recursos Físicos","Administrar y controlar los bienes muebles y servicios para el funcionamiento administrativo de la entidad","Calificación de la implementación del Plan Institucional de Gestión Ambiental, por parte de la Secretaría Distrital de Ambiente","Oportunidad en el reporte de formularios y registros electrónicos del PIGA ante la Secretaría Distrital de Ambiente",null,"Índice de implementación del PIGA","Promedio ponderado de cumplimiento de aspectos normativos y de implementación del PIGA, según auditoría realizada por la Secretaría Distrital de Ambiente en cada vigencia","Gestión","Eficacia","Anual",0.7,"Porcentaje","Informe de auditoría anual realizada por la Secretaría Distrital de Ambiente","Positiva","No","En el análisis del indicador se presentará el resultado desagregado por cada uno de los aspectos evaluados en la visita de control y seguimiento por parte de la Secretaría Distrital de Ambiente.\nLa meta está configurada como mayor a 70%.",2019,"Mayo"]
["Proteger la integridad, confidencialidad y disponibilidad de la información","Gestión de Tecnología de la Información y las Comunicaciones","Proporcionar soluciones estratégicas de tecnologías de la información y las comunicaciones, para contribuir con la eficiencia administrativa, la mejora de los trámites y servicios y la protección de los activos de información de la entidad","Impacto del plan de remediación frente a las vulnerabilidades identificadas","Aseguramiento de incidencias en la seguridad de la información que afecten la confidencialidad, integridad y disponibilidad",null,"Porcentaje de remediación de vulnerabilidades de seguridad de la información","(No. de vulnerabilidades críticas o altas remediadas/Total de vulnerabilidades de seguridad de la información detectadas como críticas o altas)*100 ","Gestión","Eficacia","Anual",0.7,"Porcentaje","Matriz de vulnerabilidades","Positiva","No","La meta está configurada como mínimo 70%.",2019,"Mayo"]
["Proteger la integridad, confidencialidad y disponibilidad de la información","Gestión de Tecnología de la Información y las Comunicaciones","Proporcionar soluciones estratégicas de tecnologías de la información y las comunicaciones, para contribuir con la eficiencia administrativa, la mejora de los trámites y servicios y la protección de los activos de información de la entidad","Avances en la implementación de gobierno digital de acuerdo con los componentes evaluados por MINTIC",null,null,"Índice de implementación de gobierno digital","Sumatoria de la calificación obtenida por cada componente/Total de componentes de la política de gobierno digital","Gestión","Eficacia","Anual",0.65,"Porcentaje","Instrumento de medición suministrado para el seguimiento a la política de gobierno digital  ","Positiva","No","En el análisis del indicador se presentará el resultado desagregado de las calificaciones obtenidas en cada componente de la política de seguridad digital.",2019,"Mayo"]
["Mejorar continuamente los procesos del Sistema Integrado de Gestión","Gestión de Tecnología de la Información y las Comunicaciones","Proporcionar soluciones estratégicas de tecnologías de la información y las comunicaciones, para contribuir con la eficiencia administrativa, la mejora de los trámites y servicios y la protección de los activos de información de la entidad","Cumplimiento del Plan Estratégico de Tecnologías de la Información PETI",null,null,"Porcentaje de avance en proyectos de TI","(No. de hitos en proyectos de TI alcanzados/Total de hitos en proyectos de TI programados en la vigencia)*100","Gestión","Eficacia","Semestral",1,"Porcentaje","Cronograma de proyectos del PETI","Positiva","Si","La meta es anual con medición y análisis semestral.",2019,"Mayo"]
["Proteger la integridad, confidencialidad y disponibilidad de la información","Gestión de Tecnología de la Información y las Comunicaciones","Proporcionar soluciones estratégicas de tecnologías de la información y las comunicaciones, para contribuir con la eficiencia administrativa, la mejora de los trámites y servicios y la protección de los activos de información de la entidad","Disponibilidad de los sistemas de información de la entidad",null,null,"Porcentaje de disponibilidad de los sistemas de información","(No. de horas disponibles de los sistemas de información/Total de horas en servicio de los sistemas de información)*100","Gestión","Eficiencia","Mensual",0.9,"Porcentaje","Herramienta de monitoreo ZABBIX","Positiva","No","En el análisis del indidicador se presentará el resultado desagregado de disponibilidad en ORFEO, SEVEN, KACTUS y SIM.\nLa meta está configurada como mayor o igual a 90%.",2019,"Mayo",743.97500000000002,744,0.9999663978494624,1.1110737753882916,{"$f":"_xlfn.IFS(W369<=69%,\"Crítico\",W369>=90%,\"Aceptable\",W369>=70%,\"Tolerable\")","v":"Aceptable"}]
["Mejorar continuamente los procesos del Sistema Integrado de Gestión","Gestión de Tecnología de la Información y las Comunicaciones","Proporcionar soluciones estratégicas de tecnologías de la información y las comunicaciones, para contribuir con la eficiencia administrativa, la mejora de los trámites y servicios y la protección de los activos de información de la entidad","Disponibilidad de los servicios de comunicaciones en la entidad, según los acuerdos de niveles de servicios establecidos",null,null,"Porcentaje de disponibilidad de los servicios de comunicaciones","(No. de horas disponibles de los servicios de comunicaciones /Total de horas de los servicios de comunicaciones)*100","Gestión","Eficiencia","Mensual",0.9,"Porcentaje","Herramienta de monitoreo ZABBIX","Positiva","No","En el análisis del indidicador se presentará el resultado desagregado de disponibilidad en Internet y Telefonía IP.\nLa meta está configurada como mayor o igual a 90%.",2019,"Mayo",743.38,744,0.99916666666666665,1.1101851851851852,"Aceptable"]
["Mejorar continuamente los procesos del Sistema Integrado de Gestión","Gestión de Tecnología de la Información y las Comunicaciones","Proporcionar soluciones estratégicas de tecnologías de la información y las comunicaciones, para contribuir con la eficiencia administrativa, la mejora de los trámites y servicios y la protección de los activos de información de la entidad","Incidencias reportadas en el funcionamiento del módulo o sistema de información implementado","Cumplimiento de los acuerdos de niveles de servicios establecidos",null,"Porcentaje de solicitudes de servicio tecnológico atendidas dentro de los tiempos establecidos","(No. de solicitudes atendidas dentro de los tiempos establecidos en los acuerdos de nivel de servicio/Total de solicitudes de servicio tecnológico recibidas)*100","Gestión","Calidad","Mensual",0.9,"Porcentaje","Herramienta GLPI","Positiva","No",null,2019,"Mayo",856,891,0.96071829405162734,1.0674647711684748,"Aceptable"]
["Mejorar continuamente los procesos del Sistema Integrado de Gestión","Gestión de Talento Humano","Gestionar el potencial del talento humano como factor estratégico, para contribuir con el desarrollo de la entidad en un ambiente seguro y saludable","Cumplimiento de compromisos y competencias del servidor público en el desempeño laboral","Oportunidad en el seguimiento y la evaluación anual u ordinaria del servidor público para continuar su permanencia en el servicio",null,"Índice de desempeño laboral de funcionarios","(Sumatoria de calificaciones finales de la evaluación de desempeño de los funcionarios/Total de funcionarios evaluados)*100","Gestión","Eficacia","Anual",0.9,"Porcentaje","Consolidado de las calificaciones finales de la evaluación de desempeño","Positiva","No","En el análisis del indicador se presentará el resultado desagregado por niveles jerárquicos y comparar con la evaluación de las áreas.\nLa meta está configurada como mayor a 90%.\nNota: Se mide para vigencia 2018-2019.",2019,"Mayo"]
["Mejorar continuamente los procesos del Sistema Integrado de Gestión","Gestión de Talento Humano","Gestionar el potencial del talento humano como factor estratégico, para contribuir con el desarrollo de la entidad en un ambiente seguro y saludable","Cobertura de servidores públicos en las actividades del plan de bienestar e incentivos",null,null,"Porcentaje de funcionarios que participan en las actividades del plan de bienestar e incentivos","(No. de funcionarios participantes en las actividades del plan de bienestar e incentivos/Total de funcionarios de la entidad)*100 ","Gestión","Eficacia","Semestral",0.8,"Porcentaje","Registros de asistencia a las actividades del plan de bienestar","Positiva","No",null,2019,"Mayo"]
["Mejorar continuamente los procesos del Sistema Integrado de Gestión","Gestión de Talento Humano","Gestionar el potencial del talento humano como factor estratégico, para contribuir con el desarrollo de la entidad en un ambiente seguro y saludable","Cobertura de servidores públicos en las actividades del plan institucional de capacitación",null,null,"Porcentaje de funcionarios que asisten a las actividades del plan institucional de capacitación","(No. de funcionarios asistentes a las actividades del plan institucional de capacitación/Total de funcionarios citados a las actividades del plan institucional de capacitación)*100","Gestión","Eficacia","Semestral",0.8,"Porcentaje","Registros de asistencia a las actividades del plan de capacitación","Positiva","No","Las capacitaciones que se incluyen en el indicador son las que implican recursos.",2019,"Mayo"]
["Mejorar continuamente los procesos del Sistema Integrado de Gestión","Gestión de Talento Humano","Gestionar el potencial del talento humano como factor estratégico, para contribuir con el desarrollo de la entidad en un ambiente seguro y saludable","Evaluación del impacto de la capacitación en el desempeño de los servidores públicos y de la entidad",null,null,"Impacto de la capacitación en el desempeño laboral de funcionarios","(No. de funcionarios con capacitaciones efectivas/Total de funcionarios evaluados)*100","Gestión","Eficacia","Trimestral",0.95,"Porcentaje","Consolidado de las evaluaciones de impacto de la capacitación","Positiva","No",null,2019,"Mayo"]
["Mejorar continuamente los procesos del Sistema Integrado de Gestión","Gestión de Talento Humano","Gestionar el potencial del talento humano como factor estratégico, para contribuir con el desarrollo de la entidad en un ambiente seguro y saludable","Satisfacción de los servidores públicos frente a las actividades de  bienestar e incentivos","Satisfacción de los servidores públicos frente a las actividades de capacitación",null,"Índice de clima organizacional","Promedio ponderado de las dimensiones evaluadas en la encuesta de medición de clima organizacional","Gestión","Eficacia","Anual",0.8,"Porcentaje","Informe de medición de clima organizacional","Positiva","No","En el análisis del indicador se presentará el resultado desagregado por áreas y/o dependencias, y por las dimensiones evaluadas.",2019,"Mayo"]
["Mejorar continuamente los procesos del Sistema Integrado de Gestión","Gestión de Talento Humano","Gestionar el potencial del talento humano como factor estratégico, para contribuir con el desarrollo de la entidad en un ambiente seguro y saludable","Cumplimiento del plan anual de  bienestar e incentivos",null,null,"Porcentaje de ejecución del plan anual de bienestar e incentivos","(No. de actividades de bienestar e incentivos desarrolladas/Total de actividades programadas en el plan anual de bienestar e incentivos)*100","Gestión","Eficacia","Semestral",1,"Porcentaje","Matriz de seguimiento a la ejecución de actividades de bienestar e incentivos","Positiva","Si","La meta es anual con medición y análisis semestral.",2019,"Mayo"]
["Mejorar continuamente los procesos del Sistema Integrado de Gestión","Gestión de Talento Humano","Gestionar el potencial del talento humano como factor estratégico, para contribuir con el desarrollo de la entidad en un ambiente seguro y saludable","Cumplimiento del plan institucional de capacitación",null,null,"Porcentaje de ejecución del plan institucional de capacitación","(No. de actividades de capacitación desarrolladas/Total de actividades programadas en el plan institucional de capacitación)*100","Gestión","Eficacia","Semestral",1,"Porcentaje","Matriz de seguimiento a la ejecución de actividades de capacitación","Positiva","Si","La meta es anual con medición y análisis semestral.",2019,"Mayo"]
["Prevenir los factores que afecten la salud y seguridad a fin de mejorar las condiciones del ambiente de trabajo","Gestión de Talento Humano","Gestionar el potencial del talento humano como factor estratégico, para contribuir con el desarrollo de la entidad en un ambiente seguro y saludable","Cumplimiento del plan anual de trabajo",null,null,"Porcentaje de ejecución del plan anual de seguridad y salud en el trabajo","(No. de actividades de seguridad y salud desarrolladas/Total de actividades programadas en el plan anual de seguridad y salud en el trabajo)*100","Gestión","Eficacia","Mensual",0.95,"Porcentaje","Plan de trabajo anual del Sistema de Gestión de Seguridad y Salud en el Trabajo","Positiva","No",null,2019,"Mayo",143,165,0.8666666666666667,0.91228070175438603,{"$f":"_xlfn.IFS(W379<=69%,\"Crítico\",W379>=90%,\"Aceptable\",W379>=70%,\"Tolerable\")","v":"Aceptable"}]
["Prevenir los factores que afecten la salud y seguridad a fin de mejorar las condiciones del ambiente de trabajo","Gestión de Talento Humano","Gestionar el potencial del talento humano como factor estratégico, para contribuir con el desarrollo de la entidad en un ambiente seguro y saludable","Tasa de accidentalidad",null,null,"Tasa de accidentalidad","(No. de accidentes de trabajo reportados/Total de trabajadores (funcionarios y contratistas)*100","Gestión","Efectividad","Mensual",0.04,"Porcentaje","Matriz de accidentes de trabajo","Negativa","No","La meta está configurada como menor o igual a 4%.",2019,"Mayo",40,3065,1.3050570962479609E-2,{"$f":"((L380-V380)+L380)/L380","v":1.6737357259380099},"Aceptable"]
["Prevenir los factores que afecten la salud y seguridad a fin de mejorar las condiciones del ambiente de trabajo","Gestión de Talento Humano","Gestionar el potencial del talento humano como factor estratégico, para contribuir con el desarrollo de la entidad en un ambiente seguro y saludable","Incidencia y prevalencia de enfermedades laborales",null,null," Prevalencia de la enfermedad laboral","(No. de casos de enfermedad laboral calificada/Total de funcionarios)*100","Gestión","Efectividad","Trimestral",0.02,"Porcentaje","Matriz de seguimiento de enfermedades laborales","Negativa","No","La meta está configurada como menor o igual a 2%.",2019,"Mayo"]
["Prevenir los factores que afecten la salud y seguridad a fin de mejorar las condiciones del ambiente de trabajo","Gestión de Talento Humano","Gestionar el potencial del talento humano como factor estratégico, para contribuir con el desarrollo de la entidad en un ambiente seguro y saludable","Incidencia y prevalencia de enfermedades laborales",null,null,"Incidencia de la enfermedad laboral","(No. de casos nuevos de enfermedad laboral calificados/Total de funcionarios)*100","Gestión","Efectividad","Trimestral",0.01,"Porcentaje","Matriz de seguimiento de enfermedades laborales","Negativa","No","La meta está configurada como menor o igual a 1%.",2019,"Mayo"]
["Mejorar continuamente los procesos del Sistema Integrado de Gestión","Gestión de Recursos Físicos","Administrar y controlar los bienes muebles y servicios para el funcionamiento administrativo de la entidad","Confiabilidad del inventario de bienes devolutivos",null,null,"Porcentaje de inventario individual validado físicamente","(No. de elementos devolutivos del inventario individual validados físicamente/Total de elementos devolutivos del inventario individual registrados en el sistema de información SEVEN)*100 ","Gestión","Eficacia","Anual",1,"Porcentaje","Sistema de información SEVEN","Positiva","No",null,2019,"Mayo"]
["Mejorar continuamente los procesos del Sistema Integrado de Gestión","Gestión de Recursos Físicos","Administrar y controlar los bienes muebles y servicios para el funcionamiento administrativo de la entidad","Confiabilidad del inventario de bienes devolutivos",null,null,"Porcentaje de inventario aleatorio validado físicamente en bodega","(No. de elementos devolutivos y de consumo en bodegas validados físicamente/Muestra de inventario de elementos devolutivos y de consumo registrados en el sistema de información SEVEN)*100 ","Gestión","Eficacia","Trimestral",1,"Porcentaje","Sistema de información SEVEN","Positiva","No",null,2019,"Mayo"]
["Mejorar continuamente los procesos del Sistema Integrado de Gestión","Gestión de Asuntos Locales","Desarrollar acciones a nivel local para promover la participación ciudadana, brindar acompañamiento a las alcaldías locales en temas misionales de la entidad y ofertar sus programas","Cumplimiento de los compromisos adquiridos por la entidad, en el marco de las instancias de participación locales",null,null,"Porcentaje de compromisos atendidos en el marco de las instancias de participación locales","(No. de compromisos atendidos en las instancias Consejo Local de Gobierno, Unidad de Apoyo Técnico y Comisión Local Intersectorial de Participación /Total de compromisos generados en las instancias Consejo Local de Gobierno, Unidad de Apoyo Técnico y Comisión Local Intersectorial de Participación)*100","Gestión","Eficacia","Trimestral",1,"Porcentaje","Matriz de seguimiento a compromisos derivados de instancias de participación locales","Positiva","No",null,2019,"Mayo"]
["Mejorar continuamente los procesos del Sistema Integrado de Gestión","Gestión de Asuntos Locales","Desarrollar acciones a nivel local para promover la participación ciudadana, brindar acompañamiento a las alcaldías locales en temas misionales de la entidad y ofertar sus programas","Efectividad en la atención de la demanda de actividades recreodeportivas en las localidades de Bogotá",null,null,"Porcentaje de actividades recreativas programadas por asuntos locales","(No. de actividades recreativas programadas en la plataforma SIM por los gestores locales/Total de actividades recreativas solicitadas por Promoción de la Recreación)*100","Gestión","Eficacia","Mensual",1,"Porcentaje","Sistema de información misional - SIM\nCuadro de metas de actividades recreativas","Positiva","No",null,2019,"Mayo",2921,2573,1.1352506801399145,{"$f":"+V386/L386","v":1.1352506801399145},"Aceptable"]
["Mejorar continuamente los procesos del Sistema Integrado de Gestión","Gestión de Asuntos Locales","Desarrollar acciones a nivel local para promover la participación ciudadana, brindar acompañamiento a las alcaldías locales en temas misionales de la entidad y ofertar sus programas","Efectividad en la atención de la demanda de actividades recreodeportivas en las localidades de Bogotá",null,null,"Porcentaje de beneficiarios inscritos por asuntos locales en actividades deportivas","(No. de beneficiarios inscritos en actividades deportivas por los gestores locales/Total de beneficiarios de actividades deportivas programados por Fomento al Deporte)*100","Gestión","Eficacia","Trimestral",1,"Porcentaje","Reporte de las distintas plataformas para inscripciones\nCuadro de metas de actividades deportivas","Positiva","No",null,2019,"Mayo"]
["Mejorar continuamente los procesos del Sistema Integrado de Gestión","Gestión de Asuntos Locales","Desarrollar acciones a nivel local para promover la participación ciudadana, brindar acompañamiento a las alcaldías locales en temas misionales de la entidad y ofertar sus programas","Cumplimiento de lineamientos y criterios de elegibilidad y viabilidad de los proyectos de contratación",null,null,"Porcentaje de asistencias técnicas realizadas a los Fondos de Desarrollo Local","(No. de asistencias técnicas realizadas a los Fondos de Desarrollo Local/Total de asistencias técnicas programadas a los Fondos de Desarrollo Local en las cuatro líneas de inversión)*100","Gestión","Eficacia","Trimestral",1,"Porcentaje","Cronograma de asistencias técnicas a los Fondos de Desarrollo Local","Positiva","No",null,2019,"Mayo"]
["Mejorar continuamente los procesos del Sistema Integrado de Gestión","Gestión de Asuntos Locales","Desarrollar acciones a nivel local para promover la participación ciudadana, brindar acompañamiento a las alcaldías locales en temas misionales de la entidad y ofertar sus programas","Ejecución de los proyectos con recursos de los fondos de desarrollo local, en concordancia con el concepto previo y favorable emitido por la entidad",null,null,"Porcentaje de proyectos viabilizados con seguimiento efectuado","(No. de proyectos contratados con seguimiento efectuado/Total de proyectos viabilizados con contratación por parte de los Fondos de Desarrollo Local)*100","Gestión","Eficacia","Trimestral",1,"Porcentaje","SECOP\nInforme de seguimiento a viabilidades","Positiva","No",null,2019,"Mayo"]
["Mejorar continuamente los procesos del Sistema Integrado de Gestión","Control Disciplinario","Investigar conductas presuntamente disciplinables e imponer sanciones cuando haya lugar, tanto a servidores como a ex-servidores públicos de la entidad, con el fin de que éstos cumplan con sus deberes y funciones","Cumplimiento de los términos legales en las distintas etapas procesales",null,null,"Porcentaje de procesos disciplinarios resueltos de fondo","(No. de procesos disciplinarios decididos de fondo/Total de procesos disciplinarios activos)*100","Gestión","Eficacia","Semestral",0.6,"Porcentaje","Matriz de autos","Positiva","No",null,2019,"Mayo"]
["Mejorar continuamente los procesos del Sistema Integrado de Gestión","Control Disciplinario","Investigar conductas presuntamente disciplinables e imponer sanciones cuando haya lugar, tanto a servidores como a ex-servidores públicos de la entidad, con el fin de que éstos cumplan con sus deberes y funciones","Garantía del debido proceso en las distintas etapas procesales",null,null,"Porcentaje de procesos disciplinarios sin nulidades decretadas","(No. de procesos disciplinarios sin nulidades decretadas/Total de procesos disciplinarios activos)*100 ","Gestión","Eficacia","Trimestral",1,"Porcentaje","Matriz de autos","Positiva","No",null,2019,"Mayo"]
["Mejorar continuamente los procesos del Sistema Integrado de Gestión","Control Disciplinario","Investigar conductas presuntamente disciplinables e imponer sanciones cuando haya lugar, tanto a servidores como a ex-servidores públicos de la entidad, con el fin de que éstos cumplan con sus deberes y funciones","Cumplimiento de los términos legales en las distintas etapas procesales",null,null,"Porcentaje de procesos disciplinarios sin vencimiento de términos","(No. de procesos disciplinarios sin vencimiento de términos/Total de procesos disciplinarios activos)*100","Gestión","Calidad","Trimestral",1,"Porcentaje","Expediente del proceso disciplinario ","Positiva","No",null,2019,"Mayo"]
["Mejorar continuamente los procesos del Sistema Integrado de Gestión","Administración y Mantenimiento de Parques y Escenarios","Ofrecer parques y escenarios del Sistema Distrital para el uso y disfrute de la comunidad general, gestionando la sostenibilidad física, social, ambiental y económica","Uso de parques y escenarios con motivación económica que generen recursos para el mantenimiento de los mismos",null,null,"Aprovechamiento económico de parques y/o escenarios","(Ingresos del mes + acumulado de los ingresos del mes anterior/Total presupuesto anual)*100","Gestión","Eficiencia","Mensual",1,"Porcentaje","Sistema de información SEVEN","Positiva","Si","La meta es anual con medición y análisis mensual.\n\nEn el análisis del indicador se presentará la desagregación del aprovechamiento económico por tipo de parque y/o escenario, expresado en ingresos y participación porcentual.",2019,"Mayo",10505687,22044017,{"$f":"+T393/U393","v":0.47657770360093626},0.47657770360093626]
["Satisfacer las necesidades de los usuarios a través de la prestación de servicios eficientes, eficaces y efectivos","Administración y Mantenimiento de Parques y Escenarios","Ofrecer parques y escenarios del Sistema Distrital para el uso y disfrute de la comunidad general, gestionando la sostenibilidad física, social, ambiental y económica","Satisfacción de los usuarios con las actividades de mantenimiento preventivo y correctivo",null,null,"Satisfacción de los usuarios con las obras de mantenimiento de nuevas tendencias","(No. de usuarios satisfechos con las obras de mantenimiento realizadas/Total de usuarios de parques y escenarios encuestados para obras de mantenimiento de nuevas tendencias)*100","Gestión","Efectividad","Anual",0.9,"Porcentaje","Encuesta de satisfacción con las obras de mantenimiento de nuevas tendencias","Positiva","No","En el análisis del indicador se presentará el resultado desagregado por cada uno de los aspectos evaluados en la encuesta de satisfacción.",2019,"Mayo"]
["Mejorar continuamente los procesos del Sistema Integrado de Gestión","Administración y Mantenimiento de Parques y Escenarios","Ofrecer parques y escenarios del Sistema Distrital para el uso y disfrute de la comunidad general, gestionando la sostenibilidad física, social, ambiental y económica","Oportunidad y cumplimiento en la generación de compromisos o acuerdos ciudadanos frente al uso y sostenibilidad de los parques administrados",null,null,"Porcentaje de cumplimiento en acuerdos de sostenibilidad social de parques","(No. de compromisos gestionados/Total de compromisos adquiridos mediante acuerdos ciudadanos en parques)*100","Gestión","Eficacia","Trimestral",1,"Porcentaje","Matriz de seguimiento a compromisos o acuerdos ciudadanos","Positiva","No",null,2019,"Mayo"]
["Mejorar continuamente los procesos del Sistema Integrado de Gestión","Administración y Mantenimiento de Parques y Escenarios","Ofrecer parques y escenarios del Sistema Distrital para el uso y disfrute de la comunidad general, gestionando la sostenibilidad física, social, ambiental y económica","Disponibilidad de los equipamientos en parques y escenarios","Cumplimiento de las especificaciones técnicas en las actividades de mantenimiento preventivo y correctivo","Cobertura en el mantenimiento de parques y escenarios de acuerdo con la priorización","Porcentaje de avance en la ejecución de contratos de obras de mantenimiento o recuperación","(Porcentaje contrato 1 + Porcentaje contrato 2 +...+ Porcentaje contrato n)/Total de contratos de obras de mantenimiento o recuperación en ejecución\nDonde: \nPorcentaje contrato n = Avance físico ejecutado/Avance físico programado\nn = Número de contratos de obras de mantenimiento o recuperación en ejecución","Gestión","Eficacia","Bimestral",0.9,"Porcentaje","Informes mensuales de interventoría presentados según programación de los contratistas","Positiva","No",null,2019,"Mayo"]
["Satisfacer las necesidades de los usuarios a través de la prestación de servicios eficientes, eficaces y efectivos","Diseño y Construcción de Parques y Escenarios","Ampliar y mejorar la infraestructura física recreativa y deportiva del Distrito Capital para el uso de la comunidad en general","Cumplimiento de requisitos técnicos, administrativos, financieros y jurídicos de los proyectos",null,null,"Satisfacción de los usuarios con las obras de construcción y/o adecuación entregadas","(No. de usuarios satisfechos con las obras de construcción y/o adecuación entregadas /Total de usuarios encuestados por proyecto)*100","Gestión","Efectividad","Anual",0.9,"Porcentaje","Resultados de la encuesta de satisfacción entregados por los contratistas de obra","Positiva","No","En el análisis del indicador se presentará el resultado desagregado por cada uno de los aspectos evaluados en la encuesta de satisfacción.",2019,"Mayo"]
["Mejorar continuamente los procesos del Sistema Integrado de Gestión","Diseño y Construcción de Parques y Escenarios","Ampliar y mejorar la infraestructura física recreativa y deportiva del Distrito Capital para el uso de la comunidad en general","Oportunidad en el seguimiento y adopción de medidas durante el seguimiento de la estabilidad de la obra","Cumplimiento de especificaciones técnicas conforme a lo establecido en la etapa de construcción",null,"Porcentaje de fallas de calidad o estabilidad de obra atendidas en construcción y adecuación de parques y escenarios","(No. de fallas de calidad o estabilidad de obra atendidas/Total de fallas de calidad o estabilidad de obra detectadas o reportadas por terceros)*100\n\nAtendido = Se genera requerimiento al contratista para establecer compromisos de reparación.","Gestión","Eficacia","Trimestral",0.9,"Porcentaje","Actas de visita o reconocimiento de estabilidad de obra \nActa de compromiso de reparación constructiva\nProgramación de visita\nComunicación oficial- notificación de fallas visita de inspección por estabilidad \nActa de verificación de reparación constructiva","Positiva","No","En el análisis del indicador se presentará la desagregación por parque y escenario.",2019,"Mayo"]
["Mejorar continuamente los procesos del Sistema Integrado de Gestión","Diseño y Construcción de Parques y Escenarios","Ampliar y mejorar la infraestructura física recreativa y deportiva del Distrito Capital para el uso de la comunidad en general","Cumplimiento de requisitos técnicos, administrativos, financieros y jurídicos de los proyectos","Oportunidad en el seguimiento y adopción de medidas durante la ejecución de las obras","Cumplimiento del alcance de las obras conforme a los estudios y diseños, especificaciones técnicas y normatividad vigente","Porcentaje de avance en la ejecución de obras de construcción y adecuación de parques y escenarios","((%Ejecutado Obra 1*Plazo de ejecución Obra 1)+(%Ejecutado Obra 2*Plazo de ejecución Obra 2) +...+ (%Ejecutado Obra n*Plazo de ejecución Obra n))/((%Programado Obra 1*Plazo de ejecución Obra 1)+(%Programado Obra 2*Plazo de ejecución Obra 2) +...+ (%Programado Obra n*Plazo de ejecución Obra n))\nDonde:\nn = Número de obras en ejecución","Gestión","Eficacia","Mensual",0.9,"Porcentaje","Informes mensuales de interventoría\n\nInformes mensuales de supervisión","Positiva","No","En el análisis del indicador se presentará la desagregación por parque y escenario.",2019,"Mayo",43.94,46.39,0.9471868937270963,1.0524298819189959,{"$f":"_xlfn.IFS(W399<=69%,\"Crítico\",W399>=90%,\"Aceptable\",W399>=70%,\"Tolerable\")","v":"Aceptable"}]
["Mejorar continuamente los procesos del Sistema Integrado de Gestión","Diseño y Construcción de Parques y Escenarios","Ampliar y mejorar la infraestructura física recreativa y deportiva del Distrito Capital para el uso de la comunidad en general","\nCumplimiento de requisitos técnicos, administrativos, financieros y legales de los proyectos de estudios y diseños","Oportunidad en el seguimiento y adopción de medidas durante la ejecución de los proyectos de estudios y diseños","Cumplimiento del alcance de los proyectos de estudios y diseños conforme a las necesidades identificadas","Porcentaje de avance en la ejecución de proyectos de estudios y/o diseños de parques y escenarios","(Porcentaje proyecto 1 + Porcentaje proyecto 2 +...+ Porcentaje proyecto n)/Total de proyectos de estudios y/o diseños en ejecución\nDonde: \nPorcentaje proyecto n =(Avance ejecutado de estudios y/o diseños/Avance programado de estudios y/o diseños al corte según forma de pago)\nn = Número de proyectos de estudios y/o diseños en ejecución","Gestión","Eficacia","Mensual",0.9,"Porcentaje","Informes mensuales de interventoría\n\nInformes mensuales de supervisión","Positiva","No","En el análisis del indicador se presentará la desagregación por proyecto.",2019,"Mayo",86,94,0.91489361702127658,1.0165484633569739,"Aceptable"]
["Mejorar continuamente los procesos del Sistema Integrado de Gestión","Gestión Jurídica","Ejercer la defensa judicial y extrajudicial de la entidad y atender requerimientos jurídicos, para salvaguardar sus intereses y cumplir con los requisitos constitucionales y legales","Intervención oportuna en las distintas actuaciones judiciales y extrajudiciales en que sea parte la entidad","Oportunidad en el seguimiento a los procesos en los despachos e instancias judiciales",null,"Porcentaje de procesos judiciales y extrajudiciales atendidos dentro de los términos legales vigentes","(No. de procesos jurídicos atendidos dentro de los términos legales vigentes)/Total de procesos jurídicos notificados)*100","Gestión","Calidad","Trimestral",1,"Porcentaje","SIPROJ Web\nORFEO","Positiva","No","En el análisis del indicador se presentará la desagregación por procesos judiciales y extrajudiciales.",2019,"Mayo"]
["Satisfacer las necesidades de los usuarios a través de la prestación de servicios eficientes, eficaces y efectivos","Gestión Jurídica","Ejercer la defensa judicial y extrajudicial de la entidad y atender requerimientos jurídicos, para salvaguardar sus intereses y cumplir con los requisitos constitucionales y legales","Cumplimiento de los requisitos establecidos para el reconocimiento deportivo y el aval de escuelas deportivas",null,null,"Satisfacción de los usuarios con el trámite de reconocimiento deportivo","(No. de usuarios satisfechos con el trámite de reconocimiento deportivo/Total de usuarios encuestados)*100","Gestión","Efectividad","Semestral",0.95,"Porcentaje","Encuesta de satisfacción de usuarios de reconocimiento deportivo","Positiva","No","En el análisis del indicador se presentarán los resultados desagregados por cada uno de los aspectos evaluados en la encuesta de satisfacción.",2019,"Mayo"]
["Mejorar continuamente los procesos del Sistema Integrado de Gestión","Gestión Jurídica","Ejercer la defensa judicial y extrajudicial de la entidad y atender requerimientos jurídicos, para salvaguardar sus intereses y cumplir con los requisitos constitucionales y legales","Oportunidad en la respuesta del trámite de otorgamiento deportivo (45 días hábiles siguientes al cumplimiento de requisitos de otorgamiento deportivo)","Vigencia y aplicabilidad de la normatividad empleada para el reconocimiento deportivo y el aval de escuelas deportivas",null,"Porcentaje de trámites de reconocimiento deportivo atendidos dentro del término legal vigente","(No. de trámites de reconocimiento deportivo atendidos dentro del término legal vigente/Total de trámites de reconocimiento deportivo atendidos)*100 ","Gestión","Calidad","Trimestral",0.92,"Porcentaje","Matriz de control de reconocimiento deportivo","Positiva","No",null,2019,"Mayo"]
["Mejorar continuamente los procesos del Sistema Integrado de Gestión","Gestión Jurídica","Ejercer la defensa judicial y extrajudicial de la entidad y atender requerimientos jurídicos, para salvaguardar sus intereses y cumplir con los requisitos constitucionales y legales","Oportunidad en la respuesta del trámite de aval de escuelas deportivas (58 días hábiles)","Vigencia y aplicabilidad de la normatividad empleada para el reconocimiento deportivo y el aval de escuelas deportivas",null,"Porcentaje de trámites de aval de escuelas deportivas atendidos dentro del término legal vigente","(No. de trámites de aval de escuelas deportivas atendidos dentro del término legal vigente/Total de trámites de aval de escuelas deportivas atendidos)*100","Gestión","Calidad","Trimestral",0.92,"Porcentaje","Matriz de control de aval de escuelas deportivas","Positiva","No",null,2019,"Mayo"]
["Mejorar continuamente los procesos del Sistema Integrado de Gestión","Gestión Jurídica","Ejercer la defensa judicial y extrajudicial de la entidad y atender requerimientos jurídicos, para salvaguardar sus intereses y cumplir con los requisitos constitucionales y legales","Oportunidad en la respuesta a conceptos de proyectos de acuerdo con los tiempos establecidos","Suministro oportuno de la información de carácter técnico, de oportunidad y conveniencia del proyecto por parte de las dependencias y áreas de la entidad",null,"Porcentaje de solicitudes de concepto a proyectos de acuerdo, decreto o ley atendidas dentro del tiempo establecido","(No. de solicitudes de concepto a proyectos de acuerdo, decreto o ley atendidas dentro del tiempo establecido/Total de solicitudes de concepto a proyectos de acuerdo, decreto o ley recibidas)*100","Gestión","Calidad","Semestral",0.9,"Porcentaje","Matriz de seguimiento a solicitudes Congreso y Concejo","Positiva","No","En el análisis del indicador se presentará la desagregación por proyectos de acuerdo, decreto y ley.",2019,"Mayo"]
["Mejorar continuamente los procesos del Sistema Integrado de Gestión","Gestión Jurídica","Ejercer la defensa judicial y extrajudicial de la entidad y atender requerimientos jurídicos, para salvaguardar sus intereses y cumplir con los requisitos constitucionales y legales","Recuperación de la cartera en mora",null,null,"Porcentaje de procesos de cobro de cartera efectuados","(No. de procesos con etapas de cobro efectuadas/Total de procesos de cobro remitidos con documentación completa)*100","Gestión","Eficacia","Cuatrimestral",1,"Porcentaje","Matriz de seguimiento cobro de cartera","Positiva","No","Los primeros cinco días hábiles de mayo se reportará el indicador con corte a 31 de diciembre del año anterior. \nLos primeros días de septiembre se reportará con corte 30 de abril de la vigencia.\nLos primeros días de enero se reportará con corte a 31 de agosto del año anterior.\nEn el análisis del indicador se presentará la desagregación por etapa (persuasivo y coactivo), así como también el porcentaje de recuperación de cartera.",2019,"Mayo"]
["Mejorar continuamente los procesos del Sistema Integrado de Gestión","Gestión Jurídica","Ejercer la defensa judicial y extrajudicial de la entidad y atender requerimientos jurídicos, para salvaguardar sus intereses y cumplir con los requisitos constitucionales y legales","Intervención oportuna en las distintas actuaciones judiciales y extrajudiciales en que sea parte la entidad - tipos de daño en que se resulte demandado o condenado",null,null,"Índice de condenas adversas","(No. de condenas adversas/Total de procesos judiciales)*100","Gestión","Calidad","Semestral",0.08,"Porcentaje","Informe Siproj web mensual (procesos judiciales)","Negativa","No","El análisis del indicador debe evaluar dentro del comité de conciliación los procesos que cursen o hayan cursado en contra de la entidad, determinando causas generadoras de conflictos y los tipos de daño.",2019,"Mayo"]
["Mejorar continuamente los procesos del Sistema Integrado de Gestión","Gestión de Comunicaciones","Dar a conocer interna y externamente las actividades, programas y obras que realiza la entidad, para generar apropiación y participación que contribuyan al posicionamiento de la imagen institucional","Exigencia de la solicitud de servicios para todos los procesos con la información completa y detallada de lo requerido","Veracidad de la información reportada por los solicitantes del servicio ",null,"Porcentaje de solicitudes de servicios de comunicaciones atendidas dentro de los tiempos establecidos","(No. de solicitudes de servicio atendidas dentro de los tiempos establecidos/Total de solicitudes de servicio de comunicaciones recibidas)*100","Gestión","Calidad","Trimestral",0.9,"Porcentaje","Consolidado de solicitudes de servicios de comunicaciones","Positiva","No",null,2019,"Mayo"]
["Mejorar continuamente los procesos del Sistema Integrado de Gestión","Gestión de Comunicaciones","Dar a conocer interna y externamente las actividades, programas y obras que realiza la entidad, para generar apropiación y participación que contribuyan al posicionamiento de la imagen institucional","Relacionamiento con medios de comunicación","Análisis de los resultados obtenidos mediante el monitoreo de medios para facilitar la toma de decisiones",null,"Impacto de noticias publicadas en medios de comunicación","(No. de noticias positivas o neutras registradas/Total de noticias publicadas en medios de comunicación)*100","Gestión","Eficacia","Trimestral",1,"Porcentaje","Informes mensuales generados por la empresa contratada para realizar el monitoreo de medios","Positiva","No","En el análisis del indicador se presentará el resultado desagregado de noticias positivas y neutras, indicando los principales medios de comunicación.\nSe colocó una meta de 100%, mientras se levanta la línea base con la primera medición.",2019,"Mayo"]
["Mejorar continuamente los procesos del Sistema Integrado de Gestión","Gestión de Comunicaciones","Dar a conocer interna y externamente las actividades, programas y obras que realiza la entidad, para generar apropiación y participación que contribuyan al posicionamiento de la imagen institucional","Seguimiento a los cambios en las condiciones de publicación en redes sociales y página web",null,null,"Tasa de variación en el alcance total de las publicaciones en redes sociales","((Alcance total de publicaciones en el trimestre actual - Alcance total de publicaciones en el trimestre anterior)/Alcance total de publicaciones en el trimestre anterior)*100\n\nDonde:\n\nAlcance total de las publicaciones = Total de usuarios que vieron las publicaciones de redes sociales","Gestión","Eficacia","Trimestral",0.2,"Porcentaje","Métricas nativas de cada red social","Positiva","No","En el análisis del indicador se presentará el resultado desagregado del alcance de las publicaciones por cada red social. ",2019,"Mayo"]
["Mejorar continuamente los procesos del Sistema Integrado de Gestión","Gestión de Comunicaciones","Dar a conocer interna y externamente las actividades, programas y obras que realiza la entidad, para generar apropiación y participación que contribuyan al posicionamiento de la imagen institucional","Análisis de los resultados obtenidos mediante el monitoreo de medios para facilitar la toma de decisiones",null,null,"Salidas publicadas en medios de comunicación","N/A","Gestión","Eficacia","Mensual",80,"Número","Informes mensuales generados por la empresa contratada para realizar el monitoreo de medios","Positiva","No","En el análisis del indicador se presentará el valor estimado de las publicaciones en medios de comunicación.",2019,"Mayo",101,1,{"$f":"+T411/U411","v":101},{"$f":"+V411/L411","v":1.2625},{"$f":"_xlfn.IFS(W411<=69%,\"Crítico\",W411>=90%,\"Aceptable\",W411>=70%,\"Tolerable\")","v":"Aceptable"}]
["Mejorar continuamente los procesos del Sistema Integrado de Gestión","Planeación de la Gestión","Establecer directrices para formular y realizar seguimiento a la planeación estratégica y operativa de la entidad con el propósito de contribuir al desarrollo de la misión y objetivos institucionales, así como facilitar la oportunidad y cumplimiento de los resultados esperados","Oportunidad, veracidad y calidad de la información de inversión y gestión",null,null,"Porcentaje de reportes de información presentados dentro de los tiempos programados","(No. de reportes de información elaborados y presentados/Total de reportes de información programados)*100","Gestión","Calidad","Trimestral",1,"Porcentaje","Cronograma de trabajo interno, plan operativo por dependencias (Oficina Asesora de Planeación), plan de adecuación y sostenibilidad SIGD-MIPG","Positiva","No","En el análisis del indicador se desagregará la programación para cada trimestre.",2019,"Junio",37,37,1,1,"Aceptable"]
["Mejorar continuamente los procesos del Sistema Integrado de Gestión","Planeación de la Gestión","Establecer directrices para formular y realizar seguimiento a la planeación estratégica y operativa de la entidad con el propósito de contribuir al desarrollo de la misión y objetivos institucionales, así como facilitar la oportunidad y cumplimiento de los resultados esperados","Oportunidad en el seguimiento de las acciones institucionales para la mejora (correcciones, acciones correctivas, oportunidades de mejora, acciones para abordar riesgos)",null,null,"Porcentaje de acciones de mejora con seguimiento efectuado dentro del Sistema de Gestión","[No. de acciones de mejora con seguimiento efectuado dentro del tiempo programado/Total de acciones de mejora abiertas dentro del Sistema de Gestión de la Calidad (correcciones, acciones correctivas, oportunidades de mejora, acciones para abordar riesgos)]*100","Gestión","Eficacia","Mensual",1,"Porcentaje","Isolución","Positiva","No","En el análisis del indicador se presentará el resultado desagregado por cada tipología de mejora (corrección, acciones correctivas, oportunidades de mejora, acciones para abordar riesgos).",2019,"Junio",31,31,1,1,"Aceptable"]
["Mejorar continuamente los procesos del Sistema Integrado de Gestión","Gestión de Recursos Físicos","Administrar y controlar los bienes muebles y servicios para el funcionamiento administrativo de la entidad","Oportunidad en la atención de requerimientos y necesidades de servicios administrativos",null,null,"Porcentaje de mantenimientos realizados a la infraestructura física de la sede administrativa","(No. de mantenimientos realizados a la infraestructura física/Total de mantenimientos programados a la infraestructura física de la sede administrativa)*100","Gestión","Eficacia","Trimestral",0.9,"Porcentaje","Expendientes contractuales en plataforma ORFEO","Positiva","No",null,2019,"Junio",12,12,1,1.1111111111111112,"Aceptable"]
["Mejorar continuamente los procesos del Sistema Integrado de Gestión","Gestión de Asuntos Locales","Desarrollar acciones a nivel local para promover la participación ciudadana, brindar acompañamiento a las alcaldías locales en temas misionales de la entidad y ofertar sus programas","Oportunidad en la emisión del concepto previo y favorable según los tiempos establecidos en la normatividad vigente",null,null,"Porcentaje de conceptos previos tramitados dentro de los términos legales vigentes","(No. de conceptos previos tramitados dentro de los términos legales vigentes/Total de solicitudes de conceptos previos recibidas)*100","Gestión","Calidad","Trimestral",0.5,"Porcentaje","Matriz de seguimiento a conceptos previos tramitados","Positiva","No",null,2019,"Junio",21,37,0.56756756756756754,1.1351351351351351,"Aceptable"]
["Mejorar continuamente los procesos del Sistema Integrado de Gestión","Control, Evaluación y Seguimiento","Evaluar los controles y la gestión de la entidad con el fin de identificar e implementar acciones de mejora, en pro de la sostenibilidad del Sistema de Control Interno","Pertinencia y oportunidad en la entrega de los resultados del seguimiento a las partes interesadas","Oportunidad y calidad en la información reportada a las entidades competentes del orden nacional y distrital",null,"Porcentaje de informes presentados por la tercera línea de defensa dentro de los tiempos programados","(No. de informes de ley y de gestión elaborados y presentados dentro de los tiempos programados/Total de informes de ley y de gestión a cargo de la tercera línea de defensa )*100  ","Gestión","Calidad","Trimestral",1,"Porcentaje","Plan anual de auditoría\nCronograma presentación de informes","Positiva","No","En el análisis del indicador se presentará el resultado desagregado por cada uno de los informes realizados.",2019,"Junio",30,30,1,1,"Aceptable"]
["Mejorar continuamente los procesos del Sistema Integrado de Gestión","Control, Evaluación y Seguimiento","Evaluar los controles y la gestión de la entidad con el fin de identificar e implementar acciones de mejora, en pro de la sostenibilidad del Sistema de Control Interno","Cumplimiento de los objetivos definidos en el plan de auditoría conforme al plan de pruebas","Cobertura de las unidades a auditar de acuerdo con los parámetros establecidos en la matriz de priorización, en concordancia con los recursos disponibles para la ejecución del Plan Anual de Auditoría",null,"Índice de eficacia de auditorías internas de control interno","(Índice auditoría 1 + índice auditoría 2 +...+Índice auditoría n)/Total de auditorías realizadas\nDonde: \nÍndice auditoría n = Calificación porcentual de la variable Objetivos Específicos*Peso de la variable Objetivos Específicos + Calificación porcentual de la variable Actividad Plan de Auditoría*Peso de la variable Actividad Plan de Auditoría + Calificación porcentual de la variable Oportunidad*Peso de la variable Oportunidad\nPesos de las variables:\nObjetivos Específicos = 40%\nActividades Plan de Auditoría = 30%\nOportunidad = 30%. Esta se medirá tomando como fecha de referencia la de emisión del informe preliminar de auditoría.\nn = número de auditorías realizadas","Gestión","Eficacia","Trimestral",0.85,"Porcentaje","Planes de cada una de las auditorías","Positiva","No","En el análisis del indicador se presentará el resultado desagregado por cada una de las auditorías realizadas.",2019,"Junio",4.33,5,0.86599999999999999,{"$f":"+V417/L417","v":1.0188235294117647},"Aceptable"]
["Mejorar continuamente los procesos del Sistema Integrado de Gestión","Gestión Financiera","Administrar los recursos financieros asignados y realizar los respectivos registros, para el cumplimiento de las funciones de la entidad y pago de sus obligaciones con terceros","Oportunidad en el seguimiento de las partidas pendientes por conciliar",null,null,"Porcentaje de partidas conciliatorias identificadas dentro del tiempo establecido","(No. de partidas conciliatorias identificadas con edad inferior a 60 días/Total de partidas reportadas)*100","Gestión","Calidad","Mensual",0.9,"Porcentaje","Sistema de información SEVEN","Positiva","No",null,2019,"Junio",16,21,0.76190476190476186,0.84656084656084651,"Tolerable"]
["Mejorar continuamente los procesos del Sistema Integrado de Gestión","Gestión Financiera","Administrar los recursos financieros asignados y realizar los respectivos registros, para el cumplimiento de las funciones de la entidad y pago de sus obligaciones con terceros","Oportunidad e integridad de la información necesaria para realizar las diferentes conciliaciones",null,null,"Porcentaje de obligaciones contingentes registradas correctamente en la contabilidad","(No. de procesos registrados correctamente en la contabilidad/Total de procesos reportados en SIPROJ Web)*100","Gestión","Calidad","Trimestral",1,"Porcentaje","Sistema de información SEVEN","Positiva","No",null,2019,"Junio",null,null,null,null,null,"Sin reporte"]
["Mejorar continuamente los procesos del Sistema Integrado de Gestión","Gestión Financiera","Administrar los recursos financieros asignados y realizar los respectivos registros, para el cumplimiento de las funciones de la entidad y pago de sus obligaciones con terceros","Oportunidad en la presentación de informes y estados financieros a los diferentes entes de vigilancia y control",null,null,"Porcentaje de notas a los estados financieros reveladas correctamente","(No. de notas sin observaciones por parte de los órganos de control internos y externos/Total de notas a los estados financieros elaboradas)*100","Gestión","Calidad","Anual",0.95,"Porcentaje","Informes de entes de control y vigilancia","Positiva","No",null,2019,"Junio"]
["Mejorar continuamente los procesos del Sistema Integrado de Gestión","Gestión Financiera","Administrar los recursos financieros asignados y realizar los respectivos registros, para el cumplimiento de las funciones de la entidad y pago de sus obligaciones con terceros","Oportunidad en la presentación de informes y estados financieros a los diferentes entes de vigilancia y control","Oportunidad en la presentación de las declaraciones tributarias",null,"Porcentaje de informes financieros presentados a los entes de vigilancia y control dentro de los términos legales vigentes","(No. de informes financieros presentados dentro de los términos legales vigentes/Total de informes financieros a reportar a los entes de vigilancia y control)*100","Gestión","Calidad","Trimestral",1,"Porcentaje","Matriz de seguimiento a la presentación de informes ","Positiva","No",null,2019,"Junio",12,12,1,1,"Aceptable","Reportado con posterioridad al informe"]
["Satisfacer las necesidades de los usuarios a través de la prestación de servicios eficientes, eficaces y efectivos","Promoción de la Recreación","Desarrollar actividades recreativas en función de las características y necesidades de la población de Bogotá D.C., para promover el aprovechamiento del tiempo libre y el mejoramiento en la calidad de vida","Satisfacción del usuario con las actividades recreativas realizadas",null,null,"Satisfacción de los usuarios con los eventos y/o programas recreativos","(No. de usuarios satisfechos con los eventos y/o programas recreativos/Total de usuarios de eventos y/o programas recreativos encuestados)*100","Gestión","Efectividad","Anual",1,"Porcentaje","Encuesta de satisfacción sobre eventos y/o programas recreativos","Positiva","No","En el análisis del indicador se presentará el resultado desagregado por programa y por cada uno de los aspectos evaluados en la encuesta de satisfacción.\nSe colocó una meta de 100%, mientras se levanta la línea base con la primera medición.",2019,"Junio"]
["Mejorar continuamente los procesos del Sistema Integrado de Gestión","Promoción de la Recreación","Desarrollar actividades recreativas en función de las características y necesidades de la población de Bogotá D.C., para promover el aprovechamiento del tiempo libre y el mejoramiento en la calidad de vida","Cumplimiento del programa de actividades recreativas, teniendo en cuenta lo establecido en las fichas técnicas o según lo concertado con la comunidad e instituciones",null,null,"Porcentaje de actividades recreativas que cumplen con los requisitos para su ejecución","(No. de actividades recreativas que cumplen con los requisitos definidos para su ejecución/Total de actividades recreativas realizadas)*100","Gestión","Eficacia","Trimestral",0.97,"Porcentaje","Sistema de información misional - SIM","Positiva","No","En el análisis del indicador se presentará el resultado desagregado por programa y por actividad.",2019,"Junio",15024,15094,0.99536239565390217,1.0261467996431981,"Aceptable"]
["Satisfacer las necesidades de los usuarios a través de la prestación de servicios eficientes, eficaces y efectivos","Fomento al Deporte","Desarrollar e implementar programas deportivos y de actividad física, para contribuir con el mejoramiento de la calidad de vida en la población de Bogotá D.C.","Satisfacción del usuario con las actividades deportivas  realizadas",null,null,"Satisfacción de los usuarios con las actividades realizadas en los programas deportivos","(No. de usuarios satisfechos con las actividades deportivas realizadas/Total de usuarios de actividades deportivas encuestados)*100","Gestión","Efectividad","Anual",1,"Porcentaje","Encuesta de satisfacción sobre actividades/programas deportivos","Positiva","No","En el análisis del indicador se presentará el resultado desagregado por programa y por cada uno de los aspectos evaluados en la encuesta de satisfacción.\nSe colocó una meta de 100%, mientras se levanta la línea base con la primera medición.",2019,"Junio"]
["Mejorar continuamente los procesos del Sistema Integrado de Gestión","Fomento al Deporte","Desarrollar e implementar programas deportivos y de actividad física, para contribuir con el mejoramiento de la calidad de vida en la población de Bogotá D.C.","Cambios comportamentales como resultados de los programas deportivos y de actividad física",null,null,"Cambio comportamental frente a la actividad física y el deporte","(No. de beneficiarios con percepción de cambio comportamental alrededor de las 4 dimensiones de la alfabetización física/Total de beneficiarios de programas deportivos y de actividad física seleccionados en la muestra)*100","Gestión","Efectividad","Anual",1,"Porcentaje","Encuesta para medir las 4 dimensiones de la alfabetización física","Positiva","No","La metodología se aplicará sobre una muestra por cada por cada programa. Se define en 4 tipos de mediciones:\n1. Medición dimensión competencia física. Aplicar test de resistencia, fuerza de torso, habilidades y flexibilidad.\n2. Medición dimensiones: competencia cognitiva, comportamental y motivacional a través de un cuestionario (on-line o presencial).\nSe colocó una meta de 100%, mientras se levanta la línea base con la primera medición.",2019,"Junio"]
["Satisfacer las necesidades de los usuarios a través de la prestación de servicios eficientes, eficaces y efectivos","Servicio a la Ciudadanía","Brindar información y atender los requerimientos de los grupos de valor y de interés de la entidad para responder a sus necesidades en cumplimiento de sus derechos","Oportunidad y calidad en la respuesta a los requerimientos de los grupos de valor e interés de la entidad","Satisfacción del ciudadano frente a las respuestas a sus requerimientos",null,"Satisfacción de peticionarios con la respuesta dada a sus requerimientos","(No. de peticionarios satisfechos con la respuesta dada a sus peticiones, quejas, reclamos y sugerencias/Total de peticionarios contactados)*100","Gestión","Efectividad","Mensual",0.8,"Porcentaje","Base de datos de gestión de PQRS","Positiva","No",null,2019,"Junio",20,25,0.8,1,"Aceptable"]
["Mejorar continuamente los procesos del Sistema Integrado de Gestión","Gestión de Recursos Físicos","Administrar y controlar los bienes muebles y servicios para el funcionamiento administrativo de la entidad","Oportunidad en la atención de requerimientos y necesidades de servicios administrativos",null,null,"Porcentaje de requerimientos de mantenimiento correctivo atendidos en la sede administrativa dentro de los tiempos establecidos","(No. de requerimientos de mantenimiento correctivo atendidos dentro de los tiempos establecidos/Total de requerimientos de mantenimiento correctivo reportados en la sede administrativa)*100","Gestión","Calidad","Trimestral",0.95,"Porcentaje","Aplicativo mesa de ayuda OTRS","Positiva","No",null,2019,"Junio",83,83,1,1.0526315789473684,"Aceptable"]
["Mejorar continuamente los procesos del Sistema Integrado de Gestión","Adquisición de Bienes y Servicios","Realizar actividades contractuales para adquirir bienes y servicios con la oportunidad y de acuerdo con las especificaciones establecidas por la entidad","Cumplimiento de requisitos de acuerdo con la modalidad de selección",null,null,"Porcentaje de procesos de selección publicados dentro del tiempo establecido","(No. de actos de apertura de procesos de selección publicados en un tiempo menor o igual a 30 días hábiles después de la radicación/Total de actos de apertura expedidos)*100","Gestión","Calidad","Trimestral",0.9,"Porcentaje","Plataforma ORFEO y SECOP","Positiva","No","En el análisis del indicador se presentará el resultado desagregado para licitación pública, concurso de méritos y selección abreviada.",2019,"Junio",8,9,0.88888888888888884,0.98765432098765427,"Aceptable"]
["Mejorar continuamente los procesos del Sistema Integrado de Gestión","Adquisición de Bienes y Servicios","Realizar actividades contractuales para adquirir bienes y servicios con la oportunidad y de acuerdo con las especificaciones establecidas por la entidad","Oportunidad en la suscripción y legalización del contrato",null,null,"Porcentaje de contratos legalizados dentro del tiempo establecido","(No. de contratos legalizados en un tiempo menor o igual a 10 días hábiles a partir del acto administrativo de adjudicación/Total de procesos de selección adjudicados)*100","Gestión","Calidad","Mensual",0.8,"Porcentaje","SECOP y Plataforma ORFEO ","Positiva","No","En el análisis del indicador se presentará el resultado desagregado para licitación pública, concurso de méritos y selección abreviada.",2019,"Junio",2,2,1,1.25,"Aceptable"]
["Mejorar continuamente los procesos del Sistema Integrado de Gestión","Adquisición de Bienes y Servicios","Realizar actividades contractuales para adquirir bienes y servicios con la oportunidad y de acuerdo con las especificaciones establecidas por la entidad","Definición clara y precisa de requisitos técnicos, financieros, económicos, jurídicos y de riesgos de acuerdo con el bien o servicio a adquirir",null,null,"Porcentaje de procesos de obra tramitados en análisis de costos dentro del tiempo establecido","(No. de procesos de obra (todas las Subdirecciones) tramitados en oportunidad al recibo del memorando con la solicitud estudio del sector (20 días)/Total de procesos de obra recibidos)*100","Gestión","Calidad","Trimestral",1,"Porcentaje","Matriz de tráfico ACEE","Positiva","No",null,2019,"Junio",9,9,1,1,"Aceptable"]
["Mejorar continuamente los procesos del Sistema Integrado de Gestión","Adquisición de Bienes y Servicios","Realizar actividades contractuales para adquirir bienes y servicios con la oportunidad y de acuerdo con las especificaciones establecidas por la entidad","Definición clara y precisa de requisitos técnicos, financieros, económicos, jurídicos y de riesgos de acuerdo con el bien o servicio a adquirir",null,null,"Porcentaje de procesos diferentes a obra tramitados en análisis de costos dentro del tiempo establecido","(No. de procesos diferentes a obra tramitados en oportunidad al recibo del memorando con la solicitud estudio del sector (10 días hábiles)/Total de procesos recibidos diferentes a obra)*100","Gestión","Calidad","Trimestral",0.9,"Porcentaje","Matriz de tráfico ACEE","Positiva","No","En el análisis del indicador se presentará el resultado desagregado para procesos diferentes a obra.",2019,"Junio",48,48,1,1.1111111111111112,"Aceptable"]
["Mejorar continuamente los procesos del Sistema Integrado de Gestión","Adquisición de Bienes y Servicios","Realizar actividades contractuales para adquirir bienes y servicios con la oportunidad y de acuerdo con las especificaciones establecidas por la entidad","Definición clara y precisa de requisitos técnicos, financieros, económicos, jurídicos y de riesgos de acuerdo con el bien o servicio a adquirir",null,null,"Porcentaje de procesos requeridos por precios artificialmente bajos","(No. de procesos (excepto Subastas SAS) requeridos por precios artificialmente bajos/Total de procesos evaluados)*100","Gestión","Calidad","Trimestral",0.15,"Porcentaje","Evaluación económica de los proponentes\n\nAnálisis de precios realizado por la ACEE","Negativa","No","En el análisis del indicador se presentará el resultado desagregado por tipo de proceso.",2019,"Junio",4,47,8.5106382978723402E-2,{"$f":"((L432-V432)+L432)/L432","v":1.4326241134751772},"Aceptable"]
["Mejorar continuamente los procesos del Sistema Integrado de Gestión","Control, Evaluación y Seguimiento","Evaluar los controles y la gestión de la entidad con el fin de identificar e implementar acciones de mejora, en pro de la sostenibilidad del Sistema de Control Interno","Pertinencia y oportunidad en la entrega de los resultados del seguimiento a las partes interesadas",null,null,"Porcentaje de acciones de mejoramiento interno con seguimiento efectuado","(No. de acciones de mejoramiento interno con seguimiento efectuado)/Total de acciones de mejoramiento interno abiertas de auditorías internas de control interno)*100","Gestión","Eficacia","Trimestral",1,"Porcentaje","Plataforma Isolución","Positiva","No","En el análisis del indicador se presentará el resultado desagregado por proceso.",2019,"Junio",197,206,0.9563106796116505,{"$f":"+V433/L433","v":0.9563106796116505},"Aceptable"]
["Mejorar continuamente los procesos del Sistema Integrado de Gestión","Control, Evaluación y Seguimiento","Evaluar los controles y la gestión de la entidad con el fin de identificar e implementar acciones de mejora, en pro de la sostenibilidad del Sistema de Control Interno","Pertinencia y oportunidad en la entrega de los resultados del seguimiento a las partes interesadas",null,null,"Porcentaje de acciones de mejoramiento externo con seguimiento efectuado","(No. de acciones de mejoramiento externo con seguimiento efectuado)/Total de acciones de mejoramiento externo abiertas de auditorías externas)*100","Gestión","Eficacia","Trimestral",1,"Porcentaje","Matrices de consolidación del estado de las acciones de los diferentes entes de control y vigilancia","Positiva","No","En el análisis del indicador se presentará el resultado desagregado por auditoría externa.",2019,"Junio",107,107,1,1,"Aceptable"]
["Mejorar continuamente los procesos del Sistema Integrado de Gestión","Gestión Financiera","Administrar los recursos financieros asignados y realizar los respectivos registros, para el cumplimiento de las funciones de la entidad y pago de sus obligaciones con terceros","Oportunidad en la expedición de los certificados presupuestales y en la presentación de los informes de ejecución",null,null,"Porcentaje de ejecución presupuestal en gastos de funcionamiento","(Presupuesto de funcionamiento ejecutado/Presupuesto disponible de funcionamiento)*100","Gestión","Eficiencia","Mensual",0.95,"Porcentaje","Ejecución presupuestal en SEVEN","Positiva","Si","La meta es anual con medición y análisis mensual.\nLa medición está a cargo del Área Financiera y el análisis a cargo de la Subdirección Administrativa y Financiera.\nLa medición y el análisis se deben realizar a más tardar el quinto día hábil de cada mes.\nUna vez se realice el Comité Financiero, el Área Financiera debe enviar a la Oficina Asesora de Planeación la presentación correspondiente, con el análisis respectivo en cuanto al desempeño del indicador.",2019,"Junio",16877299466,35208442000,0.47935377163238296,0.50458291750777151]
["Mejorar continuamente los procesos del Sistema Integrado de Gestión","Gestión Financiera","Administrar los recursos financieros asignados y realizar los respectivos registros, para el cumplimiento de las funciones de la entidad y pago de sus obligaciones con terceros","Oportunidad en la expedición de los certificados presupuestales y en la presentación de los informes de ejecución","Oportunidad en la autorización de giro de los recursos de transferencia",null,"Porcentaje de ejecución presupuestal en gastos de inversión","(Presupuesto de inversión ejecutado/Presupuesto disponible de inversión)*100","Gestión","Eficiencia","Mensual",1,"Porcentaje","Ejecución presupuestal en SEVEN","Positiva","Si","La meta es anual con medición y análisis mensual.\nLa medición está a cargo del Área Financiera y el análisis a cargo de los Ordenadores del Gasto.\nLa medición y el análisis se deben realizar a más tardar el quinto día hábil de cada mes.\nUna vez se realice el Comité Financiero, el Área Financiera debe enviar a la Oficina Asesora de Planeación la presentación correspondiente, con el análisis respectivo en cuanto al desempeño del indicador.",2019,"Junio",316862885220,742020022000,0.42702740603406519,0.42702740603406519]
["Mejorar continuamente los procesos del Sistema Integrado de Gestión","Gestión Financiera","Administrar los recursos financieros asignados y realizar los respectivos registros, para el cumplimiento de las funciones de la entidad y pago de sus obligaciones con terceros","Oportunidad en el pago de las obligaciones financieras de la entidad",null,null,"Porcentaje de ejecución del programa anual de caja","(Recursos ejecutados de reserva, vigencia y pasivos exigibles/Recursos programados de reserva, vigencia y pasivos exigibles)*100","Gestión","Eficiencia","Mensual",1,"Porcentaje","Sistema de información SEVEN","Positiva","Si","La meta es anual con medición y análisis mensual.\nLa medición está a cargo del Área Financiera y el análisis a cargo de los Ordenadores del Gasto.\nLa medición y el análisis se deben realizar a más tardar el quinto día hábil de cada mes.\nUna vez se realice el Comité Financiero, el Área Financiera debe enviar a la Oficina Asesora de Planeación la presentación correspondiente, con el análisis respectivo en cuanto al desempeño del indicador.",2019,"Junio",62505433,66433965,{"$f":"+T437/U437","v":0.94086560993311175},0.94086560993311175]
["Mejorar continuamente los procesos del Sistema Integrado de Gestión","Gestión Financiera","Administrar los recursos financieros asignados y realizar los respectivos registros, para el cumplimiento de las funciones de la entidad y pago de sus obligaciones con terceros","Oportunidad en el pago de las obligaciones financieras de la entidad","Oportunidad en la causación de ordenes de pago que cumplan con todos los requisitos establecidos","Oportunidad y veracidad de la información necesaria para la causación de las ordenes de pago reportada por los ordenadores del gasto","Porcentaje de cuentas individuales pagadas dentro del tiempo establecido","(No. de cuentas individuales pagadas en un tiempo menor o igual a 6 días/Total de cuentas de pago individuales tramitadas)*100 ","Gestión","Calidad","Mensual",1,"Porcentaje","Bitácora de cuentas en SEVEN","Positiva","No","La medición y el análisis están a cargo del Área Financiera.\nEn el análisis del indicador se presentará el resultado del tiempo promedio en cada una de las etapas para el pago, según la bitácora de cuentas de SEVEN.",2019,"Junio",242,242,1,1,{"$f":"_xlfn.IFS(W438<=69%,\"Crítico\",W438>=90%,\"Aceptable\",W438>=70%,\"Tolerable\")","v":"Aceptable"}]
["Mejorar continuamente los procesos del Sistema Integrado de Gestión","Gestión Financiera","Administrar los recursos financieros asignados y realizar los respectivos registros, para el cumplimiento de las funciones de la entidad y pago de sus obligaciones con terceros","Oportunidad en el pago de las obligaciones financieras de la entidad","Oportunidad en la causación de ordenes de pago que cumplan con todos los requisitos establecidos","Oportunidad y veracidad de la información necesaria para la causación de las ordenes de pago reportada por los ordenadores del gasto","Porcentaje de cuentas colectivas pagadas dentro del tiempo establecido","(No. de cuentas colectivas pagadas en un tiempo menor o igual a 10 días/Total de cuentas de pago colectivas tramitadas)*100","Gestión","Calidad","Mensual",1,"Porcentaje","Bitácora de cuentas en SEVEN","Positiva","No","La medición y el análisis están a cargo del Área Financiera.\nEn el análisis del indicador se debe presentar el resultado del tiempo promedio en cada una de las etapas para el pago, según la bitácora de cuentas de SEVEN.",2019,"Junio",57,57,1,1,{"$f":"_xlfn.IFS(W439<=69%,\"Crítico\",W439>=90%,\"Aceptable\",W439>=70%,\"Tolerable\")","v":"Aceptable"}]
["Implementar las políticas y líneas de acción para la preservación e integridad de la documentación","Gestión Documental","Administrar, conservar y custodiar la documentación generada en la entidad, desde su origen hasta su disposición final, para preservar la memoria institucional","Actualización del inventario documental en el Formato Único de Inventario Documental, con base en la aplicación de las tablas de retención documental","Cumplimiento de los tiempos de retención documental establecidos en las tablas","Actualización de los instrumentos archivísticos","Porcentaje de inventario validado del fondo documental acumulado del archivo central","(No. de metros lineales de inventario validado en cuanto a series, subseries, asuntos y oficinas productoras/Total de metros lineales de archivo inventariado en estado natural del archivo central)*100 ","Gestión","Eficacia","Mensual",1,"Porcentaje","Matriz de seguimiento a inventario documental","Positiva","Si","La meta es anual con medición y análisis mensual",2019,"Junio",1051.46,2180.5,0.48221050217839945,0.48221050217839945]
["Implementar las políticas y líneas de acción para la preservación e integridad de la documentación","Gestión Documental","Administrar, conservar y custodiar la documentación generada en la entidad, desde su origen hasta su disposición final, para preservar la memoria institucional","Oportunidad en las transferencias documentales de acuerdo con los tiempos de retención establecidos en las tablas",null,null,"Porcentaje de transferencias primarias realizadas de acuerdo con los tiempos de retención","(No. de transferencias primarias realizadas de acuerdo con los tiempos de retención establecidos en las TRD / Total de transferencias documentales programadas)*100","Gestión","Eficacia","Mensual",0.8,"Porcentaje","Matriz de seguimiento a transferencias documentales","Positiva","Si","La meta es anual con medición y análisis mensual",2019,"Junio",28,33,0.84848484848484851,1.0606060606060606]
["Implementar las políticas y líneas de acción para la preservación e integridad de la documentación","Gestión Documental","Administrar, conservar y custodiar la documentación generada en la entidad, desde su origen hasta su disposición final, para preservar la memoria institucional","Cumplimiento de los estándares de temperatura, humedad relativa y luminosidad de los espacios de almacenamiento de material documental, dentro de los rangos establecidos en la normatividad vigente",null,null,"Porcentaje de espacios controlados para la conservación documental","(No. de espacios monitoreados e intervenidos / Total de espacios monitoreados)*100","Gestión","Eficacia","Mensual",1,"Porcentaje","Informe de monitoreo de espacios controlados","Positiva","No","La medición es mes vencido",2019,"Junio",10,10,1,1,{"$f":"_xlfn.IFS(W442<=69%,\"Crítico\",W442>=90%,\"Aceptable\",W442>=70%,\"Tolerable\")","v":"Aceptable"}]
["Mejorar continuamente los procesos del Sistema Integrado de Gestión","Servicio a la Ciudadanía","Brindar información y atender los requerimientos de los grupos de valor y de interés de la entidad para responder a sus necesidades en cumplimiento de sus derechos","Oportunidad y calidad en la respuesta a los requerimientos de los grupos de valor e interés de la entidad",null,null,"Porcentaje de peticiones, quejas, reclamos y sugerencias contestadas dentro de los términos legales vigentes","(No. de peticiones, quejas, reclamos y sugerencias contestadas en el aplicativo SDQS dentro de los términos legales vigentes/Total de peticiones, quejas, reclamos y sugerencias recibidas)*100","Gestión","Calidad","Mensual",1,"Porcentaje","Sistema SDQS","Positiva","No","La medición es mes vencido",2019,"Junio",423,459,0.92156862745098034,0.92156862745098034,"Aceptable"]
["Satisfacer las necesidades de los usuarios a través de la prestación de servicios eficientes, eficaces y efectivos","Servicio a la Ciudadanía","Brindar información y atender los requerimientos de los grupos de valor y de interés de la entidad para responder a sus necesidades en cumplimiento de sus derechos","Satisfacción del ciudadano frente a la atención brindada por la entidad",null,null,"Satisfacción del ciudadano con la atención recibida en los SUPERCADE","(No. de ciudadanos satisfechos con la atención recibida en los SUPERCADE/Total de ciudadanos atendidos en los SUPERCADE)*100","Gestión","Efectividad","Mensual",0.95,"Porcentaje","Encuesta de satisfacción con la atención brindada en SUPERCADES","Positiva","No",null,2019,"Junio",2808,2808,1,1.0526315789473684,"Aceptable"]
["Mejorar continuamente los procesos del Sistema Integrado de Gestión","Servicio a la Ciudadanía","Brindar información y atender los requerimientos de los grupos de valor y de interés de la entidad para responder a sus necesidades en cumplimiento de sus derechos","Oportunidad en la actualización de la información publicada en la sección de ley de transparencia en la página web de la entidad",null,null,"Porcentaje de información actualizada en ley de transparencia","(No. de subcategorías con información actualizada en la página web/Total de subcategorías definidas en ley de transparencia)*100","Gestión","Eficacia","Trimestral",1,"Porcentaje","Página web","Positiva","No",null,2019,"Junio",53,56,0.9464285714285714,0.9464285714285714,"Aceptable"]
["Mejorar continuamente los procesos del Sistema Integrado de Gestión","Servicio a la Ciudadanía","Brindar información y atender los requerimientos de los grupos de valor y de interés de la entidad para responder a sus necesidades en cumplimiento de sus derechos","Coherencia, claridad, solución de fondo, calidez y manejo del sistema en relación con los requerimientos atendidos por la entidad",null,null,"Porcentaje de requerimientos atendidos con oportunidad y calidad","(No. de respuestas a requerimientos sin observaciones en cuanto a los criterios de oportunidad y calidad/Total de requerimientos evaluados en el aplicativo SDQS)*100","Gestión","Eficacia","Mensual",0.8,"Porcentaje","SDQS y base de datos de gestión de PQRS","Positiva","No","La medición es mes vencido",2019,"Junio",128,176,0.72727272727272729,0.90909090909090906,"Aceptable"]
["Implementar buenas prácticas ambientales para la prevención de la contaminación en el marco de una Bogotá que defiende lo público en su función administrativa y de desarrollo institucional","Gestión de Recursos Físicos","Administrar y controlar los bienes muebles y servicios para el funcionamiento administrativo de la entidad","Calificación de la implementación del Plan Institucional de Gestión Ambiental, por parte de la Secretaría Distrital de Ambiente","Oportunidad en el reporte de formularios y registros electrónicos del PIGA ante la Secretaría Distrital de Ambiente",null,"Índice de implementación del PIGA","Promedio ponderado de cumplimiento de aspectos normativos y de implementación del PIGA, según auditoría realizada por la Secretaría Distrital de Ambiente en cada vigencia","Gestión","Eficacia","Anual",0.7,"Porcentaje","Informe de auditoría anual realizada por la Secretaría Distrital de Ambiente","Positiva","No","En el análisis del indicador se presentará el resultado desagregado por cada uno de los aspectos evaluados en la visita de control y seguimiento por parte de la Secretaría Distrital de Ambiente.\nLa meta está configurada como mayor a 70%.",2019,"Junio"]
["Proteger la integridad, confidencialidad y disponibilidad de la información","Gestión de Tecnología de la Información y las Comunicaciones","Proporcionar soluciones estratégicas de tecnologías de la información y las comunicaciones, para contribuir con la eficiencia administrativa, la mejora de los trámites y servicios y la protección de los activos de información de la entidad","Impacto del plan de remediación frente a las vulnerabilidades identificadas","Aseguramiento de incidencias en la seguridad de la información que afecten la confidencialidad, integridad y disponibilidad",null,"Porcentaje de remediación de vulnerabilidades de seguridad de la información","(No. de vulnerabilidades críticas o altas remediadas/Total de vulnerabilidades de seguridad de la información detectadas como críticas o altas)*100 ","Gestión","Eficacia","Anual",0.7,"Porcentaje","Matriz de vulnerabilidades","Positiva","No","La meta está configurada como mínimo 70%.",2019,"Junio"]
["Proteger la integridad, confidencialidad y disponibilidad de la información","Gestión de Tecnología de la Información y las Comunicaciones","Proporcionar soluciones estratégicas de tecnologías de la información y las comunicaciones, para contribuir con la eficiencia administrativa, la mejora de los trámites y servicios y la protección de los activos de información de la entidad","Avances en la implementación de gobierno digital de acuerdo con los componentes evaluados por MINTIC",null,null,"Índice de implementación de gobierno digital","Sumatoria de la calificación obtenida por cada componente/Total de componentes de la política de gobierno digital","Gestión","Eficacia","Anual",0.65,"Porcentaje","Instrumento de medición suministrado para el seguimiento a la política de gobierno digital  ","Positiva","No","En el análisis del indicador se presentará el resultado desagregado de las calificaciones obtenidas en cada componente de la política de seguridad digital.",2019,"Junio"]
["Mejorar continuamente los procesos del Sistema Integrado de Gestión","Gestión de Tecnología de la Información y las Comunicaciones","Proporcionar soluciones estratégicas de tecnologías de la información y las comunicaciones, para contribuir con la eficiencia administrativa, la mejora de los trámites y servicios y la protección de los activos de información de la entidad","Cumplimiento del Plan Estratégico de Tecnologías de la Información PETI",null,null,"Porcentaje de avance en proyectos de TI","(No. de hitos en proyectos de TI alcanzados/Total de hitos en proyectos de TI programados en la vigencia)*100","Gestión","Eficacia","Semestral",1,"Porcentaje","Cronograma de proyectos del PETI","Positiva","Si","La meta es anual con medición y análisis semestral.",2019,"Junio",11,11,1,1]
["Proteger la integridad, confidencialidad y disponibilidad de la información","Gestión de Tecnología de la Información y las Comunicaciones","Proporcionar soluciones estratégicas de tecnologías de la información y las comunicaciones, para contribuir con la eficiencia administrativa, la mejora de los trámites y servicios y la protección de los activos de información de la entidad","Disponibilidad de los sistemas de información de la entidad",null,null,"Porcentaje de disponibilidad de los sistemas de información","(No. de horas disponibles de los sistemas de información/Total de horas en servicio de los sistemas de información)*100","Gestión","Eficiencia","Mensual",0.9,"Porcentaje","Herramienta de monitoreo ZABBIX","Positiva","No","En el análisis del indidicador se presentará el resultado desagregado de disponibilidad en ORFEO, SEVEN, KACTUS y SIM.\nLa meta está configurada como mayor o igual a 90%.",2019,"Junio",719.82,720,0.99975000000000003,1.1108333333333333,{"$f":"_xlfn.IFS(W451<=69%,\"Crítico\",W451>=90%,\"Aceptable\",W451>=70%,\"Tolerable\")","v":"Aceptable"}]
["Mejorar continuamente los procesos del Sistema Integrado de Gestión","Gestión de Tecnología de la Información y las Comunicaciones","Proporcionar soluciones estratégicas de tecnologías de la información y las comunicaciones, para contribuir con la eficiencia administrativa, la mejora de los trámites y servicios y la protección de los activos de información de la entidad","Disponibilidad de los servicios de comunicaciones en la entidad, según los acuerdos de niveles de servicios establecidos",null,null,"Porcentaje de disponibilidad de los servicios de comunicaciones","(No. de horas disponibles de los servicios de comunicaciones /Total de horas de los servicios de comunicaciones)*100","Gestión","Eficiencia","Mensual",0.9,"Porcentaje","Herramienta de monitoreo ZABBIX","Positiva","No","En el análisis del indidicador se presentará el resultado desagregado de disponibilidad en Internet y Telefonía IP.\nLa meta está configurada como mayor o igual a 90%.",2019,"Junio",720,744,0.967741935483871,1.075268817204301,"Aceptable"]
["Mejorar continuamente los procesos del Sistema Integrado de Gestión","Gestión de Tecnología de la Información y las Comunicaciones","Proporcionar soluciones estratégicas de tecnologías de la información y las comunicaciones, para contribuir con la eficiencia administrativa, la mejora de los trámites y servicios y la protección de los activos de información de la entidad","Incidencias reportadas en el funcionamiento del módulo o sistema de información implementado","Cumplimiento de los acuerdos de niveles de servicios establecidos",null,"Porcentaje de solicitudes de servicio tecnológico atendidas dentro de los tiempos establecidos","(No. de solicitudes atendidas dentro de los tiempos establecidos en los acuerdos de nivel de servicio/Total de solicitudes de servicio tecnológico recibidas)*100","Gestión","Calidad","Mensual",0.9,"Porcentaje","Herramienta GLPI","Positiva","No",null,2019,"Junio",870,879,0.98976109215017061,1.0997345468335229,"Aceptable"]
["Mejorar continuamente los procesos del Sistema Integrado de Gestión","Gestión de Talento Humano","Gestionar el potencial del talento humano como factor estratégico, para contribuir con el desarrollo de la entidad en un ambiente seguro y saludable","Cumplimiento de compromisos y competencias del servidor público en el desempeño laboral","Oportunidad en el seguimiento y la evaluación anual u ordinaria del servidor público para continuar su permanencia en el servicio",null,"Índice de desempeño laboral de funcionarios","(Sumatoria de calificaciones finales de la evaluación de desempeño de los funcionarios/Total de funcionarios evaluados)*100","Gestión","Eficacia","Anual",0.9,"Porcentaje","Consolidado de las calificaciones finales de la evaluación de desempeño","Positiva","No","En el análisis del indicador se presentará el resultado desagregado por niveles jerárquicos y comparar con la evaluación de las áreas.\nLa meta está configurada como mayor a 90%.\nNota: Se mide para vigencia 2018-2019.",2019,"Junio"]
["Mejorar continuamente los procesos del Sistema Integrado de Gestión","Gestión de Talento Humano","Gestionar el potencial del talento humano como factor estratégico, para contribuir con el desarrollo de la entidad en un ambiente seguro y saludable","Cobertura de servidores públicos en las actividades del plan de bienestar e incentivos",null,null,"Porcentaje de funcionarios que participan en las actividades del plan de bienestar e incentivos","(No. de funcionarios participantes en las actividades del plan de bienestar e incentivos/Total de funcionarios de la entidad)*100 ","Gestión","Eficacia","Semestral",0.8,"Porcentaje","Registros de asistencia a las actividades del plan de bienestar","Positiva","No",null,2019,"Junio",145,248,0.58467741935483875,0.73084677419354838,"Tolerable"]
["Mejorar continuamente los procesos del Sistema Integrado de Gestión","Gestión de Talento Humano","Gestionar el potencial del talento humano como factor estratégico, para contribuir con el desarrollo de la entidad en un ambiente seguro y saludable","Cobertura de servidores públicos en las actividades del plan institucional de capacitación",null,null,"Porcentaje de funcionarios que asisten a las actividades del plan institucional de capacitación","(No. de funcionarios asistentes a las actividades del plan institucional de capacitación/Total de funcionarios citados a las actividades del plan institucional de capacitación)*100","Gestión","Eficacia","Semestral",0.8,"Porcentaje","Registros de asistencia a las actividades del plan de capacitación","Positiva","No","Las capacitaciones que se incluyen en el indicador son las que implican recursos.",2019,"Junio",209,249,0.8393574297188755,1.0491967871485943,"Aceptable","El reporte inicial de fecha 17 de julio de 2019 arrojó el siguiente resultado (747 / 1706)= 43,79 %, lo cual ubica este resultado en estado \"critico\", sin que se genere acción correctiva por parte del proceso. \nLa OAP en el seguimiento realizado al análisis de datos del indicador detectó inconsistencia en el dato reportado. El área solicitó modificación del reporte según memorando 20193100526153 del 12 de agosto de 2019"]
["Mejorar continuamente los procesos del Sistema Integrado de Gestión","Gestión de Talento Humano","Gestionar el potencial del talento humano como factor estratégico, para contribuir con el desarrollo de la entidad en un ambiente seguro y saludable","Evaluación del impacto de la capacitación en el desempeño de los servidores públicos y de la entidad",null,null,"Impacto de la capacitación en el desempeño laboral de funcionarios","(No. de funcionarios con capacitaciones efectivas/Total de funcionarios evaluados)*100","Gestión","Eficacia","Trimestral",0.95,"Porcentaje","Consolidado de las evaluaciones de impacto de la capacitación","Positiva","No",null,2019,"Junio",77,99,0.77777777777777779,0.81871345029239773,"Tolerable"]
["Mejorar continuamente los procesos del Sistema Integrado de Gestión","Gestión de Talento Humano","Gestionar el potencial del talento humano como factor estratégico, para contribuir con el desarrollo de la entidad en un ambiente seguro y saludable","Satisfacción de los servidores públicos frente a las actividades de  bienestar e incentivos","Satisfacción de los servidores públicos frente a las actividades de capacitación",null,"Índice de clima organizacional","Promedio ponderado de las dimensiones evaluadas en la encuesta de medición de clima organizacional","Gestión","Eficacia","Anual",0.8,"Porcentaje","Informe de medición de clima organizacional","Positiva","No","En el análisis del indicador se presentará el resultado desagregado por áreas y/o dependencias, y por las dimensiones evaluadas.",2019,"Junio"]
["Mejorar continuamente los procesos del Sistema Integrado de Gestión","Gestión de Talento Humano","Gestionar el potencial del talento humano como factor estratégico, para contribuir con el desarrollo de la entidad en un ambiente seguro y saludable","Cumplimiento del plan anual de  bienestar e incentivos",null,null,"Porcentaje de ejecución del plan anual de bienestar e incentivos","(No. de actividades de bienestar e incentivos desarrolladas/Total de actividades programadas en el plan anual de bienestar e incentivos)*100","Gestión","Eficacia","Semestral",1,"Porcentaje","Matriz de seguimiento a la ejecución de actividades de bienestar e incentivos","Positiva","Si","La meta es anual con medición y análisis semestral.",2019,"Junio",10,23,0.43478260869565216,0.43478260869565216]
["Mejorar continuamente los procesos del Sistema Integrado de Gestión","Gestión de Talento Humano","Gestionar el potencial del talento humano como factor estratégico, para contribuir con el desarrollo de la entidad en un ambiente seguro y saludable","Cumplimiento del plan institucional de capacitación",null,null,"Porcentaje de ejecución del plan institucional de capacitación","(No. de actividades de capacitación desarrolladas/Total de actividades programadas en el plan institucional de capacitación)*100","Gestión","Eficacia","Semestral",1,"Porcentaje","Matriz de seguimiento a la ejecución de actividades de capacitación","Positiva","Si","La meta es anual con medición y análisis semestral.",2019,"Junio",20,29,0.68965517241379315,0.68965517241379315]
["Prevenir los factores que afecten la salud y seguridad a fin de mejorar las condiciones del ambiente de trabajo","Gestión de Talento Humano","Gestionar el potencial del talento humano como factor estratégico, para contribuir con el desarrollo de la entidad en un ambiente seguro y saludable","Cumplimiento del plan anual de trabajo",null,null,"Porcentaje de ejecución del plan anual de seguridad y salud en el trabajo","(No. de actividades de seguridad y salud desarrolladas/Total de actividades programadas en el plan anual de seguridad y salud en el trabajo)*100","Gestión","Eficacia","Mensual",0.95,"Porcentaje","Plan de trabajo anual del Sistema de Gestión de Seguridad y Salud en el Trabajo","Positiva","No",null,2019,"Junio",177,195,0.90769230769230769,0.95546558704453444,{"$f":"_xlfn.IFS(W461<=69%,\"Crítico\",W461>=90%,\"Aceptable\",W461>=70%,\"Tolerable\")","v":"Aceptable"}]
["Prevenir los factores que afecten la salud y seguridad a fin de mejorar las condiciones del ambiente de trabajo","Gestión de Talento Humano","Gestionar el potencial del talento humano como factor estratégico, para contribuir con el desarrollo de la entidad en un ambiente seguro y saludable","Tasa de accidentalidad",null,null,"Tasa de accidentalidad","(No. de accidentes de trabajo reportados/Total de trabajadores (funcionarios y contratistas)*100","Gestión","Efectividad","Mensual",0.04,"Porcentaje","Matriz de accidentes de trabajo","Negativa","No","La meta está configurada como menor o igual a 4%.",2019,"Junio",53,3199,1.6567677399187245E-2,{"$f":"((L462-V462)+L462)/L462","v":1.585808065020319},"Aceptable"]
["Prevenir los factores que afecten la salud y seguridad a fin de mejorar las condiciones del ambiente de trabajo","Gestión de Talento Humano","Gestionar el potencial del talento humano como factor estratégico, para contribuir con el desarrollo de la entidad en un ambiente seguro y saludable","Incidencia y prevalencia de enfermedades laborales",null,null," Prevalencia de la enfermedad laboral","(No. de casos de enfermedad laboral calificada/Total de funcionarios)*100","Gestión","Efectividad","Trimestral",0.02,"Porcentaje","Matriz de seguimiento de enfermedades laborales","Negativa","No","La meta está configurada como menor o igual a 2%.",2019,"Junio",4,248,1.6129032258064516E-2,{"$f":"((L463-V463)+L463)/L463","v":1.1935483870967742},"Aceptable"]
["Prevenir los factores que afecten la salud y seguridad a fin de mejorar las condiciones del ambiente de trabajo","Gestión de Talento Humano","Gestionar el potencial del talento humano como factor estratégico, para contribuir con el desarrollo de la entidad en un ambiente seguro y saludable","Incidencia y prevalencia de enfermedades laborales",null,null,"Incidencia de la enfermedad laboral","(No. de casos nuevos de enfermedad laboral calificados/Total de funcionarios)*100","Gestión","Efectividad","Trimestral",0.01,"Porcentaje","Matriz de seguimiento de enfermedades laborales","Negativa","No","La meta está configurada como menor o igual a 1%.",2019,"Junio",0,248,0,{"$f":"((L464-V464)+L464)/L464","v":2},"Aceptable"]
["Mejorar continuamente los procesos del Sistema Integrado de Gestión","Gestión de Recursos Físicos","Administrar y controlar los bienes muebles y servicios para el funcionamiento administrativo de la entidad","Confiabilidad del inventario de bienes devolutivos",null,null,"Porcentaje de inventario individual validado físicamente","(No. de elementos devolutivos del inventario individual validados físicamente/Total de elementos devolutivos del inventario individual registrados en el sistema de información SEVEN)*100 ","Gestión","Eficacia","Anual",1,"Porcentaje","Sistema de información SEVEN","Positiva","No",null,2019,"Junio"]
["Mejorar continuamente los procesos del Sistema Integrado de Gestión","Gestión de Recursos Físicos","Administrar y controlar los bienes muebles y servicios para el funcionamiento administrativo de la entidad","Confiabilidad del inventario de bienes devolutivos",null,null,"Porcentaje de inventario aleatorio validado físicamente en bodega","(No. de elementos devolutivos y de consumo en bodegas validados físicamente/Muestra de inventario de elementos devolutivos y de consumo registrados en el sistema de información SEVEN)*100 ","Gestión","Eficacia","Trimestral",1,"Porcentaje","Sistema de información SEVEN","Positiva","No",null,2019,"Junio"]
["Mejorar continuamente los procesos del Sistema Integrado de Gestión","Gestión de Asuntos Locales","Desarrollar acciones a nivel local para promover la participación ciudadana, brindar acompañamiento a las alcaldías locales en temas misionales de la entidad y ofertar sus programas","Cumplimiento de los compromisos adquiridos por la entidad, en el marco de las instancias de participación locales",null,null,"Porcentaje de compromisos atendidos en el marco de las instancias de participación locales","(No. de compromisos atendidos en las instancias Consejo Local de Gobierno, Unidad de Apoyo Técnico y Comisión Local Intersectorial de Participación /Total de compromisos generados en las instancias Consejo Local de Gobierno, Unidad de Apoyo Técnico y Comisión Local Intersectorial de Participación)*100","Gestión","Eficacia","Trimestral",1,"Porcentaje","Matriz de seguimiento a compromisos derivados de instancias de participación locales","Positiva","No",null,2019,"Junio",17,17,1,{"$f":"+V467/L467","v":1},"Aceptable"]
["Mejorar continuamente los procesos del Sistema Integrado de Gestión","Gestión de Asuntos Locales","Desarrollar acciones a nivel local para promover la participación ciudadana, brindar acompañamiento a las alcaldías locales en temas misionales de la entidad y ofertar sus programas","Efectividad en la atención de la demanda de actividades recreodeportivas en las localidades de Bogotá",null,null,"Porcentaje de actividades recreativas programadas por asuntos locales","(No. de actividades recreativas programadas en la plataforma SIM por los gestores locales/Total de actividades recreativas solicitadas por Promoción de la Recreación)*100","Gestión","Eficacia","Mensual",1,"Porcentaje","Sistema de información misional - SIM\nCuadro de metas de actividades recreativas","Positiva","No",null,2019,"Junio",2167,2573,0.84220753983676644,0.84220753983676644,"Tolerable"]
["Mejorar continuamente los procesos del Sistema Integrado de Gestión","Gestión de Asuntos Locales","Desarrollar acciones a nivel local para promover la participación ciudadana, brindar acompañamiento a las alcaldías locales en temas misionales de la entidad y ofertar sus programas","Efectividad en la atención de la demanda de actividades recreodeportivas en las localidades de Bogotá",null,null,"Porcentaje de beneficiarios inscritos por asuntos locales en actividades deportivas","(No. de beneficiarios inscritos en actividades deportivas por los gestores locales/Total de beneficiarios de actividades deportivas programados por Fomento al Deporte)*100","Gestión","Eficacia","Trimestral",1,"Porcentaje","Reporte de las distintas plataformas para inscripciones\nCuadro de metas de actividades deportivas","Positiva","No",null,2019,"Junio",25864,30133,{"$f":"+T469/U469","v":0.85832807885042972},0.85832807885042972,"Tolerable","Los eventos deportivos correspondientes a esta medición son Supérate Intercolegiados e Interbarrios. Se evidencia que en Interbarrios se ha cumplido con el 41% de la meta y en Supérate Intercolegiados el 65%. Se debe tener en cuenta que en los primeros días de junio iniciaron las inscripciones de Interbarrios, entonces aún falta un (1) mes para cumplir la meta. Por otro lado, en Supérate Intercolegiados también se encuentran abiertas las inscripciones y han habido problemas con la plataforma, razón por la cual se evidencian menos inscripciones de las que realmente hay."]
["Mejorar continuamente los procesos del Sistema Integrado de Gestión","Gestión de Asuntos Locales","Desarrollar acciones a nivel local para promover la participación ciudadana, brindar acompañamiento a las alcaldías locales en temas misionales de la entidad y ofertar sus programas","Cumplimiento de lineamientos y criterios de elegibilidad y viabilidad de los proyectos de contratación",null,null,"Porcentaje de asistencias técnicas realizadas a los Fondos de Desarrollo Local","(No. de asistencias técnicas realizadas a los Fondos de Desarrollo Local/Total de asistencias técnicas programadas a los Fondos de Desarrollo Local en las cuatro líneas de inversión)*100","Gestión","Eficacia","Trimestral",1,"Porcentaje","Cronograma de asistencias técnicas a los Fondos de Desarrollo Local","Positiva","No",null,2019,"Junio",19,19,1,1,"Aceptable"]
["Mejorar continuamente los procesos del Sistema Integrado de Gestión","Gestión de Asuntos Locales","Desarrollar acciones a nivel local para promover la participación ciudadana, brindar acompañamiento a las alcaldías locales en temas misionales de la entidad y ofertar sus programas","Ejecución de los proyectos con recursos de los fondos de desarrollo local, en concordancia con el concepto previo y favorable emitido por la entidad",null,null,"Porcentaje de proyectos viabilizados con seguimiento efectuado","(No. de proyectos contratados con seguimiento efectuado/Total de proyectos viabilizados con contratación por parte de los Fondos de Desarrollo Local)*100","Gestión","Eficacia","Trimestral",1,"Porcentaje","SECOP\nInforme de seguimiento a viabilidades","Positiva","No",null,2019,"Junio",20,20,1,1,"Aceptable"]
["Mejorar continuamente los procesos del Sistema Integrado de Gestión","Control Disciplinario","Investigar conductas presuntamente disciplinables e imponer sanciones cuando haya lugar, tanto a servidores como a ex-servidores públicos de la entidad, con el fin de que éstos cumplan con sus deberes y funciones","Cumplimiento de los términos legales en las distintas etapas procesales",null,null,"Porcentaje de procesos disciplinarios resueltos de fondo","(No. de procesos disciplinarios decididos de fondo/Total de procesos disciplinarios activos)*100","Gestión","Eficacia","Semestral",0.6,"Porcentaje","Matriz de autos","Positiva","No",null,2019,"Junio",56,95,0.58947368421052626,0.98245614035087714,"Aceptable"]
["Mejorar continuamente los procesos del Sistema Integrado de Gestión","Control Disciplinario","Investigar conductas presuntamente disciplinables e imponer sanciones cuando haya lugar, tanto a servidores como a ex-servidores públicos de la entidad, con el fin de que éstos cumplan con sus deberes y funciones","Garantía del debido proceso en las distintas etapas procesales",null,null,"Porcentaje de procesos disciplinarios sin nulidades decretadas","(No. de procesos disciplinarios sin nulidades decretadas/Total de procesos disciplinarios activos)*100 ","Gestión","Eficacia","Trimestral",1,"Porcentaje","Matriz de autos","Positiva","No",null,2019,"Junio",95,95,1,1,"Aceptable"]
["Mejorar continuamente los procesos del Sistema Integrado de Gestión","Control Disciplinario","Investigar conductas presuntamente disciplinables e imponer sanciones cuando haya lugar, tanto a servidores como a ex-servidores públicos de la entidad, con el fin de que éstos cumplan con sus deberes y funciones","Cumplimiento de los términos legales en las distintas etapas procesales",null,null,"Porcentaje de procesos disciplinarios sin vencimiento de términos","(No. de procesos disciplinarios sin vencimiento de términos/Total de procesos disciplinarios activos)*100","Gestión","Calidad","Trimestral",1,"Porcentaje","Expediente del proceso disciplinario ","Positiva","No",null,2019,"Junio",93,95,0.97894736842105268,0.97894736842105268,"Aceptable"]
["Mejorar continuamente los procesos del Sistema Integrado de Gestión","Administración y Mantenimiento de Parques y Escenarios","Ofrecer parques y escenarios del Sistema Distrital para el uso y disfrute de la comunidad general, gestionando la sostenibilidad física, social, ambiental y económica","Uso de parques y escenarios con motivación económica que generen recursos para el mantenimiento de los mismos",null,null,"Aprovechamiento económico de parques y/o escenarios","(Ingresos del mes + acumulado de los ingresos del mes anterior/Total presupuesto anual)*100","Gestión","Eficiencia","Mensual",1,"Porcentaje","Sistema de información SEVEN","Positiva","Si","La meta es anual con medición y análisis mensual.\n\nEn el análisis del indicador se presentará la desagregación del aprovechamiento económico por tipo de parque y/o escenario, expresado en ingresos y participación porcentual.",2019,"Junio",12071192,22044017,0.54759493244811053,0.54759493244811053]
["Satisfacer las necesidades de los usuarios a través de la prestación de servicios eficientes, eficaces y efectivos","Administración y Mantenimiento de Parques y Escenarios","Ofrecer parques y escenarios del Sistema Distrital para el uso y disfrute de la comunidad general, gestionando la sostenibilidad física, social, ambiental y económica","Satisfacción de los usuarios con las actividades de mantenimiento preventivo y correctivo",null,null,"Satisfacción de los usuarios con las obras de mantenimiento de nuevas tendencias","(No. de usuarios satisfechos con las obras de mantenimiento realizadas/Total de usuarios de parques y escenarios encuestados para obras de mantenimiento de nuevas tendencias)*100","Gestión","Efectividad","Anual",0.9,"Porcentaje","Encuesta de satisfacción con las obras de mantenimiento de nuevas tendencias","Positiva","No","En el análisis del indicador se presentará el resultado desagregado por cada uno de los aspectos evaluados en la encuesta de satisfacción.",2019,"Junio"]
["Mejorar continuamente los procesos del Sistema Integrado de Gestión","Administración y Mantenimiento de Parques y Escenarios","Ofrecer parques y escenarios del Sistema Distrital para el uso y disfrute de la comunidad general, gestionando la sostenibilidad física, social, ambiental y económica","Oportunidad y cumplimiento en la generación de compromisos o acuerdos ciudadanos frente al uso y sostenibilidad de los parques administrados",null,null,"Porcentaje de cumplimiento en acuerdos de sostenibilidad social de parques","(No. de compromisos gestionados/Total de compromisos adquiridos mediante acuerdos ciudadanos en parques)*100","Gestión","Eficacia","Trimestral",1,"Porcentaje","Matriz de seguimiento a compromisos o acuerdos ciudadanos","Positiva","No",null,2019,"Junio",53,53,1,1,{"$f":"_xlfn.IFS(W477<=69%,\"Crítico\",W477>=90%,\"Aceptable\",W477>=70%,\"Tolerable\")","v":"Aceptable"}]
["Mejorar continuamente los procesos del Sistema Integrado de Gestión","Administración y Mantenimiento de Parques y Escenarios","Ofrecer parques y escenarios del Sistema Distrital para el uso y disfrute de la comunidad general, gestionando la sostenibilidad física, social, ambiental y económica","Disponibilidad de los equipamientos en parques y escenarios","Cumplimiento de las especificaciones técnicas en las actividades de mantenimiento preventivo y correctivo","Cobertura en el mantenimiento de parques y escenarios de acuerdo con la priorización","Porcentaje de avance en la ejecución de contratos de obras de mantenimiento o recuperación","(Porcentaje contrato 1 + Porcentaje contrato 2 +...+ Porcentaje contrato n)/Total de contratos de obras de mantenimiento o recuperación en ejecución\nDonde: \nPorcentaje contrato n = Avance físico ejecutado/Avance físico programado\nn = Número de contratos de obras de mantenimiento o recuperación en ejecución","Gestión","Eficacia","Bimestral",0.9,"Porcentaje","Informes mensuales de interventoría presentados según programación de los contratistas","Positiva","No",null,2019,"Junio",5.41,6,0.90166666666666673,1.001851851851852,"Aceptable"]
["Satisfacer las necesidades de los usuarios a través de la prestación de servicios eficientes, eficaces y efectivos","Diseño y Construcción de Parques y Escenarios","Ampliar y mejorar la infraestructura física recreativa y deportiva del Distrito Capital para el uso de la comunidad en general","Cumplimiento de requisitos técnicos, administrativos, financieros y jurídicos de los proyectos",null,null,"Satisfacción de los usuarios con las obras de construcción y/o adecuación entregadas","(No. de usuarios satisfechos con las obras de construcción y/o adecuación entregadas /Total de usuarios encuestados por proyecto)*100","Gestión","Efectividad","Anual",0.9,"Porcentaje","Resultados de la encuesta de satisfacción entregados por los contratistas de obra","Positiva","No","En el análisis del indicador se presentará el resultado desagregado por cada uno de los aspectos evaluados en la encuesta de satisfacción.",2019,"Junio"]
["Mejorar continuamente los procesos del Sistema Integrado de Gestión","Diseño y Construcción de Parques y Escenarios","Ampliar y mejorar la infraestructura física recreativa y deportiva del Distrito Capital para el uso de la comunidad en general","Oportunidad en el seguimiento y adopción de medidas durante el seguimiento de la estabilidad de la obra","Cumplimiento de especificaciones técnicas conforme a lo establecido en la etapa de construcción",null,"Porcentaje de fallas de calidad o estabilidad de obra atendidas en construcción y adecuación de parques y escenarios","(No. de fallas de calidad o estabilidad de obra atendidas/Total de fallas de calidad o estabilidad de obra detectadas o reportadas por terceros)*100\n\nAtendido = Se genera requerimiento al contratista para establecer compromisos de reparación.","Gestión","Eficacia","Trimestral",0.9,"Porcentaje","Actas de visita o reconocimiento de estabilidad de obra \nActa de compromiso de reparación constructiva\nProgramación de visita\nComunicación oficial- notificación de fallas visita de inspección por estabilidad \nActa de verificación de reparación constructiva","Positiva","No","En el análisis del indicador se presentará la desagregación por parque y escenario.",2019,"Junio",33,36,0.91666666666666663,1.0185185185185184,"Aceptable"]
["Mejorar continuamente los procesos del Sistema Integrado de Gestión","Diseño y Construcción de Parques y Escenarios","Ampliar y mejorar la infraestructura física recreativa y deportiva del Distrito Capital para el uso de la comunidad en general","Cumplimiento de requisitos técnicos, administrativos, financieros y jurídicos de los proyectos","Oportunidad en el seguimiento y adopción de medidas durante la ejecución de las obras","Cumplimiento del alcance de las obras conforme a los estudios y diseños, especificaciones técnicas y normatividad vigente","Porcentaje de avance en la ejecución de obras de construcción y adecuación de parques y escenarios","((%Ejecutado Obra 1*Plazo de ejecución Obra 1)+(%Ejecutado Obra 2*Plazo de ejecución Obra 2) +...+ (%Ejecutado Obra n*Plazo de ejecución Obra n))/((%Programado Obra 1*Plazo de ejecución Obra 1)+(%Programado Obra 2*Plazo de ejecución Obra 2) +...+ (%Programado Obra n*Plazo de ejecución Obra n))\nDonde:\nn = Número de obras en ejecución","Gestión","Eficacia","Mensual",0.9,"Porcentaje","Informes mensuales de interventoría\n\nInformes mensuales de supervisión","Positiva","No","En el análisis del indicador se presentará la desagregación por parque y escenario.",2019,"Junio",45.75,49.32,{"$f":"+T481/U481","v":0.92761557177615572},1.030683968640173,"Aceptable"]
["Mejorar continuamente los procesos del Sistema Integrado de Gestión","Diseño y Construcción de Parques y Escenarios","Ampliar y mejorar la infraestructura física recreativa y deportiva del Distrito Capital para el uso de la comunidad en general","\nCumplimiento de requisitos técnicos, administrativos, financieros y legales de los proyectos de estudios y diseños","Oportunidad en el seguimiento y adopción de medidas durante la ejecución de los proyectos de estudios y diseños","Cumplimiento del alcance de los proyectos de estudios y diseños conforme a las necesidades identificadas","Porcentaje de avance en la ejecución de proyectos de estudios y/o diseños de parques y escenarios","(Porcentaje proyecto 1 + Porcentaje proyecto 2 +...+ Porcentaje proyecto n)/Total de proyectos de estudios y/o diseños en ejecución\nDonde: \nPorcentaje proyecto n =(Avance ejecutado de estudios y/o diseños/Avance programado de estudios y/o diseños al corte según forma de pago)\nn = Número de proyectos de estudios y/o diseños en ejecución","Gestión","Eficacia","Mensual",0.9,"Porcentaje","Informes mensuales de interventoría\n\nInformes mensuales de supervisión","Positiva","No","En el análisis del indicador se presentará la desagregación por proyecto.",2019,"Junio",92,98,0.93877551020408168,1.0430839002267573,"Aceptable"]
["Mejorar continuamente los procesos del Sistema Integrado de Gestión","Gestión Jurídica","Ejercer la defensa judicial y extrajudicial de la entidad y atender requerimientos jurídicos, para salvaguardar sus intereses y cumplir con los requisitos constitucionales y legales","Intervención oportuna en las distintas actuaciones judiciales y extrajudiciales en que sea parte la entidad","Oportunidad en el seguimiento a los procesos en los despachos e instancias judiciales",null,"Porcentaje de procesos judiciales y extrajudiciales atendidos dentro de los términos legales vigentes","(No. de procesos jurídicos atendidos dentro de los términos legales vigentes)/Total de procesos jurídicos notificados)*100","Gestión","Calidad","Trimestral",1,"Porcentaje","SIPROJ Web\nORFEO","Positiva","No","En el análisis del indicador se presentará la desagregación por procesos judiciales y extrajudiciales.",2019,"Junio",21,21,1,1,"Aceptable"]
["Satisfacer las necesidades de los usuarios a través de la prestación de servicios eficientes, eficaces y efectivos","Gestión Jurídica","Ejercer la defensa judicial y extrajudicial de la entidad y atender requerimientos jurídicos, para salvaguardar sus intereses y cumplir con los requisitos constitucionales y legales","Cumplimiento de los requisitos establecidos para el reconocimiento deportivo y el aval de escuelas deportivas",null,null,"Satisfacción de los usuarios con el trámite de reconocimiento deportivo","(No. de usuarios satisfechos con el trámite de reconocimiento deportivo/Total de usuarios encuestados)*100","Gestión","Efectividad","Semestral",0.95,"Porcentaje","Encuesta de satisfacción de usuarios de reconocimiento deportivo","Positiva","No","En el análisis del indicador se presentarán los resultados desagregados por cada uno de los aspectos evaluados en la encuesta de satisfacción.",2019,"Junio",86,90,0.9555555555555556,1.0058479532163744,"Aceptable"]
["Mejorar continuamente los procesos del Sistema Integrado de Gestión","Gestión Jurídica","Ejercer la defensa judicial y extrajudicial de la entidad y atender requerimientos jurídicos, para salvaguardar sus intereses y cumplir con los requisitos constitucionales y legales","Oportunidad en la respuesta del trámite de otorgamiento deportivo (45 días hábiles siguientes al cumplimiento de requisitos de otorgamiento deportivo)","Vigencia y aplicabilidad de la normatividad empleada para el reconocimiento deportivo y el aval de escuelas deportivas",null,"Porcentaje de trámites de reconocimiento deportivo atendidos dentro del término legal vigente","(No. de trámites de reconocimiento deportivo atendidos dentro del término legal vigente/Total de trámites de reconocimiento deportivo atendidos)*100 ","Gestión","Calidad","Trimestral",0.92,"Porcentaje","Matriz de control de reconocimiento deportivo","Positiva","No",null,2019,"Junio",326,340,0.95882352941176474,1.0421994884910486,"Aceptable"]
["Mejorar continuamente los procesos del Sistema Integrado de Gestión","Gestión Jurídica","Ejercer la defensa judicial y extrajudicial de la entidad y atender requerimientos jurídicos, para salvaguardar sus intereses y cumplir con los requisitos constitucionales y legales","Oportunidad en la respuesta del trámite de aval de escuelas deportivas (58 días hábiles)","Vigencia y aplicabilidad de la normatividad empleada para el reconocimiento deportivo y el aval de escuelas deportivas",null,"Porcentaje de trámites de aval de escuelas deportivas atendidos dentro del término legal vigente","(No. de trámites de aval de escuelas deportivas atendidos dentro del término legal vigente/Total de trámites de aval de escuelas deportivas atendidos)*100","Gestión","Calidad","Trimestral",0.92,"Porcentaje","Matriz de control de aval de escuelas deportivas","Positiva","No",null,2019,"Junio",14,14,1,1.0869565217391304,"Aceptable"]
["Mejorar continuamente los procesos del Sistema Integrado de Gestión","Gestión Jurídica","Ejercer la defensa judicial y extrajudicial de la entidad y atender requerimientos jurídicos, para salvaguardar sus intereses y cumplir con los requisitos constitucionales y legales","Oportunidad en la respuesta a conceptos de proyectos de acuerdo con los tiempos establecidos","Suministro oportuno de la información de carácter técnico, de oportunidad y conveniencia del proyecto por parte de las dependencias y áreas de la entidad",null,"Porcentaje de solicitudes de concepto a proyectos de acuerdo, decreto o ley atendidas dentro del tiempo establecido","(No. de solicitudes de concepto a proyectos de acuerdo, decreto o ley atendidas dentro del tiempo establecido/Total de solicitudes de concepto a proyectos de acuerdo, decreto o ley recibidas)*100","Gestión","Calidad","Semestral",0.9,"Porcentaje","Matriz de seguimiento a solicitudes Congreso y Concejo","Positiva","No","En el análisis del indicador se presentará la desagregación por proyectos de acuerdo, decreto y ley.",2019,"Junio",5,5,1,1.1111111111111112,"Aceptable"]
["Mejorar continuamente los procesos del Sistema Integrado de Gestión","Gestión Jurídica","Ejercer la defensa judicial y extrajudicial de la entidad y atender requerimientos jurídicos, para salvaguardar sus intereses y cumplir con los requisitos constitucionales y legales","Recuperación de la cartera en mora",null,null,"Porcentaje de procesos de cobro de cartera efectuados","(No. de procesos con etapas de cobro efectuadas/Total de procesos de cobro remitidos con documentación completa)*100","Gestión","Eficacia","Cuatrimestral",1,"Porcentaje","Matriz de seguimiento cobro de cartera","Positiva","No","Los primeros cinco días hábiles de mayo se reportará el indicador con corte a 31 de diciembre del año anterior. \nLos primeros días de septiembre se reportará con corte 30 de abril de la vigencia.\nLos primeros días de enero se reportará con corte a 31 de agosto del año anterior.\nEn el análisis del indicador se presentará la desagregación por etapa (persuasivo y coactivo), así como también el porcentaje de recuperación de cartera.",2019,"Junio"]
["Mejorar continuamente los procesos del Sistema Integrado de Gestión","Gestión Jurídica","Ejercer la defensa judicial y extrajudicial de la entidad y atender requerimientos jurídicos, para salvaguardar sus intereses y cumplir con los requisitos constitucionales y legales","Intervención oportuna en las distintas actuaciones judiciales y extrajudiciales en que sea parte la entidad - tipos de daño en que se resulte demandado o condenado",null,null,"Índice de condenas adversas","(No. de condenas adversas/Total de procesos judiciales)*100","Gestión","Calidad","Semestral",0.08,"Porcentaje","Informe Siproj web mensual (procesos judiciales)","Negativa","No","El análisis del indicador debe evaluar dentro del comité de conciliación los procesos que cursen o hayan cursado en contra de la entidad, determinando causas generadoras de conflictos y los tipos de daño.",2019,"Junio",0,76,{"$f":"+T489/U489","v":0},{"$f":"((L489-V489)+L489)/L489","v":2},{"$f":"_xlfn.IFS(W489<=69%,\"Crítico\",W489>=90%,\"Aceptable\",W489>=70%,\"Tolerable\")","v":"Aceptable"}]
["Mejorar continuamente los procesos del Sistema Integrado de Gestión","Gestión de Comunicaciones","Dar a conocer interna y externamente las actividades, programas y obras que realiza la entidad, para generar apropiación y participación que contribuyan al posicionamiento de la imagen institucional","Exigencia de la solicitud de servicios para todos los procesos con la información completa y detallada de lo requerido","Veracidad de la información reportada por los solicitantes del servicio ",null,"Porcentaje de solicitudes de servicios de comunicaciones atendidas dentro de los tiempos establecidos","(No. de solicitudes de servicio atendidas dentro de los tiempos establecidos/Total de solicitudes de servicio de comunicaciones recibidas)*100","Gestión","Calidad","Trimestral",0.9,"Porcentaje","Consolidado de solicitudes de servicios de comunicaciones","Positiva","No",null,2019,"Junio",360,395,{"$f":"+T490/U490","v":0.91139240506329111},{"$f":"+V490/L490","v":1.0126582278481011},{"$f":"_xlfn.IFS(W490<=69%,\"Crítico\",W490>=90%,\"Aceptable\",W490>=70%,\"Tolerable\")","v":"Aceptable"}]
["Mejorar continuamente los procesos del Sistema Integrado de Gestión","Gestión de Comunicaciones","Dar a conocer interna y externamente las actividades, programas y obras que realiza la entidad, para generar apropiación y participación que contribuyan al posicionamiento de la imagen institucional","Relacionamiento con medios de comunicación","Análisis de los resultados obtenidos mediante el monitoreo de medios para facilitar la toma de decisiones",null,"Impacto de noticias publicadas en medios de comunicación","(No. de noticias positivas o neutras registradas/Total de noticias publicadas en medios de comunicación)*100","Gestión","Eficacia","Trimestral",1,"Porcentaje","Informes mensuales generados por la empresa contratada para realizar el monitoreo de medios","Positiva","No","En el análisis del indicador se presentará el resultado desagregado de noticias positivas y neutras, indicando los principales medios de comunicación.\nSe colocó una meta de 100%, mientras se levanta la línea base con la primera medición.",2019,"Junio",258,330,0.78181818181818186,0.78181818181818186,"Tolerable"]
["Mejorar continuamente los procesos del Sistema Integrado de Gestión","Gestión de Comunicaciones","Dar a conocer interna y externamente las actividades, programas y obras que realiza la entidad, para generar apropiación y participación que contribuyan al posicionamiento de la imagen institucional","Seguimiento a los cambios en las condiciones de publicación en redes sociales y página web",null,null,"Tasa de variación en el alcance total de las publicaciones en redes sociales","((Alcance total de publicaciones en el trimestre actual - Alcance total de publicaciones en el trimestre anterior)/Alcance total de publicaciones en el trimestre anterior)*100\n\nDonde:\n\nAlcance total de las publicaciones = Total de usuarios que vieron las publicaciones de redes sociales","Gestión","Eficacia","Trimestral",0.2,"Porcentaje","Métricas nativas de cada red social","Positiva","No","En el análisis del indicador se presentará el resultado desagregado del alcance de las publicaciones por cada red social. ",2019,"Junio",1060757,3294287,0.3219989636604218,1.6099948183021089,"Aceptable"]
["Mejorar continuamente los procesos del Sistema Integrado de Gestión","Gestión de Comunicaciones","Dar a conocer interna y externamente las actividades, programas y obras que realiza la entidad, para generar apropiación y participación que contribuyan al posicionamiento de la imagen institucional","Análisis de los resultados obtenidos mediante el monitoreo de medios para facilitar la toma de decisiones",null,null,"Salidas publicadas en medios de comunicación","N/A","Gestión","Eficacia","Mensual",80,"Número","Informes mensuales generados por la empresa contratada para realizar el monitoreo de medios","Positiva","No","En el análisis del indicador se presentará el valor estimado de las publicaciones en medios de comunicación.",2019,"Junio",143,1,143,1.7875000000000001,"Aceptable"]
["Mejorar continuamente los procesos del Sistema Integrado de Gestión","Planeación de la Gestión","Establecer directrices para formular y realizar seguimiento a la planeación estratégica y operativa de la entidad con el propósito de contribuir al desarrollo de la misión y objetivos institucionales, así como facilitar la oportunidad y cumplimiento de los resultados esperados","Oportunidad, veracidad y calidad de la información de inversión y gestión",null,null,"Porcentaje de reportes de información presentados dentro de los tiempos programados","(No. de reportes de información elaborados y presentados/Total de reportes de información programados)*100","Gestión","Calidad","Trimestral",1,"Porcentaje","Cronograma de trabajo interno, plan operativo por dependencias (Oficina Asesora de Planeación), plan de adecuación y sostenibilidad SIGD-MIPG","Positiva","No","En el análisis del indicador se desagregará la programación para cada trimestre.",2019,"Julio"]
["Mejorar continuamente los procesos del Sistema Integrado de Gestión","Planeación de la Gestión","Establecer directrices para formular y realizar seguimiento a la planeación estratégica y operativa de la entidad con el propósito de contribuir al desarrollo de la misión y objetivos institucionales, así como facilitar la oportunidad y cumplimiento de los resultados esperados","Oportunidad en el seguimiento de las acciones institucionales para la mejora (correcciones, acciones correctivas, oportunidades de mejora, acciones para abordar riesgos)",null,null,"Porcentaje de acciones de mejora con seguimiento efectuado dentro del Sistema de Gestión","[No. de acciones de mejora con seguimiento efectuado dentro del tiempo programado/Total de acciones de mejora abiertas dentro del Sistema de Gestión de la Calidad (correcciones, acciones correctivas, oportunidades de mejora, acciones para abordar riesgos)]*100","Gestión","Eficacia","Mensual",1,"Porcentaje","Isolución","Positiva","No","En el análisis del indicador se presentará el resultado desagregado por cada tipología de mejora (corrección, acciones correctivas, oportunidades de mejora, acciones para abordar riesgos).",2019,"Julio",28,28,1,1,{"$f":"_xlfn.IFS(W495<=69%,\"Crítico\",W495>=90%,\"Aceptable\",W495>=70%,\"Tolerable\")","v":"Aceptable"}]
["Mejorar continuamente los procesos del Sistema Integrado de Gestión","Gestión de Recursos Físicos","Administrar y controlar los bienes muebles y servicios para el funcionamiento administrativo de la entidad","Oportunidad en la atención de requerimientos y necesidades de servicios administrativos",null,null,"Porcentaje de mantenimientos realizados a la infraestructura física de la sede administrativa","(No. de mantenimientos realizados a la infraestructura física/Total de mantenimientos programados a la infraestructura física de la sede administrativa)*100","Gestión","Eficacia","Trimestral",0.9,"Porcentaje","Expendientes contractuales en plataforma ORFEO","Positiva","No",null,2019,"Julio"]
["Mejorar continuamente los procesos del Sistema Integrado de Gestión","Gestión de Asuntos Locales","Desarrollar acciones a nivel local para promover la participación ciudadana, brindar acompañamiento a las alcaldías locales en temas misionales de la entidad y ofertar sus programas","Oportunidad en la emisión del concepto previo y favorable según los tiempos establecidos en la normatividad vigente",null,null,"Porcentaje de conceptos previos tramitados dentro de los términos legales vigentes","(No. de conceptos previos tramitados dentro de los términos legales vigentes/Total de solicitudes de conceptos previos recibidas)*100","Gestión","Calidad","Trimestral",0.5,"Porcentaje","Matriz de seguimiento a conceptos previos tramitados","Positiva","No",null,2019,"Julio"]
["Mejorar continuamente los procesos del Sistema Integrado de Gestión","Control, Evaluación y Seguimiento","Evaluar los controles y la gestión de la entidad con el fin de identificar e implementar acciones de mejora, en pro de la sostenibilidad del Sistema de Control Interno","Pertinencia y oportunidad en la entrega de los resultados del seguimiento a las partes interesadas","Oportunidad y calidad en la información reportada a las entidades competentes del orden nacional y distrital",null,"Porcentaje de informes presentados por la tercera línea de defensa dentro de los tiempos programados","(No. de informes de ley y de gestión elaborados y presentados dentro de los tiempos programados/Total de informes de ley y de gestión a cargo de la tercera línea de defensa )*100  ","Gestión","Calidad","Trimestral",1,"Porcentaje","Plan anual de auditoría\nCronograma presentación de informes","Positiva","No","En el análisis del indicador se presentará el resultado desagregado por cada uno de los informes realizados.",2019,"Julio"]
["Mejorar continuamente los procesos del Sistema Integrado de Gestión","Control, Evaluación y Seguimiento","Evaluar los controles y la gestión de la entidad con el fin de identificar e implementar acciones de mejora, en pro de la sostenibilidad del Sistema de Control Interno","Cumplimiento de los objetivos definidos en el plan de auditoría conforme al plan de pruebas","Cobertura de las unidades a auditar de acuerdo con los parámetros establecidos en la matriz de priorización, en concordancia con los recursos disponibles para la ejecución del Plan Anual de Auditoría",null,"Índice de eficacia de auditorías internas de control interno","(Índice auditoría 1 + índice auditoría 2 +...+Índice auditoría n)/Total de auditorías realizadas\nDonde: \nÍndice auditoría n = Calificación porcentual de la variable Objetivos Específicos*Peso de la variable Objetivos Específicos + Calificación porcentual de la variable Actividad Plan de Auditoría*Peso de la variable Actividad Plan de Auditoría + Calificación porcentual de la variable Oportunidad*Peso de la variable Oportunidad\nPesos de las variables:\nObjetivos Específicos = 40%\nActividades Plan de Auditoría = 30%\nOportunidad = 30%. Esta se medirá tomando como fecha de referencia la de emisión del informe preliminar de auditoría.\nn = número de auditorías realizadas","Gestión","Eficacia","Trimestral",0.85,"Porcentaje","Planes de cada una de las auditorías","Positiva","No","En el análisis del indicador se presentará el resultado desagregado por cada una de las auditorías realizadas.",2019,"Julio"]
["Mejorar continuamente los procesos del Sistema Integrado de Gestión","Gestión Financiera","Administrar los recursos financieros asignados y realizar los respectivos registros, para el cumplimiento de las funciones de la entidad y pago de sus obligaciones con terceros","Oportunidad en el seguimiento de las partidas pendientes por conciliar",null,null,"Porcentaje de partidas conciliatorias identificadas dentro del tiempo establecido","(No. de partidas conciliatorias identificadas con edad inferior a 60 días/Total de partidas reportadas)*100","Gestión","Calidad","Mensual",0.9,"Porcentaje","Sistema de información SEVEN","Positiva","No",null,2019,"Julio",109,109,1,1.1111111111111112,"Aceptable"]
["Mejorar continuamente los procesos del Sistema Integrado de Gestión","Gestión Financiera","Administrar los recursos financieros asignados y realizar los respectivos registros, para el cumplimiento de las funciones de la entidad y pago de sus obligaciones con terceros","Oportunidad e integridad de la información necesaria para realizar las diferentes conciliaciones",null,null,"Porcentaje de obligaciones contingentes registradas correctamente en la contabilidad","(No. de procesos registrados correctamente en la contabilidad/Total de procesos reportados en SIPROJ Web)*100","Gestión","Calidad","Trimestral",1,"Porcentaje","Sistema de información SEVEN","Positiva","No",null,2019,"Julio"]
["Mejorar continuamente los procesos del Sistema Integrado de Gestión","Gestión Financiera","Administrar los recursos financieros asignados y realizar los respectivos registros, para el cumplimiento de las funciones de la entidad y pago de sus obligaciones con terceros","Oportunidad en la presentación de informes y estados financieros a los diferentes entes de vigilancia y control",null,null,"Porcentaje de notas a los estados financieros reveladas correctamente","(No. de notas sin observaciones por parte de los órganos de control internos y externos/Total de notas a los estados financieros elaboradas)*100","Gestión","Calidad","Anual",0.95,"Porcentaje","Informes de entes de control y vigilancia","Positiva","No",null,2019,"Julio"]
["Mejorar continuamente los procesos del Sistema Integrado de Gestión","Gestión Financiera","Administrar los recursos financieros asignados y realizar los respectivos registros, para el cumplimiento de las funciones de la entidad y pago de sus obligaciones con terceros","Oportunidad en la presentación de informes y estados financieros a los diferentes entes de vigilancia y control","Oportunidad en la presentación de las declaraciones tributarias",null,"Porcentaje de informes financieros presentados a los entes de vigilancia y control dentro de los términos legales vigentes","(No. de informes financieros presentados dentro de los términos legales vigentes/Total de informes financieros a reportar a los entes de vigilancia y control)*100","Gestión","Calidad","Trimestral",1,"Porcentaje","Matriz de seguimiento a la presentación de informes ","Positiva","No",null,2019,"Julio"]
["Satisfacer las necesidades de los usuarios a través de la prestación de servicios eficientes, eficaces y efectivos","Promoción de la Recreación","Desarrollar actividades recreativas en función de las características y necesidades de la población de Bogotá D.C., para promover el aprovechamiento del tiempo libre y el mejoramiento en la calidad de vida","Satisfacción del usuario con las actividades recreativas realizadas",null,null,"Satisfacción de los usuarios con los eventos y/o programas recreativos","(No. de usuarios satisfechos con los eventos y/o programas recreativos/Total de usuarios de eventos y/o programas recreativos encuestados)*100","Gestión","Efectividad","Anual",1,"Porcentaje","Encuesta de satisfacción sobre eventos y/o programas recreativos","Positiva","No","En el análisis del indicador se presentará el resultado desagregado por programa y por cada uno de los aspectos evaluados en la encuesta de satisfacción.\nSe colocó una meta de 100%, mientras se levanta la línea base con la primera medición.",2019,"Julio"]
["Mejorar continuamente los procesos del Sistema Integrado de Gestión","Promoción de la Recreación","Desarrollar actividades recreativas en función de las características y necesidades de la población de Bogotá D.C., para promover el aprovechamiento del tiempo libre y el mejoramiento en la calidad de vida","Cumplimiento del programa de actividades recreativas, teniendo en cuenta lo establecido en las fichas técnicas o según lo concertado con la comunidad e instituciones",null,null,"Porcentaje de actividades recreativas que cumplen con los requisitos para su ejecución","(No. de actividades recreativas que cumplen con los requisitos definidos para su ejecución/Total de actividades recreativas realizadas)*100","Gestión","Eficacia","Trimestral",0.97,"Porcentaje","Sistema de información misional - SIM","Positiva","No","En el análisis del indicador se presentará el resultado desagregado por programa y por actividad.",2019,"Julio"]
["Satisfacer las necesidades de los usuarios a través de la prestación de servicios eficientes, eficaces y efectivos","Fomento al Deporte","Desarrollar e implementar programas deportivos y de actividad física, para contribuir con el mejoramiento de la calidad de vida en la población de Bogotá D.C.","Satisfacción del usuario con las actividades deportivas  realizadas",null,null,"Satisfacción de los usuarios con las actividades realizadas en los programas deportivos","(No. de usuarios satisfechos con las actividades deportivas realizadas/Total de usuarios de actividades deportivas encuestados)*100","Gestión","Efectividad","Anual",1,"Porcentaje","Encuesta de satisfacción sobre actividades/programas deportivos","Positiva","No","En el análisis del indicador se presentará el resultado desagregado por programa y por cada uno de los aspectos evaluados en la encuesta de satisfacción.\nSe colocó una meta de 100%, mientras se levanta la línea base con la primera medición.",2019,"Julio"]
["Mejorar continuamente los procesos del Sistema Integrado de Gestión","Fomento al Deporte","Desarrollar e implementar programas deportivos y de actividad física, para contribuir con el mejoramiento de la calidad de vida en la población de Bogotá D.C.","Cambios comportamentales como resultados de los programas deportivos y de actividad física",null,null,"Cambio comportamental frente a la actividad física y el deporte","(No. de beneficiarios con percepción de cambio comportamental alrededor de las 4 dimensiones de la alfabetización física/Total de beneficiarios de programas deportivos y de actividad física seleccionados en la muestra)*100","Gestión","Efectividad","Anual",1,"Porcentaje","Encuesta para medir las 4 dimensiones de la alfabetización física","Positiva","No","La metodología se aplicará sobre una muestra por cada por cada programa. Se define en 4 tipos de mediciones:\n1. Medición dimensión competencia física. Aplicar test de resistencia, fuerza de torso, habilidades y flexibilidad.\n2. Medición dimensiones: competencia cognitiva, comportamental y motivacional a través de un cuestionario (on-line o presencial).\nSe colocó una meta de 100%, mientras se levanta la línea base con la primera medición.",2019,"Julio"]
["Satisfacer las necesidades de los usuarios a través de la prestación de servicios eficientes, eficaces y efectivos","Servicio a la Ciudadanía","Brindar información y atender los requerimientos de los grupos de valor y de interés de la entidad para responder a sus necesidades en cumplimiento de sus derechos","Oportunidad y calidad en la respuesta a los requerimientos de los grupos de valor e interés de la entidad","Satisfacción del ciudadano frente a las respuestas a sus requerimientos",null,"Satisfacción de peticionarios con la respuesta dada a sus requerimientos","(No. de peticionarios satisfechos con la respuesta dada a sus peticiones, quejas, reclamos y sugerencias/Total de peticionarios contactados)*100","Gestión","Efectividad","Mensual",0.8,"Porcentaje","Base de datos de gestión de PQRS","Positiva","No",null,2019,"Julio",22,27,0.81481481481481477,1.0185185185185184,"Aceptable"]
["Mejorar continuamente los procesos del Sistema Integrado de Gestión","Gestión de Recursos Físicos","Administrar y controlar los bienes muebles y servicios para el funcionamiento administrativo de la entidad","Oportunidad en la atención de requerimientos y necesidades de servicios administrativos",null,null,"Porcentaje de requerimientos de mantenimiento correctivo atendidos en la sede administrativa dentro de los tiempos establecidos","(No. de requerimientos de mantenimiento correctivo atendidos dentro de los tiempos establecidos/Total de requerimientos de mantenimiento correctivo reportados en la sede administrativa)*100","Gestión","Calidad","Trimestral",0.95,"Porcentaje","Aplicativo mesa de ayuda OTRS","Positiva","No",null,2019,"Julio"]
["Mejorar continuamente los procesos del Sistema Integrado de Gestión","Adquisición de Bienes y Servicios","Realizar actividades contractuales para adquirir bienes y servicios con la oportunidad y de acuerdo con las especificaciones establecidas por la entidad","Cumplimiento de requisitos de acuerdo con la modalidad de selección",null,null,"Porcentaje de procesos de selección publicados dentro del tiempo establecido","(No. de actos de apertura de procesos de selección publicados en un tiempo menor o igual a 30 días hábiles después de la radicación/Total de actos de apertura expedidos)*100","Gestión","Calidad","Trimestral",0.9,"Porcentaje","Plataforma ORFEO y SECOP","Positiva","No","En el análisis del indicador se presentará el resultado desagregado para licitación pública, concurso de méritos y selección abreviada.",2019,"Julio"]
["Mejorar continuamente los procesos del Sistema Integrado de Gestión","Adquisición de Bienes y Servicios","Realizar actividades contractuales para adquirir bienes y servicios con la oportunidad y de acuerdo con las especificaciones establecidas por la entidad","Oportunidad en la suscripción y legalización del contrato",null,null,"Porcentaje de contratos legalizados dentro del tiempo establecido","(No. de contratos legalizados en un tiempo menor o igual a 10 días hábiles a partir del acto administrativo de adjudicación/Total de procesos de selección adjudicados)*100","Gestión","Calidad","Mensual",0.8,"Porcentaje","SECOP y Plataforma ORFEO ","Positiva","No","En el análisis del indicador se presentará el resultado desagregado para licitación pública, concurso de méritos y selección abreviada.",2019,"Julio",3,8,0.375,0.46875,"Crítico","En el mes se adjudicaron ocho (8) procesos con el siguiente comportamiento: tres (3) se adjudicaron en tiempo; dos (2) no se legalizaron dentro del mes y tres (3) procesos se legalizaron entre los 12 y 13 días hábiles.  "]
["Mejorar continuamente los procesos del Sistema Integrado de Gestión","Adquisición de Bienes y Servicios","Realizar actividades contractuales para adquirir bienes y servicios con la oportunidad y de acuerdo con las especificaciones establecidas por la entidad","Definición clara y precisa de requisitos técnicos, financieros, económicos, jurídicos y de riesgos de acuerdo con el bien o servicio a adquirir",null,null,"Porcentaje de procesos de obra tramitados en análisis de costos dentro del tiempo establecido","(No. de procesos de obra (todas las Subdirecciones) tramitados en oportunidad al recibo del memorando con la solicitud estudio del sector (20 días)/Total de procesos de obra recibidos)*100","Gestión","Calidad","Trimestral",1,"Porcentaje","Matriz de tráfico ACEE","Positiva","No",null,2019,"Julio"]
["Mejorar continuamente los procesos del Sistema Integrado de Gestión","Adquisición de Bienes y Servicios","Realizar actividades contractuales para adquirir bienes y servicios con la oportunidad y de acuerdo con las especificaciones establecidas por la entidad","Definición clara y precisa de requisitos técnicos, financieros, económicos, jurídicos y de riesgos de acuerdo con el bien o servicio a adquirir",null,null,"Porcentaje de procesos diferentes a obra tramitados en análisis de costos dentro del tiempo establecido","(No. de procesos diferentes a obra tramitados en oportunidad al recibo del memorando con la solicitud estudio del sector (10 días hábiles)/Total de procesos recibidos diferentes a obra)*100","Gestión","Calidad","Trimestral",0.9,"Porcentaje","Matriz de tráfico ACEE","Positiva","No","En el análisis del indicador se presentará el resultado desagregado para procesos diferentes a obra.",2019,"Julio"]
["Mejorar continuamente los procesos del Sistema Integrado de Gestión","Adquisición de Bienes y Servicios","Realizar actividades contractuales para adquirir bienes y servicios con la oportunidad y de acuerdo con las especificaciones establecidas por la entidad","Definición clara y precisa de requisitos técnicos, financieros, económicos, jurídicos y de riesgos de acuerdo con el bien o servicio a adquirir",null,null,"Porcentaje de procesos requeridos por precios artificialmente bajos","(No. de procesos (excepto Subastas SAS) requeridos por precios artificialmente bajos/Total de procesos evaluados)*100","Gestión","Calidad","Trimestral",0.15,"Porcentaje","Evaluación económica de los proponentes\n\nAnálisis de precios realizado por la ACEE","Negativa","No","En el análisis del indicador se presentará el resultado desagregado por tipo de proceso.",2019,"Julio"]
["Mejorar continuamente los procesos del Sistema Integrado de Gestión","Control, Evaluación y Seguimiento","Evaluar los controles y la gestión de la entidad con el fin de identificar e implementar acciones de mejora, en pro de la sostenibilidad del Sistema de Control Interno","Pertinencia y oportunidad en la entrega de los resultados del seguimiento a las partes interesadas",null,null,"Porcentaje de acciones de mejoramiento interno con seguimiento efectuado","(No. de acciones de mejoramiento interno con seguimiento efectuado)/Total de acciones de mejoramiento interno abiertas de auditorías internas de control interno)*100","Gestión","Eficacia","Trimestral",1,"Porcentaje","Plataforma Isolución","Positiva","No","En el análisis del indicador se presentará el resultado desagregado por proceso.",2019,"Julio"]
["Mejorar continuamente los procesos del Sistema Integrado de Gestión","Control, Evaluación y Seguimiento","Evaluar los controles y la gestión de la entidad con el fin de identificar e implementar acciones de mejora, en pro de la sostenibilidad del Sistema de Control Interno","Pertinencia y oportunidad en la entrega de los resultados del seguimiento a las partes interesadas",null,null,"Porcentaje de acciones de mejoramiento externo con seguimiento efectuado","(No. de acciones de mejoramiento externo con seguimiento efectuado)/Total de acciones de mejoramiento externo abiertas de auditorías externas)*100","Gestión","Eficacia","Trimestral",1,"Porcentaje","Matrices de consolidación del estado de las acciones de los diferentes entes de control y vigilancia","Positiva","No","En el análisis del indicador se presentará el resultado desagregado por auditoría externa.",2019,"Julio"]
["Mejorar continuamente los procesos del Sistema Integrado de Gestión","Gestión Financiera","Administrar los recursos financieros asignados y realizar los respectivos registros, para el cumplimiento de las funciones de la entidad y pago de sus obligaciones con terceros","Oportunidad en la expedición de los certificados presupuestales y en la presentación de los informes de ejecución",null,null,"Porcentaje de ejecución presupuestal en gastos de funcionamiento","(Presupuesto de funcionamiento ejecutado/Presupuesto disponible de funcionamiento)*100","Gestión","Eficiencia","Mensual",0.95,"Porcentaje","Ejecución presupuestal en SEVEN","Positiva","Si","La meta es anual con medición y análisis mensual.\nLa medición está a cargo del Área Financiera y el análisis a cargo de la Subdirección Administrativa y Financiera.\nLa medición y el análisis se deben realizar a más tardar el quinto día hábil de cada mes.\nUna vez se realice el Comité Financiero, el Área Financiera debe enviar a la Oficina Asesora de Planeación la presentación correspondiente, con el análisis respectivo en cuanto al desempeño del indicador.",2019,"Julio",18774866019,35208442000,0.53324898667768372,{"$f":"+V517/L517","v":0.5613147228186145}]
["Mejorar continuamente los procesos del Sistema Integrado de Gestión","Gestión Financiera","Administrar los recursos financieros asignados y realizar los respectivos registros, para el cumplimiento de las funciones de la entidad y pago de sus obligaciones con terceros","Oportunidad en la expedición de los certificados presupuestales y en la presentación de los informes de ejecución","Oportunidad en la autorización de giro de los recursos de transferencia",null,"Porcentaje de ejecución presupuestal en gastos de inversión","(Presupuesto de inversión ejecutado/Presupuesto disponible de inversión)*100","Gestión","Eficiencia","Mensual",1,"Porcentaje","Ejecución presupuestal en SEVEN","Positiva","Si","La meta es anual con medición y análisis mensual.\nLa medición está a cargo del Área Financiera y el análisis a cargo de los Ordenadores del Gasto.\nLa medición y el análisis se deben realizar a más tardar el quinto día hábil de cada mes.\nUna vez se realice el Comité Financiero, el Área Financiera debe enviar a la Oficina Asesora de Planeación la presentación correspondiente, con el análisis respectivo en cuanto al desempeño del indicador.",2019,"Julio",344982723490,742020022000,0.46492373960496713,0.46492373960496713]
["Mejorar continuamente los procesos del Sistema Integrado de Gestión","Gestión Financiera","Administrar los recursos financieros asignados y realizar los respectivos registros, para el cumplimiento de las funciones de la entidad y pago de sus obligaciones con terceros","Oportunidad en el pago de las obligaciones financieras de la entidad",null,null,"Porcentaje de ejecución del programa anual de caja","(Recursos ejecutados de reserva, vigencia y pasivos exigibles/Recursos programados de reserva, vigencia y pasivos exigibles)*100","Gestión","Eficiencia","Mensual",1,"Porcentaje","Sistema de información SEVEN","Positiva","Si","La meta es anual con medición y análisis mensual.\nLa medición está a cargo del Área Financiera y el análisis a cargo de los Ordenadores del Gasto.\nLa medición y el análisis se deben realizar a más tardar el quinto día hábil de cada mes.\nUna vez se realice el Comité Financiero, el Área Financiera debe enviar a la Oficina Asesora de Planeación la presentación correspondiente, con el análisis respectivo en cuanto al desempeño del indicador.",2019,"Julio",48153257,53117930,{"$f":"+T519/U519","v":0.9065348932083761},0.9065348932083761]
["Mejorar continuamente los procesos del Sistema Integrado de Gestión","Gestión Financiera","Administrar los recursos financieros asignados y realizar los respectivos registros, para el cumplimiento de las funciones de la entidad y pago de sus obligaciones con terceros","Oportunidad en el pago de las obligaciones financieras de la entidad","Oportunidad en la causación de ordenes de pago que cumplan con todos los requisitos establecidos","Oportunidad y veracidad de la información necesaria para la causación de las ordenes de pago reportada por los ordenadores del gasto","Porcentaje de cuentas individuales pagadas dentro del tiempo establecido","(No. de cuentas individuales pagadas en un tiempo menor o igual a 6 días/Total de cuentas de pago individuales tramitadas)*100 ","Gestión","Calidad","Mensual",1,"Porcentaje","Bitácora de cuentas en SEVEN","Positiva","No","La medición y el análisis están a cargo del Área Financiera.\nEn el análisis del indicador se presentará el resultado del tiempo promedio en cada una de las etapas para el pago, según la bitácora de cuentas de SEVEN.",2019,"Julio",290,290,1,1,{"$f":"_xlfn.IFS(W520<=69%,\"Crítico\",W520>=90%,\"Aceptable\",W520>=70%,\"Tolerable\")","v":"Aceptable"}]
["Mejorar continuamente los procesos del Sistema Integrado de Gestión","Gestión Financiera","Administrar los recursos financieros asignados y realizar los respectivos registros, para el cumplimiento de las funciones de la entidad y pago de sus obligaciones con terceros","Oportunidad en el pago de las obligaciones financieras de la entidad","Oportunidad en la causación de ordenes de pago que cumplan con todos los requisitos establecidos","Oportunidad y veracidad de la información necesaria para la causación de las ordenes de pago reportada por los ordenadores del gasto","Porcentaje de cuentas colectivas pagadas dentro del tiempo establecido","(No. de cuentas colectivas pagadas en un tiempo menor o igual a 10 días/Total de cuentas de pago colectivas tramitadas)*100","Gestión","Calidad","Mensual",1,"Porcentaje","Bitácora de cuentas en SEVEN","Positiva","No","La medición y el análisis están a cargo del Área Financiera.\nEn el análisis del indicador se debe presentar el resultado del tiempo promedio en cada una de las etapas para el pago, según la bitácora de cuentas de SEVEN.",2019,"Julio",54,54,1,1,{"$f":"_xlfn.IFS(W521<=69%,\"Crítico\",W521>=90%,\"Aceptable\",W521>=70%,\"Tolerable\")","v":"Aceptable"}]
["Implementar las políticas y líneas de acción para la preservación e integridad de la documentación","Gestión Documental","Administrar, conservar y custodiar la documentación generada en la entidad, desde su origen hasta su disposición final, para preservar la memoria institucional","Actualización del inventario documental en el Formato Único de Inventario Documental, con base en la aplicación de las tablas de retención documental","Cumplimiento de los tiempos de retención documental establecidos en las tablas","Actualización de los instrumentos archivísticos","Porcentaje de inventario validado del fondo documental acumulado del archivo central","(No. de metros lineales de inventario validado en cuanto a series, subseries, asuntos y oficinas productoras/Total de metros lineales de archivo inventariado en estado natural del archivo central)*100 ","Gestión","Eficacia","Mensual",1,"Porcentaje","Matriz de seguimiento a inventario documental","Positiva","Si","La meta es anual con medición y análisis mensual",2019,"Julio",1265.06,2180.5,0.58016968585186879,0.58016968585186879]
["Implementar las políticas y líneas de acción para la preservación e integridad de la documentación","Gestión Documental","Administrar, conservar y custodiar la documentación generada en la entidad, desde su origen hasta su disposición final, para preservar la memoria institucional","Oportunidad en las transferencias documentales de acuerdo con los tiempos de retención establecidos en las tablas",null,null,"Porcentaje de transferencias primarias realizadas de acuerdo con los tiempos de retención","(No. de transferencias primarias realizadas de acuerdo con los tiempos de retención establecidos en las TRD/Total de transferencias documentales programadas)*100","Gestión","Eficacia","Mensual",0.8,"Porcentaje","Matriz de seguimiento a transferencias documentales","Positiva","Si","La meta es anual con medición y análisis mensual",2019,"Julio",33,33,1,1.25]
["Implementar las políticas y líneas de acción para la preservación e integridad de la documentación","Gestión Documental","Administrar, conservar y custodiar la documentación generada en la entidad, desde su origen hasta su disposición final, para preservar la memoria institucional","Cumplimiento de los estándares de temperatura, humedad relativa y luminosidad de los espacios de almacenamiento de material documental, dentro de los rangos establecidos en la normatividad vigente",null,null,"Porcentaje de espacios controlados para la conservación documental","(No. de espacios monitoreados e intervenidos/Total de espacios monitoreados)*100","Gestión","Eficacia","Mensual",1,"Porcentaje","Informe de monitoreo de espacios controlados","Positiva","No","La medición es mes vencido",2019,"Julio",10,10,1,1,{"$f":"_xlfn.IFS(W524<=69%,\"Crítico\",W524>=90%,\"Aceptable\",W524>=70%,\"Tolerable\")","v":"Aceptable"}]
["Mejorar continuamente los procesos del Sistema Integrado de Gestión","Servicio a la Ciudadanía","Brindar información y atender los requerimientos de los grupos de valor y de interés de la entidad para responder a sus necesidades en cumplimiento de sus derechos","Oportunidad y calidad en la respuesta a los requerimientos de los grupos de valor e interés de la entidad",null,null,"Porcentaje de peticiones, quejas, reclamos y sugerencias contestadas dentro de los términos legales vigentes","(No. de peticiones, quejas, reclamos y sugerencias contestadas en el aplicativo SDQS dentro de los términos legales vigentes/Total de peticiones, quejas, reclamos y sugerencias recibidas)*100","Gestión","Calidad","Mensual",1,"Porcentaje","Sistema SDQS","Positiva","No","La medición es mes vencido",2019,"Julio",325,391,0.83120204603580561,0.83120204603580561,"Tolerable"]
["Satisfacer las necesidades de los usuarios a través de la prestación de servicios eficientes, eficaces y efectivos","Servicio a la Ciudadanía","Brindar información y atender los requerimientos de los grupos de valor y de interés de la entidad para responder a sus necesidades en cumplimiento de sus derechos","Satisfacción del ciudadano frente a la atención brindada por la entidad",null,null,"Satisfacción del ciudadano con la atención recibida en los SUPERCADE","(No. de ciudadanos satisfechos con la atención recibida en los SUPERCADE/Total de ciudadanos atendidos en los SUPERCADE)*100","Gestión","Efectividad","Mensual",0.95,"Porcentaje","Encuesta de satisfacción con la atención brindada en SUPERCADES","Positiva","No",null,2019,"Julio",3457,3458,0.99971081550028917,1.0523271742108307,"Aceptable"]
["Mejorar continuamente los procesos del Sistema Integrado de Gestión","Servicio a la Ciudadanía","Brindar información y atender los requerimientos de los grupos de valor y de interés de la entidad para responder a sus necesidades en cumplimiento de sus derechos","Oportunidad en la actualización de la información publicada en la sección de ley de transparencia en la página web de la entidad",null,null,"Porcentaje de información actualizada en ley de transparencia","(No. de subcategorías con información actualizada en la página web/Total de subcategorías definidas en ley de transparencia)*100","Gestión","Eficacia","Trimestral",1,"Porcentaje","Página web","Positiva","No",null,2019,"Julio"]
["Mejorar continuamente los procesos del Sistema Integrado de Gestión","Servicio a la Ciudadanía","Brindar información y atender los requerimientos de los grupos de valor y de interés de la entidad para responder a sus necesidades en cumplimiento de sus derechos","Coherencia, claridad, solución de fondo, calidez y manejo del sistema en relación con los requerimientos atendidos por la entidad",null,null,"Porcentaje de requerimientos atendidos con oportunidad y calidad","(No. de respuestas a requerimientos sin observaciones en cuanto a los criterios de oportunidad y calidad/Total de requerimientos evaluados en el aplicativo SDQS)*100","Gestión","Eficacia","Mensual",0.8,"Porcentaje","SDQS y base de datos de gestión de PQRS","Positiva","No","La medición es mes vencido",2019,"Julio",88,120,0.73333333333333328,0.91666666666666652,"Aceptable"]
["Implementar buenas prácticas ambientales para la prevención de la contaminación en el marco de una Bogotá que defiende lo público en su función administrativa y de desarrollo institucional","Gestión de Recursos Físicos","Administrar y controlar los bienes muebles y servicios para el funcionamiento administrativo de la entidad","Calificación de la implementación del Plan Institucional de Gestión Ambiental, por parte de la Secretaría Distrital de Ambiente","Oportunidad en el reporte de formularios y registros electrónicos del PIGA ante la Secretaría Distrital de Ambiente",null,"Índice de implementación del PIGA","Promedio ponderado de cumplimiento de aspectos normativos y de implementación del PIGA, según auditoría realizada por la Secretaría Distrital de Ambiente en cada vigencia","Gestión","Eficacia","Anual",0.7,"Porcentaje","Informe de auditoría anual realizada por la Secretaría Distrital de Ambiente","Positiva","No","En el análisis del indicador se presentará el resultado desagregado por cada uno de los aspectos evaluados en la visita de control y seguimiento por parte de la Secretaría Distrital de Ambiente.\nLa meta está configurada como mayor a 70%.",2019,"Julio"]
["Proteger la integridad, confidencialidad y disponibilidad de la información","Gestión de Tecnología de la Información y las Comunicaciones","Proporcionar soluciones estratégicas de tecnologías de la información y las comunicaciones, para contribuir con la eficiencia administrativa, la mejora de los trámites y servicios y la protección de los activos de información de la entidad","Impacto del plan de remediación frente a las vulnerabilidades identificadas","Aseguramiento de incidencias en la seguridad de la información que afecten la confidencialidad, integridad y disponibilidad",null,"Porcentaje de remediación de vulnerabilidades de seguridad de la información","(No. de vulnerabilidades críticas o altas remediadas/Total de vulnerabilidades de seguridad de la información detectadas como críticas o altas)*100 ","Gestión","Eficacia","Anual",0.7,"Porcentaje","Matriz de vulnerabilidades","Positiva","No","La meta está configurada como mínimo 70%.",2019,"Julio"]
["Proteger la integridad, confidencialidad y disponibilidad de la información","Gestión de Tecnología de la Información y las Comunicaciones","Proporcionar soluciones estratégicas de tecnologías de la información y las comunicaciones, para contribuir con la eficiencia administrativa, la mejora de los trámites y servicios y la protección de los activos de información de la entidad","Avances en la implementación de gobierno digital de acuerdo con los componentes evaluados por MINTIC",null,null,"Índice de implementación de gobierno digital","Sumatoria de la calificación obtenida por cada componente/Total de componentes de la política de gobierno digital","Gestión","Eficacia","Anual",0.65,"Porcentaje","Instrumento de medición suministrado para el seguimiento a la política de gobierno digital  ","Positiva","No","En el análisis del indicador se presentará el resultado desagregado de las calificaciones obtenidas en cada componente de la política de seguridad digital.",2019,"Julio"]
["Mejorar continuamente los procesos del Sistema Integrado de Gestión","Gestión de Tecnología de la Información y las Comunicaciones","Proporcionar soluciones estratégicas de tecnologías de la información y las comunicaciones, para contribuir con la eficiencia administrativa, la mejora de los trámites y servicios y la protección de los activos de información de la entidad","Cumplimiento del Plan Estratégico de Tecnologías de la Información PETI",null,null,"Porcentaje de avance en proyectos de TI","(No. de hitos en proyectos de TI alcanzados/Total de hitos en proyectos de TI programados en la vigencia)*100","Gestión","Eficacia","Semestral",1,"Porcentaje","Cronograma de proyectos del PETI","Positiva","Si","La meta es anual con medición y análisis semestral.",2019,"Julio"]
["Proteger la integridad, confidencialidad y disponibilidad de la información","Gestión de Tecnología de la Información y las Comunicaciones","Proporcionar soluciones estratégicas de tecnologías de la información y las comunicaciones, para contribuir con la eficiencia administrativa, la mejora de los trámites y servicios y la protección de los activos de información de la entidad","Disponibilidad de los sistemas de información de la entidad",null,null,"Porcentaje de disponibilidad de los sistemas de información","(No. de horas disponibles de los sistemas de información/Total de horas en servicio de los sistemas de información)*100","Gestión","Eficiencia","Mensual",0.9,"Porcentaje","Herramienta de monitoreo ZABBIX","Positiva","No","En el análisis del indidicador se presentará el resultado desagregado de disponibilidad en ORFEO, SEVEN, KACTUS y SIM.\nLa meta está configurada como mayor o igual a 90%.",2019,"Julio",743.63,744,0.99950268817204302,1.110558542413381,{"$f":"_xlfn.IFS(W533<=69%,\"Crítico\",W533>=90%,\"Aceptable\",W533>=70%,\"Tolerable\")","v":"Aceptable"}]
["Mejorar continuamente los procesos del Sistema Integrado de Gestión","Gestión de Tecnología de la Información y las Comunicaciones","Proporcionar soluciones estratégicas de tecnologías de la información y las comunicaciones, para contribuir con la eficiencia administrativa, la mejora de los trámites y servicios y la protección de los activos de información de la entidad","Disponibilidad de los servicios de comunicaciones en la entidad, según los acuerdos de niveles de servicios establecidos",null,null,"Porcentaje de disponibilidad de los servicios de comunicaciones","(No. de horas disponibles de los servicios de comunicaciones /Total de horas de los servicios de comunicaciones)*100","Gestión","Eficiencia","Mensual",0.9,"Porcentaje","Herramienta de monitoreo ZABBIX","Positiva","No","En el análisis del indidicador se presentará el resultado desagregado de disponibilidad en Internet y Telefonía IP.\nLa meta está configurada como mayor o igual a 90%.",2019,"Julio",743.63,744,0.99950268817204302,1.110558542413381,"Aceptable"]
["Mejorar continuamente los procesos del Sistema Integrado de Gestión","Gestión de Tecnología de la Información y las Comunicaciones","Proporcionar soluciones estratégicas de tecnologías de la información y las comunicaciones, para contribuir con la eficiencia administrativa, la mejora de los trámites y servicios y la protección de los activos de información de la entidad","Incidencias reportadas en el funcionamiento del módulo o sistema de información implementado","Cumplimiento de los acuerdos de niveles de servicios establecidos",null,"Porcentaje de solicitudes de servicio tecnológico atendidas dentro de los tiempos establecidos","(No. de solicitudes atendidas dentro de los tiempos establecidos en los acuerdos de nivel de servicio/Total de solicitudes de servicio tecnológico recibidas)*100","Gestión","Calidad","Mensual",0.9,"Porcentaje","Herramienta GLPI","Positiva","No",null,2019,"Julio",873,877,0.99543899657924739,1.1060433295324972,"Aceptable"]
["Mejorar continuamente los procesos del Sistema Integrado de Gestión","Gestión de Talento Humano","Gestionar el potencial del talento humano como factor estratégico, para contribuir con el desarrollo de la entidad en un ambiente seguro y saludable","Cumplimiento de compromisos y competencias del servidor público en el desempeño laboral","Oportunidad en el seguimiento y la evaluación anual u ordinaria del servidor público para continuar su permanencia en el servicio",null,"Índice de desempeño laboral de funcionarios","(Sumatoria de calificaciones finales de la evaluación de desempeño de los funcionarios/Total de funcionarios evaluados)*100","Gestión","Eficacia","Anual",0.9,"Porcentaje","Consolidado de las calificaciones finales de la evaluación de desempeño","Positiva","No","En el análisis del indicador se presentará el resultado desagregado por niveles jerárquicos y comparar con la evaluación de las áreas.\nLa meta está configurada como mayor a 90%.\nNota: Se mide para vigencia 2018-2019.",2019,"Julio"]
["Mejorar continuamente los procesos del Sistema Integrado de Gestión","Gestión de Talento Humano","Gestionar el potencial del talento humano como factor estratégico, para contribuir con el desarrollo de la entidad en un ambiente seguro y saludable","Cobertura de servidores públicos en las actividades del plan de bienestar e incentivos",null,null,"Porcentaje de funcionarios que participan en las actividades del plan de bienestar e incentivos","(No. de funcionarios participantes en las actividades del plan de bienestar e incentivos/Total de funcionarios de la entidad)*100 ","Gestión","Eficacia","Semestral",0.8,"Porcentaje","Registros de asistencia a las actividades del plan de bienestar","Positiva","No",null,2019,"Julio"]
["Mejorar continuamente los procesos del Sistema Integrado de Gestión","Gestión de Talento Humano","Gestionar el potencial del talento humano como factor estratégico, para contribuir con el desarrollo de la entidad en un ambiente seguro y saludable","Cobertura de servidores públicos en las actividades del plan institucional de capacitación",null,null,"Porcentaje de funcionarios que asisten a las actividades del plan institucional de capacitación","(No. de funcionarios asistentes a las actividades del plan institucional de capacitación/Total de funcionarios citados a las actividades del plan institucional de capacitación)*100","Gestión","Eficacia","Semestral",0.8,"Porcentaje","Registros de asistencia a las actividades del plan de capacitación","Positiva","No","Las capacitaciones que se incluyen en el indicador son las que implican recursos.",2019,"Julio"]
["Mejorar continuamente los procesos del Sistema Integrado de Gestión","Gestión de Talento Humano","Gestionar el potencial del talento humano como factor estratégico, para contribuir con el desarrollo de la entidad en un ambiente seguro y saludable","Evaluación del impacto de la capacitación en el desempeño de los servidores públicos y de la entidad",null,null,"Impacto de la capacitación en el desempeño laboral de funcionarios","(No. de funcionarios con capacitaciones efectivas/Total de funcionarios evaluados)*100","Gestión","Eficacia","Trimestral",0.95,"Porcentaje","Consolidado de las evaluaciones de impacto de la capacitación","Positiva","No",null,2019,"Julio"]
["Mejorar continuamente los procesos del Sistema Integrado de Gestión","Gestión de Talento Humano","Gestionar el potencial del talento humano como factor estratégico, para contribuir con el desarrollo de la entidad en un ambiente seguro y saludable","Satisfacción de los servidores públicos frente a las actividades de  bienestar e incentivos","Satisfacción de los servidores públicos frente a las actividades de capacitación",null,"Índice de clima organizacional","Promedio ponderado de las dimensiones evaluadas en la encuesta de medición de clima organizacional","Gestión","Eficacia","Anual",0.8,"Porcentaje","Informe de medición de clima organizacional","Positiva","No","En el análisis del indicador se presentará el resultado desagregado por áreas y/o dependencias, y por las dimensiones evaluadas.",2019,"Julio"]
["Mejorar continuamente los procesos del Sistema Integrado de Gestión","Gestión de Talento Humano","Gestionar el potencial del talento humano como factor estratégico, para contribuir con el desarrollo de la entidad en un ambiente seguro y saludable","Cumplimiento del plan anual de  bienestar e incentivos",null,null,"Porcentaje de ejecución del plan anual de bienestar e incentivos","(No. de actividades de bienestar e incentivos desarrolladas/Total de actividades programadas en el plan anual de bienestar e incentivos)*100","Gestión","Eficacia","Semestral",1,"Porcentaje","Matriz de seguimiento a la ejecución de actividades de bienestar e incentivos","Positiva","Si","La meta es anual con medición y análisis semestral.",2019,"Julio"]
["Mejorar continuamente los procesos del Sistema Integrado de Gestión","Gestión de Talento Humano","Gestionar el potencial del talento humano como factor estratégico, para contribuir con el desarrollo de la entidad en un ambiente seguro y saludable","Cumplimiento del plan institucional de capacitación",null,null,"Porcentaje de ejecución del plan institucional de capacitación","(No. de actividades de capacitación desarrolladas/Total de actividades programadas en el plan institucional de capacitación)*100","Gestión","Eficacia","Semestral",1,"Porcentaje","Matriz de seguimiento a la ejecución de actividades de capacitación","Positiva","Si","La meta es anual con medición y análisis semestral.",2019,"Julio"]
["Prevenir los factores que afecten la salud y seguridad a fin de mejorar las condiciones del ambiente de trabajo","Gestión de Talento Humano","Gestionar el potencial del talento humano como factor estratégico, para contribuir con el desarrollo de la entidad en un ambiente seguro y saludable","Cumplimiento del plan anual de trabajo",null,null,"Porcentaje de ejecución del plan anual de seguridad y salud en el trabajo","(No. de actividades de seguridad y salud desarrolladas/Total de actividades programadas en el plan anual de seguridad y salud en el trabajo)*100","Gestión","Eficacia","Mensual",0.95,"Porcentaje","Plan de trabajo anual del Sistema de Gestión de Seguridad y Salud en el Trabajo","Positiva","No",null,2019,"Julio",201,222,0.90540540540540537,0.95305832147937408,{"$f":"_xlfn.IFS(W543<=69%,\"Crítico\",W543>=90%,\"Aceptable\",W543>=70%,\"Tolerable\")","v":"Aceptable"}]
["Prevenir los factores que afecten la salud y seguridad a fin de mejorar las condiciones del ambiente de trabajo","Gestión de Talento Humano","Gestionar el potencial del talento humano como factor estratégico, para contribuir con el desarrollo de la entidad en un ambiente seguro y saludable","Tasa de accidentalidad",null,null,"Tasa de accidentalidad","(No. de accidentes de trabajo reportados/Total de trabajadores (funcionarios y contratistas)*100","Gestión","Efectividad","Mensual",0.04,"Porcentaje","Matriz de accidentes de trabajo","Negativa","No","La meta está configurada como menor o igual a 4%.",2019,"Julio",68,3199,2.1256642700844014E-2,{"$f":"((L544-V544)+L544)/L544","v":1.4685839324788996},"Aceptable"]
["Prevenir los factores que afecten la salud y seguridad a fin de mejorar las condiciones del ambiente de trabajo","Gestión de Talento Humano","Gestionar el potencial del talento humano como factor estratégico, para contribuir con el desarrollo de la entidad en un ambiente seguro y saludable","Incidencia y prevalencia de enfermedades laborales",null,null," Prevalencia de la enfermedad laboral","(No. de casos de enfermedad laboral calificada/Total de funcionarios)*100","Gestión","Efectividad","Trimestral",0.02,"Porcentaje","Matriz de seguimiento de enfermedades laborales","Negativa","No","La meta está configurada como menor o igual a 2%.",2019,"Julio"]
["Prevenir los factores que afecten la salud y seguridad a fin de mejorar las condiciones del ambiente de trabajo","Gestión de Talento Humano","Gestionar el potencial del talento humano como factor estratégico, para contribuir con el desarrollo de la entidad en un ambiente seguro y saludable","Incidencia y prevalencia de enfermedades laborales",null,null,"Incidencia de la enfermedad laboral","(No. de casos nuevos de enfermedad laboral calificados/Total de funcionarios)*100","Gestión","Efectividad","Trimestral",0.01,"Porcentaje","Matriz de seguimiento de enfermedades laborales","Negativa","No","La meta está configurada como menor o igual a 1%.",2019,"Julio"]
["Mejorar continuamente los procesos del Sistema Integrado de Gestión","Gestión de Recursos Físicos","Administrar y controlar los bienes muebles y servicios para el funcionamiento administrativo de la entidad","Confiabilidad del inventario de bienes devolutivos",null,null,"Porcentaje de inventario individual validado físicamente","(No. de elementos devolutivos del inventario individual validados físicamente/Total de elementos devolutivos del inventario individual registrados en el sistema de información SEVEN)*100 ","Gestión","Eficacia","Anual",1,"Porcentaje","Sistema de información SEVEN","Positiva","No",null,2019,"Julio"]
["Mejorar continuamente los procesos del Sistema Integrado de Gestión","Gestión de Recursos Físicos","Administrar y controlar los bienes muebles y servicios para el funcionamiento administrativo de la entidad","Confiabilidad del inventario de bienes devolutivos",null,null,"Porcentaje de inventario aleatorio validado físicamente en bodega","(No. de elementos devolutivos y de consumo en bodegas validados físicamente/Muestra de inventario de elementos devolutivos y de consumo registrados en el sistema de información SEVEN)*100 ","Gestión","Eficacia","Trimestral",1,"Porcentaje","Sistema de información SEVEN","Positiva","No",null,2019,"Julio"]
["Mejorar continuamente los procesos del Sistema Integrado de Gestión","Gestión de Asuntos Locales","Desarrollar acciones a nivel local para promover la participación ciudadana, brindar acompañamiento a las alcaldías locales en temas misionales de la entidad y ofertar sus programas","Cumplimiento de los compromisos adquiridos por la entidad, en el marco de las instancias de participación locales",null,null,"Porcentaje de compromisos atendidos en el marco de las instancias de participación locales","(No. de compromisos atendidos en las instancias Consejo Local de Gobierno, Unidad de Apoyo Técnico y Comisión Local Intersectorial de Participación /Total de compromisos generados en las instancias Consejo Local de Gobierno, Unidad de Apoyo Técnico y Comisión Local Intersectorial de Participación)*100","Gestión","Eficacia","Trimestral",1,"Porcentaje","Matriz de seguimiento a compromisos derivados de instancias de participación locales","Positiva","No",null,2019,"Julio"]
["Mejorar continuamente los procesos del Sistema Integrado de Gestión","Gestión de Asuntos Locales","Desarrollar acciones a nivel local para promover la participación ciudadana, brindar acompañamiento a las alcaldías locales en temas misionales de la entidad y ofertar sus programas","Efectividad en la atención de la demanda de actividades recreodeportivas en las localidades de Bogotá",null,null,"Porcentaje de actividades recreativas programadas por asuntos locales","(No. de actividades recreativas programadas en la plataforma SIM por los gestores locales/Total de actividades recreativas solicitadas por Promoción de la Recreación)*100","Gestión","Eficacia","Mensual",1,"Porcentaje","Sistema de información misional - SIM\nCuadro de metas de actividades recreativas","Positiva","No",null,2019,"Julio",3193,2604,1.2261904761904763,{"$f":"+V550/L550","v":1.2261904761904763},"Aceptable"]
["Mejorar continuamente los procesos del Sistema Integrado de Gestión","Gestión de Asuntos Locales","Desarrollar acciones a nivel local para promover la participación ciudadana, brindar acompañamiento a las alcaldías locales en temas misionales de la entidad y ofertar sus programas","Efectividad en la atención de la demanda de actividades recreodeportivas en las localidades de Bogotá",null,null,"Porcentaje de beneficiarios inscritos por asuntos locales en actividades deportivas","(No. de beneficiarios inscritos en actividades deportivas por los gestores locales/Total de beneficiarios de actividades deportivas programados por Fomento al Deporte)*100","Gestión","Eficacia","Trimestral",1,"Porcentaje","Reporte de las distintas plataformas para inscripciones\nCuadro de metas de actividades deportivas","Positiva","No",null,2019,"Julio"]
["Mejorar continuamente los procesos del Sistema Integrado de Gestión","Gestión de Asuntos Locales","Desarrollar acciones a nivel local para promover la participación ciudadana, brindar acompañamiento a las alcaldías locales en temas misionales de la entidad y ofertar sus programas","Cumplimiento de lineamientos y criterios de elegibilidad y viabilidad de los proyectos de contratación",null,null,"Porcentaje de asistencias técnicas realizadas a los Fondos de Desarrollo Local","(No. de asistencias técnicas realizadas a los Fondos de Desarrollo Local/Total de asistencias técnicas programadas a los Fondos de Desarrollo Local en las cuatro líneas de inversión)*100","Gestión","Eficacia","Trimestral",1,"Porcentaje","Cronograma de asistencias técnicas a los Fondos de Desarrollo Local","Positiva","No",null,2019,"Julio"]
["Mejorar continuamente los procesos del Sistema Integrado de Gestión","Gestión de Asuntos Locales","Desarrollar acciones a nivel local para promover la participación ciudadana, brindar acompañamiento a las alcaldías locales en temas misionales de la entidad y ofertar sus programas","Ejecución de los proyectos con recursos de los fondos de desarrollo local, en concordancia con el concepto previo y favorable emitido por la entidad",null,null,"Porcentaje de proyectos viabilizados con seguimiento efectuado","(No. de proyectos contratados con seguimiento efectuado/Total de proyectos viabilizados con contratación por parte de los Fondos de Desarrollo Local)*100","Gestión","Eficacia","Trimestral",1,"Porcentaje","SECOP\nInforme de seguimiento a viabilidades","Positiva","No",null,2019,"Julio"]
["Mejorar continuamente los procesos del Sistema Integrado de Gestión","Control Disciplinario","Investigar conductas presuntamente disciplinables e imponer sanciones cuando haya lugar, tanto a servidores como a ex-servidores públicos de la entidad, con el fin de que éstos cumplan con sus deberes y funciones","Cumplimiento de los términos legales en las distintas etapas procesales",null,null,"Porcentaje de procesos disciplinarios resueltos de fondo","(No. de procesos disciplinarios decididos de fondo/Total de procesos disciplinarios activos)*100","Gestión","Eficacia","Semestral",0.6,"Porcentaje","Matriz de autos","Positiva","No",null,2019,"Julio"]
["Mejorar continuamente los procesos del Sistema Integrado de Gestión","Control Disciplinario","Investigar conductas presuntamente disciplinables e imponer sanciones cuando haya lugar, tanto a servidores como a ex-servidores públicos de la entidad, con el fin de que éstos cumplan con sus deberes y funciones","Garantía del debido proceso en las distintas etapas procesales",null,null,"Porcentaje de procesos disciplinarios sin nulidades decretadas","(No. de procesos disciplinarios sin nulidades decretadas/Total de procesos disciplinarios activos)*100 ","Gestión","Eficacia","Trimestral",1,"Porcentaje","Matriz de autos","Positiva","No",null,2019,"Julio"]
["Mejorar continuamente los procesos del Sistema Integrado de Gestión","Control Disciplinario","Investigar conductas presuntamente disciplinables e imponer sanciones cuando haya lugar, tanto a servidores como a ex-servidores públicos de la entidad, con el fin de que éstos cumplan con sus deberes y funciones","Cumplimiento de los términos legales en las distintas etapas procesales",null,null,"Porcentaje de procesos disciplinarios sin vencimiento de términos","(No. de procesos disciplinarios sin vencimiento de términos/Total de procesos disciplinarios activos)*100","Gestión","Calidad","Trimestral",1,"Porcentaje","Expediente del proceso disciplinario ","Positiva","No",null,2019,"Julio"]
["Mejorar continuamente los procesos del Sistema Integrado de Gestión","Administración y Mantenimiento de Parques y Escenarios","Ofrecer parques y escenarios del Sistema Distrital para el uso y disfrute de la comunidad general, gestionando la sostenibilidad física, social, ambiental y económica","Uso de parques y escenarios con motivación económica que generen recursos para el mantenimiento de los mismos",null,null,"Aprovechamiento económico de parques y/o escenarios","(Ingresos del mes + acumulado de los ingresos del mes anterior/Total presupuesto anual)*100","Gestión","Eficiencia","Mensual",1,"Porcentaje","Sistema de información SEVEN","Positiva","Si","La meta es anual con medición y análisis mensual.\n\nEn el análisis del indicador se presentará la desagregación del aprovechamiento económico por tipo de parque y/o escenario, expresado en ingresos y participación porcentual.",2019,"Julio",13807548,22044017,{"$f":"+T557/U557","v":0.62636260895643481},0.62636260895643481]
["Satisfacer las necesidades de los usuarios a través de la prestación de servicios eficientes, eficaces y efectivos","Administración y Mantenimiento de Parques y Escenarios","Ofrecer parques y escenarios del Sistema Distrital para el uso y disfrute de la comunidad general, gestionando la sostenibilidad física, social, ambiental y económica","Satisfacción de los usuarios con las actividades de mantenimiento preventivo y correctivo",null,null,"Satisfacción de los usuarios con las obras de mantenimiento de nuevas tendencias","(No. de usuarios satisfechos con las obras de mantenimiento realizadas/Total de usuarios de parques y escenarios encuestados para obras de mantenimiento de nuevas tendencias)*100","Gestión","Efectividad","Anual",0.9,"Porcentaje","Encuesta de satisfacción con las obras de mantenimiento de nuevas tendencias","Positiva","No","En el análisis del indicador se presentará el resultado desagregado por cada uno de los aspectos evaluados en la encuesta de satisfacción.",2019,"Julio"]
["Mejorar continuamente los procesos del Sistema Integrado de Gestión","Administración y Mantenimiento de Parques y Escenarios","Ofrecer parques y escenarios del Sistema Distrital para el uso y disfrute de la comunidad general, gestionando la sostenibilidad física, social, ambiental y económica","Oportunidad y cumplimiento en la generación de compromisos o acuerdos ciudadanos frente al uso y sostenibilidad de los parques administrados",null,null,"Porcentaje de cumplimiento en acuerdos de sostenibilidad social de parques","(No. de compromisos gestionados/Total de compromisos adquiridos mediante acuerdos ciudadanos en parques)*100","Gestión","Eficacia","Trimestral",1,"Porcentaje","Matriz de seguimiento a compromisos o acuerdos ciudadanos","Positiva","No",null,2019,"Julio"]
["Mejorar continuamente los procesos del Sistema Integrado de Gestión","Administración y Mantenimiento de Parques y Escenarios","Ofrecer parques y escenarios del Sistema Distrital para el uso y disfrute de la comunidad general, gestionando la sostenibilidad física, social, ambiental y económica","Disponibilidad de los equipamientos en parques y escenarios","Cumplimiento de las especificaciones técnicas en las actividades de mantenimiento preventivo y correctivo","Cobertura en el mantenimiento de parques y escenarios de acuerdo con la priorización","Porcentaje de avance en la ejecución de contratos de obras de mantenimiento o recuperación","(Porcentaje contrato 1 + Porcentaje contrato 2 +...+ Porcentaje contrato n)/Total de contratos de obras de mantenimiento o recuperación en ejecución\nDonde: \nPorcentaje contrato n = Avance físico ejecutado/Avance físico programado\nn = Número de contratos de obras de mantenimiento o recuperación en ejecución","Gestión","Eficacia","Bimestral",0.9,"Porcentaje","Informes mensuales de interventoría presentados según programación de los contratistas","Positiva","No",null,2019,"Julio"]
["Satisfacer las necesidades de los usuarios a través de la prestación de servicios eficientes, eficaces y efectivos","Diseño y Construcción de Parques y Escenarios","Ampliar y mejorar la infraestructura física recreativa y deportiva del Distrito Capital para el uso de la comunidad en general","Cumplimiento de requisitos técnicos, administrativos, financieros y jurídicos de los proyectos",null,null,"Satisfacción de los usuarios con las obras de construcción y/o adecuación entregadas","(No. de usuarios satisfechos con las obras de construcción y/o adecuación entregadas /Total de usuarios encuestados por proyecto)*100","Gestión","Efectividad","Anual",0.9,"Porcentaje","Resultados de la encuesta de satisfacción entregados por los contratistas de obra","Positiva","No","En el análisis del indicador se presentará el resultado desagregado por cada uno de los aspectos evaluados en la encuesta de satisfacción.",2019,"Julio"]
["Mejorar continuamente los procesos del Sistema Integrado de Gestión","Diseño y Construcción de Parques y Escenarios","Ampliar y mejorar la infraestructura física recreativa y deportiva del Distrito Capital para el uso de la comunidad en general","Oportunidad en el seguimiento y adopción de medidas durante el seguimiento de la estabilidad de la obra","Cumplimiento de especificaciones técnicas conforme a lo establecido en la etapa de construcción",null,"Porcentaje de fallas de calidad o estabilidad de obra atendidas en construcción y adecuación de parques y escenarios","(No. de fallas de calidad o estabilidad de obra atendidas/Total de fallas de calidad o estabilidad de obra detectadas o reportadas por terceros)*100\n\nAtendido = Se genera requerimiento al contratista para establecer compromisos de reparación.","Gestión","Eficacia","Trimestral",0.9,"Porcentaje","Actas de visita o reconocimiento de estabilidad de obra \nActa de compromiso de reparación constructiva\nProgramación de visita\nComunicación oficial- notificación de fallas visita de inspección por estabilidad \nActa de verificación de reparación constructiva","Positiva","No","En el análisis del indicador se presentará la desagregación por parque y escenario.",2019,"Julio"]
["Mejorar continuamente los procesos del Sistema Integrado de Gestión","Diseño y Construcción de Parques y Escenarios","Ampliar y mejorar la infraestructura física recreativa y deportiva del Distrito Capital para el uso de la comunidad en general","Cumplimiento de requisitos técnicos, administrativos, financieros y jurídicos de los proyectos","Oportunidad en el seguimiento y adopción de medidas durante la ejecución de las obras","Cumplimiento del alcance de las obras conforme a los estudios y diseños, especificaciones técnicas y normatividad vigente","Porcentaje de avance en la ejecución de obras de construcción y adecuación de parques y escenarios","((%Ejecutado Obra 1*Plazo de ejecución Obra 1)+(%Ejecutado Obra 2*Plazo de ejecución Obra 2) +...+ (%Ejecutado Obra n*Plazo de ejecución Obra n))/((%Programado Obra 1*Plazo de ejecución Obra 1)+(%Programado Obra 2*Plazo de ejecución Obra 2) +...+ (%Programado Obra n*Plazo de ejecución Obra n))\nDonde:\nn = Número de obras en ejecución","Gestión","Eficacia","Mensual",0.9,"Porcentaje","Informes mensuales de interventoría\n\nInformes mensuales de supervisión","Positiva","No","En el análisis del indicador se presentará la desagregación por parque y escenario.",2019,"Julio",50.49,54.73,0.9225287776356661,1.0250319751507402,{"$f":"_xlfn.IFS(W563<=69%,\"Crítico\",W563>=90%,\"Aceptable\",W563>=70%,\"Tolerable\")","v":"Aceptable"}]
["Mejorar continuamente los procesos del Sistema Integrado de Gestión","Diseño y Construcción de Parques y Escenarios","Ampliar y mejorar la infraestructura física recreativa y deportiva del Distrito Capital para el uso de la comunidad en general","\nCumplimiento de requisitos técnicos, administrativos, financieros y legales de los proyectos de estudios y diseños","Oportunidad en el seguimiento y adopción de medidas durante la ejecución de los proyectos de estudios y diseños","Cumplimiento del alcance de los proyectos de estudios y diseños conforme a las necesidades identificadas","Porcentaje de avance en la ejecución de proyectos de estudios y/o diseños de parques y escenarios","(Porcentaje proyecto 1 + Porcentaje proyecto 2 +...+ Porcentaje proyecto n)/Total de proyectos de estudios y/o diseños en ejecución\nDonde: \nPorcentaje proyecto n =(Avance ejecutado de estudios y/o diseños/Avance programado de estudios y/o diseños al corte según forma de pago)\nn = Número de proyectos de estudios y/o diseños en ejecución","Gestión","Eficacia","Mensual",0.9,"Porcentaje","Informes mensuales de interventoría\n\nInformes mensuales de supervisión","Positiva","No","En el análisis del indicador se presentará la desagregación por proyecto.",2019,"Julio",91.78,99.81,0.91954713956517387,1.0217190439613042,"Aceptable"]
["Mejorar continuamente los procesos del Sistema Integrado de Gestión","Gestión Jurídica","Ejercer la defensa judicial y extrajudicial de la entidad y atender requerimientos jurídicos, para salvaguardar sus intereses y cumplir con los requisitos constitucionales y legales","Intervención oportuna en las distintas actuaciones judiciales y extrajudiciales en que sea parte la entidad","Oportunidad en el seguimiento a los procesos en los despachos e instancias judiciales",null,"Porcentaje de procesos judiciales y extrajudiciales atendidos dentro de los términos legales vigentes","(No. de procesos jurídicos atendidos dentro de los términos legales vigentes)/Total de procesos jurídicos notificados)*100","Gestión","Calidad","Trimestral",1,"Porcentaje","SIPROJ Web\nORFEO","Positiva","No","En el análisis del indicador se presentará la desagregación por procesos judiciales y extrajudiciales.",2019,"Julio"]
["Satisfacer las necesidades de los usuarios a través de la prestación de servicios eficientes, eficaces y efectivos","Gestión Jurídica","Ejercer la defensa judicial y extrajudicial de la entidad y atender requerimientos jurídicos, para salvaguardar sus intereses y cumplir con los requisitos constitucionales y legales","Cumplimiento de los requisitos establecidos para el reconocimiento deportivo y el aval de escuelas deportivas",null,null,"Satisfacción de los usuarios con el trámite de reconocimiento deportivo","(No. de usuarios satisfechos con el trámite de reconocimiento deportivo/Total de usuarios encuestados)*100","Gestión","Efectividad","Semestral",0.95,"Porcentaje","Encuesta de satisfacción de usuarios de reconocimiento deportivo","Positiva","No","En el análisis del indicador se presentarán los resultados desagregados por cada uno de los aspectos evaluados en la encuesta de satisfacción.",2019,"Julio"]
["Mejorar continuamente los procesos del Sistema Integrado de Gestión","Gestión Jurídica","Ejercer la defensa judicial y extrajudicial de la entidad y atender requerimientos jurídicos, para salvaguardar sus intereses y cumplir con los requisitos constitucionales y legales","Oportunidad en la respuesta del trámite de otorgamiento deportivo (45 días hábiles siguientes al cumplimiento de requisitos de otorgamiento deportivo)","Vigencia y aplicabilidad de la normatividad empleada para el reconocimiento deportivo y el aval de escuelas deportivas",null,"Porcentaje de trámites de reconocimiento deportivo atendidos dentro del término legal vigente","(No. de trámites de reconocimiento deportivo atendidos dentro del término legal vigente/Total de trámites de reconocimiento deportivo atendidos)*100 ","Gestión","Calidad","Trimestral",0.92,"Porcentaje","Matriz de control de reconocimiento deportivo","Positiva","No",null,2019,"Julio"]
["Mejorar continuamente los procesos del Sistema Integrado de Gestión","Gestión Jurídica","Ejercer la defensa judicial y extrajudicial de la entidad y atender requerimientos jurídicos, para salvaguardar sus intereses y cumplir con los requisitos constitucionales y legales","Oportunidad en la respuesta del trámite de aval de escuelas deportivas (58 días hábiles)","Vigencia y aplicabilidad de la normatividad empleada para el reconocimiento deportivo y el aval de escuelas deportivas",null,"Porcentaje de trámites de aval de escuelas deportivas atendidos dentro del término legal vigente","(No. de trámites de aval de escuelas deportivas atendidos dentro del término legal vigente/Total de trámites de aval de escuelas deportivas atendidos)*100","Gestión","Calidad","Trimestral",0.92,"Porcentaje","Matriz de control de aval de escuelas deportivas","Positiva","No",null,2019,"Julio"]
["Mejorar continuamente los procesos del Sistema Integrado de Gestión","Gestión Jurídica","Ejercer la defensa judicial y extrajudicial de la entidad y atender requerimientos jurídicos, para salvaguardar sus intereses y cumplir con los requisitos constitucionales y legales","Oportunidad en la respuesta a conceptos de proyectos de acuerdo con los tiempos establecidos","Suministro oportuno de la información de carácter técnico, de oportunidad y conveniencia del proyecto por parte de las dependencias y áreas de la entidad",null,"Porcentaje de solicitudes de concepto a proyectos de acuerdo, decreto o ley atendidas dentro del tiempo establecido","(No. de solicitudes de concepto a proyectos de acuerdo, decreto o ley atendidas dentro del tiempo establecido/Total de solicitudes de concepto a proyectos de acuerdo, decreto o ley recibidas)*100","Gestión","Calidad","Semestral",0.9,"Porcentaje","Matriz de seguimiento a solicitudes Congreso y Concejo","Positiva","No","En el análisis del indicador se presentará la desagregación por proyectos de acuerdo, decreto y ley.",2019,"Julio"]
["Mejorar continuamente los procesos del Sistema Integrado de Gestión","Gestión Jurídica","Ejercer la defensa judicial y extrajudicial de la entidad y atender requerimientos jurídicos, para salvaguardar sus intereses y cumplir con los requisitos constitucionales y legales","Recuperación de la cartera en mora",null,null,"Porcentaje de procesos de cobro de cartera efectuados","(No. de procesos con etapas de cobro efectuadas/Total de procesos de cobro remitidos con documentación completa)*100","Gestión","Eficacia","Cuatrimestral",1,"Porcentaje","Matriz de seguimiento cobro de cartera","Positiva","No","Los primeros cinco días hábiles de mayo se reportará el indicador con corte a 31 de diciembre del año anterior. \nLos primeros días de septiembre se reportará con corte 30 de abril de la vigencia.\nLos primeros días de enero se reportará con corte a 31 de agosto del año anterior.\nEn el análisis del indicador se presentará la desagregación por etapa (persuasivo y coactivo), así como también el porcentaje de recuperación de cartera.",2019,"Julio"]
["Mejorar continuamente los procesos del Sistema Integrado de Gestión","Gestión Jurídica","Ejercer la defensa judicial y extrajudicial de la entidad y atender requerimientos jurídicos, para salvaguardar sus intereses y cumplir con los requisitos constitucionales y legales","Intervención oportuna en las distintas actuaciones judiciales y extrajudiciales en que sea parte la entidad - tipos de daño en que se resulte demandado o condenado",null,null,"Índice de condenas adversas","(No. de condenas adversas/Total de procesos judiciales)*100","Gestión","Calidad","Semestral",0.08,"Porcentaje","Informe Siproj web mensual (procesos judiciales)","Negativa","No","El análisis del indicador debe evaluar dentro del comité de conciliación los procesos que cursen o hayan cursado en contra de la entidad, determinando causas generadoras de conflictos y los tipos de daño.",2019,"Julio"]
["Mejorar continuamente los procesos del Sistema Integrado de Gestión","Gestión de Comunicaciones","Dar a conocer interna y externamente las actividades, programas y obras que realiza la entidad, para generar apropiación y participación que contribuyan al posicionamiento de la imagen institucional","Exigencia de la solicitud de servicios para todos los procesos con la información completa y detallada de lo requerido","Veracidad de la información reportada por los solicitantes del servicio ",null,"Porcentaje de solicitudes de servicios de comunicaciones atendidas dentro de los tiempos establecidos","(No. de solicitudes de servicio atendidas dentro de los tiempos establecidos/Total de solicitudes de servicio de comunicaciones recibidas)*100","Gestión","Calidad","Trimestral",0.9,"Porcentaje","Consolidado de solicitudes de servicios de comunicaciones","Positiva","No",null,2019,"Julio"]
["Mejorar continuamente los procesos del Sistema Integrado de Gestión","Gestión de Comunicaciones","Dar a conocer interna y externamente las actividades, programas y obras que realiza la entidad, para generar apropiación y participación que contribuyan al posicionamiento de la imagen institucional","Relacionamiento con medios de comunicación","Análisis de los resultados obtenidos mediante el monitoreo de medios para facilitar la toma de decisiones",null,"Impacto de noticias publicadas en medios de comunicación","(No. de noticias positivas o neutras registradas/Total de noticias publicadas en medios de comunicación)*100","Gestión","Eficacia","Trimestral",1,"Porcentaje","Informes mensuales generados por la empresa contratada para realizar el monitoreo de medios","Positiva","No","En el análisis del indicador se presentará el resultado desagregado de noticias positivas y neutras, indicando los principales medios de comunicación.\nSe colocó una meta de 100%, mientras se levanta la línea base con la primera medición.",2019,"Julio"]
["Mejorar continuamente los procesos del Sistema Integrado de Gestión","Gestión de Comunicaciones","Dar a conocer interna y externamente las actividades, programas y obras que realiza la entidad, para generar apropiación y participación que contribuyan al posicionamiento de la imagen institucional","Seguimiento a los cambios en las condiciones de publicación en redes sociales y página web",null,null,"Tasa de variación en el alcance total de las publicaciones en redes sociales","((Alcance total de publicaciones en el trimestre actual - Alcance total de publicaciones en el trimestre anterior)/Alcance total de publicaciones en el trimestre anterior)*100\n\nDonde:\n\nAlcance total de las publicaciones = Total de usuarios que vieron las publicaciones de redes sociales","Gestión","Eficacia","Trimestral",0.2,"Porcentaje","Métricas nativas de cada red social","Positiva","No","En el análisis del indicador se presentará el resultado desagregado del alcance de las publicaciones por cada red social. ",2019,"Julio"]
["Mejorar continuamente los procesos del Sistema Integrado de Gestión","Gestión de Comunicaciones","Dar a conocer interna y externamente las actividades, programas y obras que realiza la entidad, para generar apropiación y participación que contribuyan al posicionamiento de la imagen institucional","Análisis de los resultados obtenidos mediante el monitoreo de medios para facilitar la toma de decisiones",null,null,"Salidas publicadas en medios de comunicación","N/A","Gestión","Eficacia","Mensual",80,"Número","Informes mensuales generados por la empresa contratada para realizar el monitoreo de medios","Positiva","No","En el análisis del indicador se presentará el valor estimado de las publicaciones en medios de comunicación.",2019,"Julio",186,1,{"$f":"+T575/U575","v":186},{"$f":"+V575/L575","v":2.3250000000000002},{"$f":"_xlfn.IFS(W575<=69%,\"Crítico\",W575>=90%,\"Aceptable\",W575>=70%,\"Tolerable\")","v":"Aceptable"}]
["Mejorar continuamente los procesos del Sistema Integrado de Gestión","Planeación de la Gestión","Establecer directrices para formular y realizar seguimiento a la planeación estratégica y operativa de la entidad con el propósito de contribuir al desarrollo de la misión y objetivos institucionales, así como facilitar la oportunidad y cumplimiento de los resultados esperados","Oportunidad, veracidad y calidad de la información de inversión y gestión",null,null,"Porcentaje de reportes de información presentados dentro de los tiempos programados","(No. de reportes de información elaborados y presentados/Total de reportes de información programados)*100","Gestión","Calidad","Trimestral",1,"Porcentaje","Cronograma de trabajo interno, plan operativo por dependencias (Oficina Asesora de Planeación), plan de adecuación y sostenibilidad SIGD-MIPG","Positiva","No","En el análisis del indicador se desagregará la programación para cada trimestre.",2019,"Agosto"]
["Mejorar continuamente los procesos del Sistema Integrado de Gestión","Planeación de la Gestión","Establecer directrices para formular y realizar seguimiento a la planeación estratégica y operativa de la entidad con el propósito de contribuir al desarrollo de la misión y objetivos institucionales, así como facilitar la oportunidad y cumplimiento de los resultados esperados","Oportunidad en el seguimiento de las acciones institucionales para la mejora (correcciones, acciones correctivas, oportunidades de mejora, acciones para abordar riesgos)",null,null,"Porcentaje de acciones de mejora con seguimiento efectuado dentro del Sistema de Gestión","[No. de acciones de mejora con seguimiento efectuado dentro del tiempo programado/Total de acciones de mejora abiertas dentro del Sistema de Gestión de la Calidad (correcciones, acciones correctivas, oportunidades de mejora, acciones para abordar riesgos)]*100","Gestión","Eficacia","Mensual",1,"Porcentaje","Isolución","Positiva","No","En el análisis del indicador se presentará el resultado desagregado por cada tipología de mejora (corrección, acciones correctivas, oportunidades de mejora, acciones para abordar riesgos).",2019,"Agosto",27,27,1,{"$f":"+V577/L577","v":1},"Aceptable"]
["Mejorar continuamente los procesos del Sistema Integrado de Gestión","Gestión de Recursos Físicos","Administrar y controlar los bienes muebles y servicios para el funcionamiento administrativo de la entidad","Oportunidad en la atención de requerimientos y necesidades de servicios administrativos",null,null,"Porcentaje de mantenimientos realizados a la infraestructura física de la sede administrativa","(No. de mantenimientos realizados a la infraestructura física/Total de mantenimientos programados a la infraestructura física de la sede administrativa)*100","Gestión","Eficacia","Trimestral",0.9,"Porcentaje","Expendientes contractuales en plataforma ORFEO","Positiva","No",null,2019,"Agosto"]
["Mejorar continuamente los procesos del Sistema Integrado de Gestión","Gestión de Asuntos Locales","Desarrollar acciones a nivel local para promover la participación ciudadana, brindar acompañamiento a las alcaldías locales en temas misionales de la entidad y ofertar sus programas","Oportunidad en la emisión del concepto previo y favorable según los tiempos establecidos en la normatividad vigente",null,null,"Porcentaje de conceptos previos tramitados dentro de los términos legales vigentes","(No. de conceptos previos tramitados dentro de los términos legales vigentes/Total de solicitudes de conceptos previos recibidas)*100","Gestión","Calidad","Trimestral",0.5,"Porcentaje","Matriz de seguimiento a conceptos previos tramitados","Positiva","No",null,2019,"Agosto"]
["Mejorar continuamente los procesos del Sistema Integrado de Gestión","Control, Evaluación y Seguimiento","Evaluar los controles y la gestión de la entidad con el fin de identificar e implementar acciones de mejora, en pro de la sostenibilidad del Sistema de Control Interno","Pertinencia y oportunidad en la entrega de los resultados del seguimiento a las partes interesadas","Oportunidad y calidad en la información reportada a las entidades competentes del orden nacional y distrital",null,"Porcentaje de informes presentados por la tercera línea de defensa dentro de los tiempos programados","(No. de informes de ley y de gestión elaborados y presentados dentro de los tiempos programados/Total de informes de ley y de gestión a cargo de la tercera línea de defensa )*100  ","Gestión","Calidad","Trimestral",1,"Porcentaje","Plan anual de auditoría\nCronograma presentación de informes","Positiva","No","En el análisis del indicador se presentará el resultado desagregado por cada uno de los informes realizados.",2019,"Agosto"]
["Mejorar continuamente los procesos del Sistema Integrado de Gestión","Control, Evaluación y Seguimiento","Evaluar los controles y la gestión de la entidad con el fin de identificar e implementar acciones de mejora, en pro de la sostenibilidad del Sistema de Control Interno","Cumplimiento de los objetivos definidos en el plan de auditoría conforme al plan de pruebas","Cobertura de las unidades a auditar de acuerdo con los parámetros establecidos en la matriz de priorización, en concordancia con los recursos disponibles para la ejecución del Plan Anual de Auditoría",null,"Índice de eficacia de auditorías internas de control interno","(Índice auditoría 1 + índice auditoría 2 +...+Índice auditoría n)/Total de auditorías realizadas\nDonde: \nÍndice auditoría n = Calificación porcentual de la variable Objetivos Específicos*Peso de la variable Objetivos Específicos + Calificación porcentual de la variable Actividad Plan de Auditoría*Peso de la variable Actividad Plan de Auditoría + Calificación porcentual de la variable Oportunidad*Peso de la variable Oportunidad\nPesos de las variables:\nObjetivos Específicos = 40%\nActividades Plan de Auditoría = 30%\nOportunidad = 30%. Esta se medirá tomando como fecha de referencia la de emisión del informe preliminar de auditoría.\nn = número de auditorías realizadas","Gestión","Eficacia","Trimestral",0.85,"Porcentaje","Planes de cada una de las auditorías","Positiva","No","En el análisis del indicador se presentará el resultado desagregado por cada una de las auditorías realizadas.",2019,"Agosto"]
["Mejorar continuamente los procesos del Sistema Integrado de Gestión","Gestión Financiera","Administrar los recursos financieros asignados y realizar los respectivos registros, para el cumplimiento de las funciones de la entidad y pago de sus obligaciones con terceros","Oportunidad en el seguimiento de las partidas pendientes por conciliar",null,null,"Porcentaje de partidas conciliatorias identificadas dentro del tiempo establecido","(No. de partidas conciliatorias identificadas con edad inferior a 60 días/Total de partidas reportadas)*100","Gestión","Calidad","Mensual",0.9,"Porcentaje","Sistema de información SEVEN","Positiva","No",null,2019,"Agosto",12,12,1,1.1111111111111112,"Aceptable"]
["Mejorar continuamente los procesos del Sistema Integrado de Gestión","Gestión Financiera","Administrar los recursos financieros asignados y realizar los respectivos registros, para el cumplimiento de las funciones de la entidad y pago de sus obligaciones con terceros","Oportunidad e integridad de la información necesaria para realizar las diferentes conciliaciones",null,null,"Porcentaje de obligaciones contingentes registradas correctamente en la contabilidad","(No. de procesos registrados correctamente en la contabilidad/Total de procesos reportados en SIPROJ Web)*100","Gestión","Calidad","Trimestral",1,"Porcentaje","Sistema de información SEVEN","Positiva","No",null,2019,"Agosto"]
["Mejorar continuamente los procesos del Sistema Integrado de Gestión","Gestión Financiera","Administrar los recursos financieros asignados y realizar los respectivos registros, para el cumplimiento de las funciones de la entidad y pago de sus obligaciones con terceros","Oportunidad en la presentación de informes y estados financieros a los diferentes entes de vigilancia y control",null,null,"Porcentaje de notas a los estados financieros reveladas correctamente","(No. de notas sin observaciones por parte de los órganos de control internos y externos/Total de notas a los estados financieros elaboradas)*100","Gestión","Calidad","Anual",0.95,"Porcentaje","Informes de entes de control y vigilancia","Positiva","No",null,2019,"Agosto"]
["Mejorar continuamente los procesos del Sistema Integrado de Gestión","Gestión Financiera","Administrar los recursos financieros asignados y realizar los respectivos registros, para el cumplimiento de las funciones de la entidad y pago de sus obligaciones con terceros","Oportunidad en la presentación de informes y estados financieros a los diferentes entes de vigilancia y control","Oportunidad en la presentación de las declaraciones tributarias",null,"Porcentaje de informes financieros presentados a los entes de vigilancia y control dentro de los términos legales vigentes","(No. de informes financieros presentados dentro de los términos legales vigentes/Total de informes financieros a reportar a los entes de vigilancia y control)*100","Gestión","Calidad","Trimestral",1,"Porcentaje","Matriz de seguimiento a la presentación de informes ","Positiva","No",null,2019,"Agosto"]
["Satisfacer las necesidades de los usuarios a través de la prestación de servicios eficientes, eficaces y efectivos","Promoción de la Recreación","Desarrollar actividades recreativas en función de las características y necesidades de la población de Bogotá D.C., para promover el aprovechamiento del tiempo libre y el mejoramiento en la calidad de vida","Satisfacción del usuario con las actividades recreativas realizadas",null,null,"Satisfacción de los usuarios con los eventos y/o programas recreativos","(No. de usuarios satisfechos con los eventos y/o programas recreativos/Total de usuarios de eventos y/o programas recreativos encuestados)*100","Gestión","Efectividad","Anual",1,"Porcentaje","Encuesta de satisfacción sobre eventos y/o programas recreativos","Positiva","No","En el análisis del indicador se presentará el resultado desagregado por programa y por cada uno de los aspectos evaluados en la encuesta de satisfacción.\nSe colocó una meta de 100%, mientras se levanta la línea base con la primera medición.",2019,"Agosto"]
["Mejorar continuamente los procesos del Sistema Integrado de Gestión","Promoción de la Recreación","Desarrollar actividades recreativas en función de las características y necesidades de la población de Bogotá D.C., para promover el aprovechamiento del tiempo libre y el mejoramiento en la calidad de vida","Cumplimiento del programa de actividades recreativas, teniendo en cuenta lo establecido en las fichas técnicas o según lo concertado con la comunidad e instituciones",null,null,"Porcentaje de actividades recreativas que cumplen con los requisitos para su ejecución","(No. de actividades recreativas que cumplen con los requisitos definidos para su ejecución/Total de actividades recreativas realizadas)*100","Gestión","Eficacia","Trimestral",0.97,"Porcentaje","Sistema de información misional - SIM","Positiva","No","En el análisis del indicador se presentará el resultado desagregado por programa y por actividad.",2019,"Agosto"]
["Satisfacer las necesidades de los usuarios a través de la prestación de servicios eficientes, eficaces y efectivos","Fomento al Deporte","Desarrollar e implementar programas deportivos y de actividad física, para contribuir con el mejoramiento de la calidad de vida en la población de Bogotá D.C.","Satisfacción del usuario con las actividades deportivas  realizadas",null,null,"Satisfacción de los usuarios con las actividades realizadas en los programas deportivos","(No. de usuarios satisfechos con las actividades deportivas realizadas/Total de usuarios de actividades deportivas encuestados)*100","Gestión","Efectividad","Anual",1,"Porcentaje","Encuesta de satisfacción sobre actividades/programas deportivos","Positiva","No","En el análisis del indicador se presentará el resultado desagregado por programa y por cada uno de los aspectos evaluados en la encuesta de satisfacción.\nSe colocó una meta de 100%, mientras se levanta la línea base con la primera medición.",2019,"Agosto"]
["Mejorar continuamente los procesos del Sistema Integrado de Gestión","Fomento al Deporte","Desarrollar e implementar programas deportivos y de actividad física, para contribuir con el mejoramiento de la calidad de vida en la población de Bogotá D.C.","Cambios comportamentales como resultados de los programas deportivos y de actividad física",null,null,"Cambio comportamental frente a la actividad física y el deporte","(No. de beneficiarios con percepción de cambio comportamental alrededor de las 4 dimensiones de la alfabetización física/Total de beneficiarios de programas deportivos y de actividad física seleccionados en la muestra)*100","Gestión","Efectividad","Anual",1,"Porcentaje","Encuesta para medir las 4 dimensiones de la alfabetización física","Positiva","No","La metodología se aplicará sobre una muestra por cada por cada programa. Se define en 4 tipos de mediciones:\n1. Medición dimensión competencia física. Aplicar test de resistencia, fuerza de torso, habilidades y flexibilidad.\n2. Medición dimensiones: competencia cognitiva, comportamental y motivacional a través de un cuestionario (on-line o presencial).\nSe colocó una meta de 100%, mientras se levanta la línea base con la primera medición.",2019,"Agosto"]
["Satisfacer las necesidades de los usuarios a través de la prestación de servicios eficientes, eficaces y efectivos","Servicio a la Ciudadanía","Brindar información y atender los requerimientos de los grupos de valor y de interés de la entidad para responder a sus necesidades en cumplimiento de sus derechos","Oportunidad y calidad en la respuesta a los requerimientos de los grupos de valor e interés de la entidad","Satisfacción del ciudadano frente a las respuestas a sus requerimientos",null,"Satisfacción de peticionarios con la respuesta dada a sus requerimientos","(No. de peticionarios satisfechos con la respuesta dada a sus peticiones, quejas, reclamos y sugerencias/Total de peticionarios contactados)*100","Gestión","Efectividad","Mensual",0.8,"Porcentaje","Base de datos de gestión de PQRS","Positiva","No",null,2019,"Agosto",41,49,0.83673469387755106,1.0459183673469388,"Aceptable"]
["Mejorar continuamente los procesos del Sistema Integrado de Gestión","Gestión de Recursos Físicos","Administrar y controlar los bienes muebles y servicios para el funcionamiento administrativo de la entidad","Oportunidad en la atención de requerimientos y necesidades de servicios administrativos",null,null,"Porcentaje de requerimientos de mantenimiento correctivo atendidos en la sede administrativa dentro de los tiempos establecidos","(No. de requerimientos de mantenimiento correctivo atendidos dentro de los tiempos establecidos/Total de requerimientos de mantenimiento correctivo reportados en la sede administrativa)*100","Gestión","Calidad","Trimestral",0.95,"Porcentaje","Aplicativo mesa de ayuda OTRS","Positiva","No",null,2019,"Agosto"]
["Mejorar continuamente los procesos del Sistema Integrado de Gestión","Adquisición de Bienes y Servicios","Realizar actividades contractuales para adquirir bienes y servicios con la oportunidad y de acuerdo con las especificaciones establecidas por la entidad","Cumplimiento de requisitos de acuerdo con la modalidad de selección",null,null,"Porcentaje de procesos de selección publicados dentro del tiempo establecido","(No. de actos de apertura de procesos de selección publicados en un tiempo menor o igual a 30 días hábiles después de la radicación/Total de actos de apertura expedidos)*100","Gestión","Calidad","Trimestral",0.9,"Porcentaje","Plataforma ORFEO y SECOP","Positiva","No","En el análisis del indicador se presentará el resultado desagregado para licitación pública, concurso de méritos y selección abreviada.",2019,"Agosto"]
["Mejorar continuamente los procesos del Sistema Integrado de Gestión","Adquisición de Bienes y Servicios","Realizar actividades contractuales para adquirir bienes y servicios con la oportunidad y de acuerdo con las especificaciones establecidas por la entidad","Oportunidad en la suscripción y legalización del contrato",null,null,"Porcentaje de contratos legalizados dentro del tiempo establecido","(No. de contratos legalizados en un tiempo menor o igual a 10 días hábiles a partir del acto administrativo de adjudicación/Total de procesos de selección adjudicados)*100","Gestión","Calidad","Mensual",0.8,"Porcentaje","SECOP y Plataforma ORFEO ","Positiva","No","En el análisis del indicador se presentará el resultado desagregado para licitación pública, concurso de méritos y selección abreviada.",2019,"Agosto",2,6,0.33333333333333331,0.41666666666666663,"Crítico"]
["Mejorar continuamente los procesos del Sistema Integrado de Gestión","Adquisición de Bienes y Servicios","Realizar actividades contractuales para adquirir bienes y servicios con la oportunidad y de acuerdo con las especificaciones establecidas por la entidad","Definición clara y precisa de requisitos técnicos, financieros, económicos, jurídicos y de riesgos de acuerdo con el bien o servicio a adquirir",null,null,"Porcentaje de procesos de obra tramitados en análisis de costos dentro del tiempo establecido","(No. de procesos de obra (todas las Subdirecciones) tramitados en oportunidad al recibo del memorando con la solicitud estudio del sector (20 días)/Total de procesos de obra recibidos)*100","Gestión","Calidad","Trimestral",1,"Porcentaje","Matriz de tráfico ACEE","Positiva","No",null,2019,"Agosto"]
["Mejorar continuamente los procesos del Sistema Integrado de Gestión","Adquisición de Bienes y Servicios","Realizar actividades contractuales para adquirir bienes y servicios con la oportunidad y de acuerdo con las especificaciones establecidas por la entidad","Definición clara y precisa de requisitos técnicos, financieros, económicos, jurídicos y de riesgos de acuerdo con el bien o servicio a adquirir",null,null,"Porcentaje de procesos diferentes a obra tramitados en análisis de costos dentro del tiempo establecido","(No. de procesos diferentes a obra tramitados en oportunidad al recibo del memorando con la solicitud estudio del sector (10 días hábiles)/Total de procesos recibidos diferentes a obra)*100","Gestión","Calidad","Trimestral",0.9,"Porcentaje","Matriz de tráfico ACEE","Positiva","No","En el análisis del indicador se presentará el resultado desagregado para procesos diferentes a obra.",2019,"Agosto"]
["Mejorar continuamente los procesos del Sistema Integrado de Gestión","Adquisición de Bienes y Servicios","Realizar actividades contractuales para adquirir bienes y servicios con la oportunidad y de acuerdo con las especificaciones establecidas por la entidad","Definición clara y precisa de requisitos técnicos, financieros, económicos, jurídicos y de riesgos de acuerdo con el bien o servicio a adquirir",null,null,"Porcentaje de procesos requeridos por precios artificialmente bajos","(No. de procesos (excepto Subastas SAS) requeridos por precios artificialmente bajos/Total de procesos evaluados)*100","Gestión","Calidad","Trimestral",0.15,"Porcentaje","Evaluación económica de los proponentes\n\nAnálisis de precios realizado por la ACEE","Negativa","No","En el análisis del indicador se presentará el resultado desagregado por tipo de proceso.",2019,"Agosto"]
["Mejorar continuamente los procesos del Sistema Integrado de Gestión","Control, Evaluación y Seguimiento","Evaluar los controles y la gestión de la entidad con el fin de identificar e implementar acciones de mejora, en pro de la sostenibilidad del Sistema de Control Interno","Pertinencia y oportunidad en la entrega de los resultados del seguimiento a las partes interesadas",null,null,"Porcentaje de acciones de mejoramiento interno con seguimiento efectuado","(No. de acciones de mejoramiento interno con seguimiento efectuado)/Total de acciones de mejoramiento interno abiertas de auditorías internas de control interno)*100","Gestión","Eficacia","Trimestral",1,"Porcentaje","Plataforma Isolución","Positiva","No","En el análisis del indicador se presentará el resultado desagregado por proceso.",2019,"Agosto"]
["Mejorar continuamente los procesos del Sistema Integrado de Gestión","Control, Evaluación y Seguimiento","Evaluar los controles y la gestión de la entidad con el fin de identificar e implementar acciones de mejora, en pro de la sostenibilidad del Sistema de Control Interno","Pertinencia y oportunidad en la entrega de los resultados del seguimiento a las partes interesadas",null,null,"Porcentaje de acciones de mejoramiento externo con seguimiento efectuado","(No. de acciones de mejoramiento externo con seguimiento efectuado)/Total de acciones de mejoramiento externo abiertas de auditorías externas)*100","Gestión","Eficacia","Trimestral",1,"Porcentaje","Matrices de consolidación del estado de las acciones de los diferentes entes de control y vigilancia","Positiva","No","En el análisis del indicador se presentará el resultado desagregado por auditoría externa.",2019,"Agosto"]
["Mejorar continuamente los procesos del Sistema Integrado de Gestión","Gestión Financiera","Administrar los recursos financieros asignados y realizar los respectivos registros, para el cumplimiento de las funciones de la entidad y pago de sus obligaciones con terceros","Oportunidad en la expedición de los certificados presupuestales y en la presentación de los informes de ejecución",null,null,"Porcentaje de ejecución presupuestal en gastos de funcionamiento","(Presupuesto de funcionamiento ejecutado/Presupuesto disponible de funcionamiento)*100","Gestión","Eficiencia","Mensual",0.95,"Porcentaje","Ejecución presupuestal en SEVEN","Positiva","Si","La meta es anual con medición y análisis mensual.\nLa medición está a cargo del Área Financiera y el análisis a cargo de la Subdirección Administrativa y Financiera.\nLa medición y el análisis se deben realizar a más tardar el quinto día hábil de cada mes.\nUna vez se realice el Comité Financiero, el Área Financiera debe enviar a la Oficina Asesora de Planeación la presentación correspondiente, con el análisis respectivo en cuanto al desempeño del indicador.",2019,"Agosto",20349249240,35208442000,0.57796505849364199,{"$f":"+V599/L599","v":0.6083842720985706}]
["Mejorar continuamente los procesos del Sistema Integrado de Gestión","Gestión Financiera","Administrar los recursos financieros asignados y realizar los respectivos registros, para el cumplimiento de las funciones de la entidad y pago de sus obligaciones con terceros","Oportunidad en la expedición de los certificados presupuestales y en la presentación de los informes de ejecución","Oportunidad en la autorización de giro de los recursos de transferencia",null,"Porcentaje de ejecución presupuestal en gastos de inversión","(Presupuesto de inversión ejecutado/Presupuesto disponible de inversión)*100","Gestión","Eficiencia","Mensual",1,"Porcentaje","Ejecución presupuestal en SEVEN","Positiva","Si","La meta es anual con medición y análisis mensual.\nLa medición está a cargo del Área Financiera y el análisis a cargo de los Ordenadores del Gasto.\nLa medición y el análisis se deben realizar a más tardar el quinto día hábil de cada mes.\nUna vez se realice el Comité Financiero, el Área Financiera debe enviar a la Oficina Asesora de Planeación la presentación correspondiente, con el análisis respectivo en cuanto al desempeño del indicador.",2019,"Agosto",363417331648,742020022000,0.48976755461188892,0.48976755461188892]
["Mejorar continuamente los procesos del Sistema Integrado de Gestión","Gestión Financiera","Administrar los recursos financieros asignados y realizar los respectivos registros, para el cumplimiento de las funciones de la entidad y pago de sus obligaciones con terceros","Oportunidad en el pago de las obligaciones financieras de la entidad",null,null,"Porcentaje de ejecución del programa anual de caja","(Recursos ejecutados de reserva, vigencia y pasivos exigibles/Recursos programados de reserva, vigencia y pasivos exigibles)*100","Gestión","Eficiencia","Mensual",1,"Porcentaje","Sistema de información SEVEN","Positiva","Si","La meta es anual con medición y análisis mensual.\nLa medición está a cargo del Área Financiera y el análisis a cargo de los Ordenadores del Gasto.\nLa medición y el análisis se deben realizar a más tardar el quinto día hábil de cada mes.\nUna vez se realice el Comité Financiero, el Área Financiera debe enviar a la Oficina Asesora de Planeación la presentación correspondiente, con el análisis respectivo en cuanto al desempeño del indicador.",2019,"Agosto",3890085,4176255,{"$f":"+T601/U601","v":0.93147688539133744},0.93147688539133744]
["Mejorar continuamente los procesos del Sistema Integrado de Gestión","Gestión Financiera","Administrar los recursos financieros asignados y realizar los respectivos registros, para el cumplimiento de las funciones de la entidad y pago de sus obligaciones con terceros","Oportunidad en el pago de las obligaciones financieras de la entidad","Oportunidad en la causación de ordenes de pago que cumplan con todos los requisitos establecidos","Oportunidad y veracidad de la información necesaria para la causación de las ordenes de pago reportada por los ordenadores del gasto","Porcentaje de cuentas individuales pagadas dentro del tiempo establecido","(No. de cuentas individuales pagadas en un tiempo menor o igual a 6 días/Total de cuentas de pago individuales tramitadas)*100 ","Gestión","Calidad","Mensual",1,"Porcentaje","Bitácora de cuentas en SEVEN","Positiva","No","La medición y el análisis están a cargo del Área Financiera.\nEn el análisis del indicador se presentará el resultado del tiempo promedio en cada una de las etapas para el pago, según la bitácora de cuentas de SEVEN.",2019,"Agosto",292,292,1,1,{"$f":"_xlfn.IFS(W602<=69%,\"Crítico\",W602>=90%,\"Aceptable\",W602>=70%,\"Tolerable\")","v":"Aceptable"}]
["Mejorar continuamente los procesos del Sistema Integrado de Gestión","Gestión Financiera","Administrar los recursos financieros asignados y realizar los respectivos registros, para el cumplimiento de las funciones de la entidad y pago de sus obligaciones con terceros","Oportunidad en el pago de las obligaciones financieras de la entidad","Oportunidad en la causación de ordenes de pago que cumplan con todos los requisitos establecidos","Oportunidad y veracidad de la información necesaria para la causación de las ordenes de pago reportada por los ordenadores del gasto","Porcentaje de cuentas colectivas pagadas dentro del tiempo establecido","(No. de cuentas colectivas pagadas en un tiempo menor o igual a 10 días/Total de cuentas de pago colectivas tramitadas)*100","Gestión","Calidad","Mensual",1,"Porcentaje","Bitácora de cuentas en SEVEN","Positiva","No","La medición y el análisis están a cargo del Área Financiera.\nEn el análisis del indicador se debe presentar el resultado del tiempo promedio en cada una de las etapas para el pago, según la bitácora de cuentas de SEVEN.",2019,"Agosto",53,53,1,1,{"$f":"_xlfn.IFS(W603<=69%,\"Crítico\",W603>=90%,\"Aceptable\",W603>=70%,\"Tolerable\")","v":"Aceptable"}]
["Implementar las políticas y líneas de acción para la preservación e integridad de la documentación","Gestión Documental","Administrar, conservar y custodiar la documentación generada en la entidad, desde su origen hasta su disposición final, para preservar la memoria institucional","Actualización del inventario documental en el Formato Único de Inventario Documental, con base en la aplicación de las tablas de retención documental","Cumplimiento de los tiempos de retención documental establecidos en las tablas","Actualización de los instrumentos archivísticos","Porcentaje de inventario validado del fondo documental acumulado del archivo central","(No. de metros lineales de inventario validado en cuanto a series, subseries, asuntos y oficinas productoras/Total de metros lineales de archivo inventariado en estado natural del archivo central)*100 ","Gestión","Eficacia","Mensual",1,"Porcentaje","Matriz de seguimiento a inventario documental","Positiva","Si","La meta es anual con medición y análisis mensual",2019,"Agosto",1484.38,2180.5,0.68075212107314842,0.68075212107314842]
["Implementar las políticas y líneas de acción para la preservación e integridad de la documentación","Gestión Documental","Administrar, conservar y custodiar la documentación generada en la entidad, desde su origen hasta su disposición final, para preservar la memoria institucional","Oportunidad en las transferencias documentales de acuerdo con los tiempos de retención establecidos en las tablas",null,null,"Porcentaje de transferencias primarias realizadas de acuerdo con los tiempos de retención","(No. de transferencias primarias realizadas de acuerdo con los tiempos de retención establecidos en las TRD/Total de transferencias documentales programadas)*100","Gestión","Eficacia","Mensual",0.8,"Porcentaje","Matriz de seguimiento a transferencias documentales","Positiva","Si","La meta es anual con medición y análisis mensual",2019,"Agosto",40,33,1.2121212121212122,1.5151515151515151]
["Implementar las políticas y líneas de acción para la preservación e integridad de la documentación","Gestión Documental","Administrar, conservar y custodiar la documentación generada en la entidad, desde su origen hasta su disposición final, para preservar la memoria institucional","Cumplimiento de los estándares de temperatura, humedad relativa y luminosidad de los espacios de almacenamiento de material documental, dentro de los rangos establecidos en la normatividad vigente",null,null,"Porcentaje de espacios controlados para la conservación documental","(No. de espacios monitoreados e intervenidos/Total de espacios monitoreados)*100","Gestión","Eficacia","Mensual",1,"Porcentaje","Informe de monitoreo de espacios controlados","Positiva","No","La medición es mes vencido",2019,"Agosto",10,10,1,1,{"$f":"_xlfn.IFS(W606<=69%,\"Crítico\",W606>=90%,\"Aceptable\",W606>=70%,\"Tolerable\")","v":"Aceptable"}]
["Mejorar continuamente los procesos del Sistema Integrado de Gestión","Servicio a la Ciudadanía","Brindar información y atender los requerimientos de los grupos de valor y de interés de la entidad para responder a sus necesidades en cumplimiento de sus derechos","Oportunidad y calidad en la respuesta a los requerimientos de los grupos de valor e interés de la entidad",null,null,"Porcentaje de peticiones, quejas, reclamos y sugerencias contestadas dentro de los términos legales vigentes","(No. de peticiones, quejas, reclamos y sugerencias contestadas en el aplicativo SDQS dentro de los términos legales vigentes/Total de peticiones, quejas, reclamos y sugerencias recibidas)*100","Gestión","Calidad","Mensual",1,"Porcentaje","Sistema SDQS","Positiva","No","La medición es mes vencido",2019,"Agosto",297,353,0.84135977337110479,0.84135977337110479,"Tolerable"]
["Satisfacer las necesidades de los usuarios a través de la prestación de servicios eficientes, eficaces y efectivos","Servicio a la Ciudadanía","Brindar información y atender los requerimientos de los grupos de valor y de interés de la entidad para responder a sus necesidades en cumplimiento de sus derechos","Satisfacción del ciudadano frente a la atención brindada por la entidad",null,null,"Satisfacción del ciudadano con la atención recibida en los SUPERCADE","(No. de ciudadanos satisfechos con la atención recibida en los SUPERCADE/Total de ciudadanos atendidos en los SUPERCADE)*100","Gestión","Efectividad","Mensual",0.95,"Porcentaje","Encuesta de satisfacción con la atención brindada en SUPERCADES","Positiva","No",null,2019,"Agosto",3365,3366,0.99970291146761736,1.0523188541764394,"Aceptable"]
["Mejorar continuamente los procesos del Sistema Integrado de Gestión","Servicio a la Ciudadanía","Brindar información y atender los requerimientos de los grupos de valor y de interés de la entidad para responder a sus necesidades en cumplimiento de sus derechos","Oportunidad en la actualización de la información publicada en la sección de ley de transparencia en la página web de la entidad",null,null,"Porcentaje de información actualizada en ley de transparencia","(No. de subcategorías con información actualizada en la página web/Total de subcategorías definidas en ley de transparencia)*100","Gestión","Eficacia","Trimestral",1,"Porcentaje","Página web","Positiva","No",null,2019,"Agosto"]
["Mejorar continuamente los procesos del Sistema Integrado de Gestión","Servicio a la Ciudadanía","Brindar información y atender los requerimientos de los grupos de valor y de interés de la entidad para responder a sus necesidades en cumplimiento de sus derechos","Coherencia, claridad, solución de fondo, calidez y manejo del sistema en relación con los requerimientos atendidos por la entidad",null,null,"Porcentaje de requerimientos atendidos con oportunidad y calidad","(No. de respuestas a requerimientos sin observaciones en cuanto a los criterios de oportunidad y calidad/Total de requerimientos evaluados en el aplicativo SDQS)*100","Gestión","Eficacia","Mensual",0.8,"Porcentaje","SDQS y base de datos de gestión de PQRS","Positiva","No","La medición es mes vencido",2019,"Agosto",241,279,0.86379928315412191,1.0797491039426523,"Aceptable"]
["Implementar buenas prácticas ambientales para la prevención de la contaminación en el marco de una Bogotá que defiende lo público en su función administrativa y de desarrollo institucional","Gestión de Recursos Físicos","Administrar y controlar los bienes muebles y servicios para el funcionamiento administrativo de la entidad","Calificación de la implementación del Plan Institucional de Gestión Ambiental, por parte de la Secretaría Distrital de Ambiente","Oportunidad en el reporte de formularios y registros electrónicos del PIGA ante la Secretaría Distrital de Ambiente",null,"Índice de implementación del PIGA","Promedio ponderado de cumplimiento de aspectos normativos y de implementación del PIGA, según auditoría realizada por la Secretaría Distrital de Ambiente en cada vigencia","Gestión","Eficacia","Anual",0.7,"Porcentaje","Informe de auditoría anual realizada por la Secretaría Distrital de Ambiente","Positiva","No","En el análisis del indicador se presentará el resultado desagregado por cada uno de los aspectos evaluados en la visita de control y seguimiento por parte de la Secretaría Distrital de Ambiente.\nLa meta está configurada como mayor a 70%.",2019,"Agosto"]
["Proteger la integridad, confidencialidad y disponibilidad de la información","Gestión de Tecnología de la Información y las Comunicaciones","Proporcionar soluciones estratégicas de tecnologías de la información y las comunicaciones, para contribuir con la eficiencia administrativa, la mejora de los trámites y servicios y la protección de los activos de información de la entidad","Impacto del plan de remediación frente a las vulnerabilidades identificadas","Aseguramiento de incidencias en la seguridad de la información que afecten la confidencialidad, integridad y disponibilidad",null,"Porcentaje de remediación de vulnerabilidades de seguridad de la información","(No. de vulnerabilidades críticas o altas remediadas/Total de vulnerabilidades de seguridad de la información detectadas como críticas o altas)*100 ","Gestión","Eficacia","Anual",0.7,"Porcentaje","Matriz de vulnerabilidades","Positiva","No","La meta está configurada como mínimo 70%.",2019,"Agosto"]
["Proteger la integridad, confidencialidad y disponibilidad de la información","Gestión de Tecnología de la Información y las Comunicaciones","Proporcionar soluciones estratégicas de tecnologías de la información y las comunicaciones, para contribuir con la eficiencia administrativa, la mejora de los trámites y servicios y la protección de los activos de información de la entidad","Avances en la implementación de gobierno digital de acuerdo con los componentes evaluados por MINTIC",null,null,"Índice de implementación de gobierno digital","Sumatoria de la calificación obtenida por cada componente/Total de componentes de la política de gobierno digital","Gestión","Eficacia","Anual",0.65,"Porcentaje","Instrumento de medición suministrado para el seguimiento a la política de gobierno digital  ","Positiva","No","En el análisis del indicador se presentará el resultado desagregado de las calificaciones obtenidas en cada componente de la política de seguridad digital.",2019,"Agosto"]
["Mejorar continuamente los procesos del Sistema Integrado de Gestión","Gestión de Tecnología de la Información y las Comunicaciones","Proporcionar soluciones estratégicas de tecnologías de la información y las comunicaciones, para contribuir con la eficiencia administrativa, la mejora de los trámites y servicios y la protección de los activos de información de la entidad","Cumplimiento del Plan Estratégico de Tecnologías de la Información PETI",null,null,"Porcentaje de avance en proyectos de TI","(No. de hitos en proyectos de TI alcanzados/Total de hitos en proyectos de TI programados en la vigencia)*100","Gestión","Eficacia","Semestral",1,"Porcentaje","Cronograma de proyectos del PETI","Positiva","Si","La meta es anual con medición y análisis semestral.",2019,"Agosto"]
["Proteger la integridad, confidencialidad y disponibilidad de la información","Gestión de Tecnología de la Información y las Comunicaciones","Proporcionar soluciones estratégicas de tecnologías de la información y las comunicaciones, para contribuir con la eficiencia administrativa, la mejora de los trámites y servicios y la protección de los activos de información de la entidad","Disponibilidad de los sistemas de información de la entidad",null,null,"Porcentaje de disponibilidad de los sistemas de información","(No. de horas disponibles de los sistemas de información/Total de horas en servicio de los sistemas de información)*100","Gestión","Eficiencia","Mensual",0.9,"Porcentaje","Herramienta de monitoreo ZABBIX","Positiva","No","En el análisis del indidicador se presentará el resultado desagregado de disponibilidad en ORFEO, SEVEN, KACTUS y SIM.\nLa meta está configurada como mayor o igual a 90%.",2019,"Agosto",744,744,1,1.1111111111111112,{"$f":"_xlfn.IFS(W615<=69%,\"Crítico\",W615>=90%,\"Aceptable\",W615>=70%,\"Tolerable\")","v":"Aceptable"}]
["Mejorar continuamente los procesos del Sistema Integrado de Gestión","Gestión de Tecnología de la Información y las Comunicaciones","Proporcionar soluciones estratégicas de tecnologías de la información y las comunicaciones, para contribuir con la eficiencia administrativa, la mejora de los trámites y servicios y la protección de los activos de información de la entidad","Disponibilidad de los servicios de comunicaciones en la entidad, según los acuerdos de niveles de servicios establecidos",null,null,"Porcentaje de disponibilidad de los servicios de comunicaciones","(No. de horas disponibles de los servicios de comunicaciones /Total de horas de los servicios de comunicaciones)*100","Gestión","Eficiencia","Mensual",0.9,"Porcentaje","Herramienta de monitoreo ZABBIX","Positiva","No","En el análisis del indidicador se presentará el resultado desagregado de disponibilidad en Internet y Telefonía IP.\nLa meta está configurada como mayor o igual a 90%.",2019,"Agosto",743.99,744,0.99998655913978496,1.1110961768219834,"Aceptable"]
["Mejorar continuamente los procesos del Sistema Integrado de Gestión","Gestión de Tecnología de la Información y las Comunicaciones","Proporcionar soluciones estratégicas de tecnologías de la información y las comunicaciones, para contribuir con la eficiencia administrativa, la mejora de los trámites y servicios y la protección de los activos de información de la entidad","Incidencias reportadas en el funcionamiento del módulo o sistema de información implementado","Cumplimiento de los acuerdos de niveles de servicios establecidos",null,"Porcentaje de solicitudes de servicio tecnológico atendidas dentro de los tiempos establecidos","(No. de solicitudes atendidas dentro de los tiempos establecidos en los acuerdos de nivel de servicio/Total de solicitudes de servicio tecnológico recibidas)*100","Gestión","Calidad","Mensual",0.9,"Porcentaje","Herramienta GLPI","Positiva","No",null,2019,"Agosto",632,632,1,1.1111111111111112,"Aceptable"]
["Mejorar continuamente los procesos del Sistema Integrado de Gestión","Gestión de Talento Humano","Gestionar el potencial del talento humano como factor estratégico, para contribuir con el desarrollo de la entidad en un ambiente seguro y saludable","Cumplimiento de compromisos y competencias del servidor público en el desempeño laboral","Oportunidad en el seguimiento y la evaluación anual u ordinaria del servidor público para continuar su permanencia en el servicio",null,"Índice de desempeño laboral de funcionarios","(Sumatoria de calificaciones finales de la evaluación de desempeño de los funcionarios/Total de funcionarios evaluados)*100","Gestión","Eficacia","Anual",0.9,"Porcentaje","Consolidado de las calificaciones finales de la evaluación de desempeño","Positiva","No","En el análisis del indicador se presentará el resultado desagregado por niveles jerárquicos y comparar con la evaluación de las áreas.\nLa meta está configurada como mayor a 90%.\nNota: Se mide para vigencia 2018-2019.",2019,"Agosto"]
["Mejorar continuamente los procesos del Sistema Integrado de Gestión","Gestión de Talento Humano","Gestionar el potencial del talento humano como factor estratégico, para contribuir con el desarrollo de la entidad en un ambiente seguro y saludable","Cobertura de servidores públicos en las actividades del plan de bienestar e incentivos",null,null,"Porcentaje de funcionarios que participan en las actividades del plan de bienestar e incentivos","(No. de funcionarios participantes en las actividades del plan de bienestar e incentivos/Total de funcionarios de la entidad)*100 ","Gestión","Eficacia","Semestral",0.8,"Porcentaje","Registros de asistencia a las actividades del plan de bienestar","Positiva","No",null,2019,"Agosto"]
["Mejorar continuamente los procesos del Sistema Integrado de Gestión","Gestión de Talento Humano","Gestionar el potencial del talento humano como factor estratégico, para contribuir con el desarrollo de la entidad en un ambiente seguro y saludable","Cobertura de servidores públicos en las actividades del plan institucional de capacitación",null,null,"Porcentaje de funcionarios que asisten a las actividades del plan institucional de capacitación","(No. de funcionarios asistentes a las actividades del plan institucional de capacitación/Total de funcionarios citados a las actividades del plan institucional de capacitación)*100","Gestión","Eficacia","Semestral",0.8,"Porcentaje","Registros de asistencia a las actividades del plan de capacitación","Positiva","No","Las capacitaciones que se incluyen en el indicador son las que implican recursos.",2019,"Agosto"]
["Mejorar continuamente los procesos del Sistema Integrado de Gestión","Gestión de Talento Humano","Gestionar el potencial del talento humano como factor estratégico, para contribuir con el desarrollo de la entidad en un ambiente seguro y saludable","Evaluación del impacto de la capacitación en el desempeño de los servidores públicos y de la entidad",null,null,"Impacto de la capacitación en el desempeño laboral de funcionarios","(No. de funcionarios con capacitaciones efectivas/Total de funcionarios evaluados)*100","Gestión","Eficacia","Trimestral",0.95,"Porcentaje","Consolidado de las evaluaciones de impacto de la capacitación","Positiva","No",null,2019,"Agosto"]
["Mejorar continuamente los procesos del Sistema Integrado de Gestión","Gestión de Talento Humano","Gestionar el potencial del talento humano como factor estratégico, para contribuir con el desarrollo de la entidad en un ambiente seguro y saludable","Satisfacción de los servidores públicos frente a las actividades de  bienestar e incentivos","Satisfacción de los servidores públicos frente a las actividades de capacitación",null,"Índice de clima organizacional","Promedio ponderado de las dimensiones evaluadas en la encuesta de medición de clima organizacional","Gestión","Eficacia","Anual",0.8,"Porcentaje","Informe de medición de clima organizacional","Positiva","No","En el análisis del indicador se presentará el resultado desagregado por áreas y/o dependencias, y por las dimensiones evaluadas.",2019,"Agosto"]
["Mejorar continuamente los procesos del Sistema Integrado de Gestión","Gestión de Talento Humano","Gestionar el potencial del talento humano como factor estratégico, para contribuir con el desarrollo de la entidad en un ambiente seguro y saludable","Cumplimiento del plan anual de  bienestar e incentivos",null,null,"Porcentaje de ejecución del plan anual de bienestar e incentivos","(No. de actividades de bienestar e incentivos desarrolladas/Total de actividades programadas en el plan anual de bienestar e incentivos)*100","Gestión","Eficacia","Semestral",1,"Porcentaje","Matriz de seguimiento a la ejecución de actividades de bienestar e incentivos","Positiva","Si","La meta es anual con medición y análisis semestral.",2019,"Agosto"]
["Mejorar continuamente los procesos del Sistema Integrado de Gestión","Gestión de Talento Humano","Gestionar el potencial del talento humano como factor estratégico, para contribuir con el desarrollo de la entidad en un ambiente seguro y saludable","Cumplimiento del plan institucional de capacitación",null,null,"Porcentaje de ejecución del plan institucional de capacitación","(No. de actividades de capacitación desarrolladas/Total de actividades programadas en el plan institucional de capacitación)*100","Gestión","Eficacia","Semestral",1,"Porcentaje","Matriz de seguimiento a la ejecución de actividades de capacitación","Positiva","Si","La meta es anual con medición y análisis semestral.",2019,"Agosto"]
["Prevenir los factores que afecten la salud y seguridad a fin de mejorar las condiciones del ambiente de trabajo","Gestión de Talento Humano","Gestionar el potencial del talento humano como factor estratégico, para contribuir con el desarrollo de la entidad en un ambiente seguro y saludable","Cumplimiento del plan anual de trabajo",null,null,"Porcentaje de ejecución del plan anual de seguridad y salud en el trabajo","(No. de actividades de seguridad y salud desarrolladas/Total de actividades programadas en el plan anual de seguridad y salud en el trabajo)*100","Gestión","Eficacia","Mensual",0.95,"Porcentaje","Plan de trabajo anual del Sistema de Gestión de Seguridad y Salud en el Trabajo","Positiva","No",null,2019,"Agosto",228,247,0.92307692307692313,0.97165991902834015,{"$f":"_xlfn.IFS(W625<=69%,\"Crítico\",W625>=90%,\"Aceptable\",W625>=70%,\"Tolerable\")","v":"Aceptable"}]
["Prevenir los factores que afecten la salud y seguridad a fin de mejorar las condiciones del ambiente de trabajo","Gestión de Talento Humano","Gestionar el potencial del talento humano como factor estratégico, para contribuir con el desarrollo de la entidad en un ambiente seguro y saludable","Tasa de accidentalidad",null,null,"Tasa de accidentalidad","(No. de accidentes de trabajo reportados/Total de trabajadores (funcionarios y contratistas)*100","Gestión","Efectividad","Mensual",0.04,"Porcentaje","Matriz de accidentes de trabajo","Negativa","No","La meta está configurada como menor o igual a 4%.",2019,"Agosto",77,3194,2.4107701941139637E-2,{"$f":"((L626-V626)+L626)/L626","v":1.3973074514715091},"Aceptable"]
["Prevenir los factores que afecten la salud y seguridad a fin de mejorar las condiciones del ambiente de trabajo","Gestión de Talento Humano","Gestionar el potencial del talento humano como factor estratégico, para contribuir con el desarrollo de la entidad en un ambiente seguro y saludable","Incidencia y prevalencia de enfermedades laborales",null,null," Prevalencia de la enfermedad laboral","(No. de casos de enfermedad laboral calificada/Total de funcionarios)*100","Gestión","Efectividad","Trimestral",0.02,"Porcentaje","Matriz de seguimiento de enfermedades laborales","Negativa","No","La meta está configurada como menor o igual a 2%.",2019,"Agosto"]
["Prevenir los factores que afecten la salud y seguridad a fin de mejorar las condiciones del ambiente de trabajo","Gestión de Talento Humano","Gestionar el potencial del talento humano como factor estratégico, para contribuir con el desarrollo de la entidad en un ambiente seguro y saludable","Incidencia y prevalencia de enfermedades laborales",null,null,"Incidencia de la enfermedad laboral","(No. de casos nuevos de enfermedad laboral calificados/Total de funcionarios)*100","Gestión","Efectividad","Trimestral",0.01,"Porcentaje","Matriz de seguimiento de enfermedades laborales","Negativa","No","La meta está configurada como menor o igual a 1%.",2019,"Agosto"]
["Mejorar continuamente los procesos del Sistema Integrado de Gestión","Gestión de Recursos Físicos","Administrar y controlar los bienes muebles y servicios para el funcionamiento administrativo de la entidad","Confiabilidad del inventario de bienes devolutivos",null,null,"Porcentaje de inventario individual validado físicamente","(No. de elementos devolutivos del inventario individual validados físicamente/Total de elementos devolutivos del inventario individual registrados en el sistema de información SEVEN)*100 ","Gestión","Eficacia","Anual",1,"Porcentaje","Sistema de información SEVEN","Positiva","No",null,2019,"Agosto"]
["Mejorar continuamente los procesos del Sistema Integrado de Gestión","Gestión de Recursos Físicos","Administrar y controlar los bienes muebles y servicios para el funcionamiento administrativo de la entidad","Confiabilidad del inventario de bienes devolutivos",null,null,"Porcentaje de inventario aleatorio validado físicamente en bodega","(No. de elementos devolutivos y de consumo en bodegas validados físicamente/Muestra de inventario de elementos devolutivos y de consumo registrados en el sistema de información SEVEN)*100 ","Gestión","Eficacia","Trimestral",1,"Porcentaje","Sistema de información SEVEN","Positiva","No",null,2019,"Agosto"]
["Mejorar continuamente los procesos del Sistema Integrado de Gestión","Gestión de Asuntos Locales","Desarrollar acciones a nivel local para promover la participación ciudadana, brindar acompañamiento a las alcaldías locales en temas misionales de la entidad y ofertar sus programas","Cumplimiento de los compromisos adquiridos por la entidad, en el marco de las instancias de participación locales",null,null,"Porcentaje de compromisos atendidos en el marco de las instancias de participación locales","(No. de compromisos atendidos en las instancias Consejo Local de Gobierno, Unidad de Apoyo Técnico y Comisión Local Intersectorial de Participación /Total de compromisos generados en las instancias Consejo Local de Gobierno, Unidad de Apoyo Técnico y Comisión Local Intersectorial de Participación)*100","Gestión","Eficacia","Trimestral",1,"Porcentaje","Matriz de seguimiento a compromisos derivados de instancias de participación locales","Positiva","No",null,2019,"Agosto"]
["Mejorar continuamente los procesos del Sistema Integrado de Gestión","Gestión de Asuntos Locales","Desarrollar acciones a nivel local para promover la participación ciudadana, brindar acompañamiento a las alcaldías locales en temas misionales de la entidad y ofertar sus programas","Efectividad en la atención de la demanda de actividades recreodeportivas en las localidades de Bogotá",null,null,"Porcentaje de actividades recreativas programadas por asuntos locales","(No. de actividades recreativas programadas en la plataforma SIM por los gestores locales/Total de actividades recreativas solicitadas por Promoción de la Recreación)*100","Gestión","Eficacia","Mensual",1,"Porcentaje","Sistema de información misional - SIM\nCuadro de metas de actividades recreativas","Positiva","No",null,2019,"Agosto",2534,2428,1.0436573311367381,{"$f":"+V632/L632","v":1.0436573311367381},"Aceptable"]
["Mejorar continuamente los procesos del Sistema Integrado de Gestión","Gestión de Asuntos Locales","Desarrollar acciones a nivel local para promover la participación ciudadana, brindar acompañamiento a las alcaldías locales en temas misionales de la entidad y ofertar sus programas","Efectividad en la atención de la demanda de actividades recreodeportivas en las localidades de Bogotá",null,null,"Porcentaje de beneficiarios inscritos por asuntos locales en actividades deportivas","(No. de beneficiarios inscritos en actividades deportivas por los gestores locales/Total de beneficiarios de actividades deportivas programados por Fomento al Deporte)*100","Gestión","Eficacia","Trimestral",1,"Porcentaje","Reporte de las distintas plataformas para inscripciones\nCuadro de metas de actividades deportivas","Positiva","No",null,2019,"Agosto"]
["Mejorar continuamente los procesos del Sistema Integrado de Gestión","Gestión de Asuntos Locales","Desarrollar acciones a nivel local para promover la participación ciudadana, brindar acompañamiento a las alcaldías locales en temas misionales de la entidad y ofertar sus programas","Cumplimiento de lineamientos y criterios de elegibilidad y viabilidad de los proyectos de contratación",null,null,"Porcentaje de asistencias técnicas realizadas a los Fondos de Desarrollo Local","(No. de asistencias técnicas realizadas a los Fondos de Desarrollo Local/Total de asistencias técnicas programadas a los Fondos de Desarrollo Local en las cuatro líneas de inversión)*100","Gestión","Eficacia","Trimestral",1,"Porcentaje","Cronograma de asistencias técnicas a los Fondos de Desarrollo Local","Positiva","No",null,2019,"Agosto"]
["Mejorar continuamente los procesos del Sistema Integrado de Gestión","Gestión de Asuntos Locales","Desarrollar acciones a nivel local para promover la participación ciudadana, brindar acompañamiento a las alcaldías locales en temas misionales de la entidad y ofertar sus programas","Ejecución de los proyectos con recursos de los fondos de desarrollo local, en concordancia con el concepto previo y favorable emitido por la entidad",null,null,"Porcentaje de proyectos viabilizados con seguimiento efectuado","(No. de proyectos contratados con seguimiento efectuado/Total de proyectos viabilizados con contratación por parte de los Fondos de Desarrollo Local)*100","Gestión","Eficacia","Trimestral",1,"Porcentaje","SECOP\nInforme de seguimiento a viabilidades","Positiva","No",null,2019,"Agosto"]
["Mejorar continuamente los procesos del Sistema Integrado de Gestión","Control Disciplinario","Investigar conductas presuntamente disciplinables e imponer sanciones cuando haya lugar, tanto a servidores como a ex-servidores públicos de la entidad, con el fin de que éstos cumplan con sus deberes y funciones","Cumplimiento de los términos legales en las distintas etapas procesales",null,null,"Porcentaje de procesos disciplinarios resueltos de fondo","(No. de procesos disciplinarios decididos de fondo/Total de procesos disciplinarios activos)*100","Gestión","Eficacia","Semestral",0.6,"Porcentaje","Matriz de autos","Positiva","No",null,2019,"Agosto"]
["Mejorar continuamente los procesos del Sistema Integrado de Gestión","Control Disciplinario","Investigar conductas presuntamente disciplinables e imponer sanciones cuando haya lugar, tanto a servidores como a ex-servidores públicos de la entidad, con el fin de que éstos cumplan con sus deberes y funciones","Garantía del debido proceso en las distintas etapas procesales",null,null,"Porcentaje de procesos disciplinarios sin nulidades decretadas","(No. de procesos disciplinarios sin nulidades decretadas/Total de procesos disciplinarios activos)*100 ","Gestión","Eficacia","Trimestral",1,"Porcentaje","Matriz de autos","Positiva","No",null,2019,"Agosto"]
["Mejorar continuamente los procesos del Sistema Integrado de Gestión","Control Disciplinario","Investigar conductas presuntamente disciplinables e imponer sanciones cuando haya lugar, tanto a servidores como a ex-servidores públicos de la entidad, con el fin de que éstos cumplan con sus deberes y funciones","Cumplimiento de los términos legales en las distintas etapas procesales",null,null,"Porcentaje de procesos disciplinarios sin vencimiento de términos","(No. de procesos disciplinarios sin vencimiento de términos/Total de procesos disciplinarios activos)*100","Gestión","Calidad","Trimestral",1,"Porcentaje","Expediente del proceso disciplinario ","Positiva","No",null,2019,"Agosto"]
["Mejorar continuamente los procesos del Sistema Integrado de Gestión","Administración y Mantenimiento de Parques y Escenarios","Ofrecer parques y escenarios del Sistema Distrital para el uso y disfrute de la comunidad general, gestionando la sostenibilidad física, social, ambiental y económica","Uso de parques y escenarios con motivación económica que generen recursos para el mantenimiento de los mismos",null,null,"Aprovechamiento económico de parques y/o escenarios","(Ingresos del mes + acumulado de los ingresos del mes anterior/Total presupuesto anual)*100","Gestión","Eficiencia","Mensual",1,"Porcentaje","Sistema de información SEVEN","Positiva","Si","La meta es anual con medición y análisis mensual.\n\nEn el análisis del indicador se presentará la desagregación del aprovechamiento económico por tipo de parque y/o escenario, expresado en ingresos y participación porcentual.",2019,"Agosto",15822020,22044017,{"$f":"+T639/U639","v":0.71774667929170988},0.71774667929170988]
["Satisfacer las necesidades de los usuarios a través de la prestación de servicios eficientes, eficaces y efectivos","Administración y Mantenimiento de Parques y Escenarios","Ofrecer parques y escenarios del Sistema Distrital para el uso y disfrute de la comunidad general, gestionando la sostenibilidad física, social, ambiental y económica","Satisfacción de los usuarios con las actividades de mantenimiento preventivo y correctivo",null,null,"Satisfacción de los usuarios con las obras de mantenimiento de nuevas tendencias","(No. de usuarios satisfechos con las obras de mantenimiento realizadas/Total de usuarios de parques y escenarios encuestados para obras de mantenimiento de nuevas tendencias)*100","Gestión","Efectividad","Anual",0.9,"Porcentaje","Encuesta de satisfacción con las obras de mantenimiento de nuevas tendencias","Positiva","No","En el análisis del indicador se presentará el resultado desagregado por cada uno de los aspectos evaluados en la encuesta de satisfacción.",2019,"Agosto"]
["Mejorar continuamente los procesos del Sistema Integrado de Gestión","Administración y Mantenimiento de Parques y Escenarios","Ofrecer parques y escenarios del Sistema Distrital para el uso y disfrute de la comunidad general, gestionando la sostenibilidad física, social, ambiental y económica","Oportunidad y cumplimiento en la generación de compromisos o acuerdos ciudadanos frente al uso y sostenibilidad de los parques administrados",null,null,"Porcentaje de cumplimiento en acuerdos de sostenibilidad social de parques","(No. de compromisos gestionados/Total de compromisos adquiridos mediante acuerdos ciudadanos en parques)*100","Gestión","Eficacia","Trimestral",1,"Porcentaje","Matriz de seguimiento a compromisos o acuerdos ciudadanos","Positiva","No",null,2019,"Agosto"]
["Mejorar continuamente los procesos del Sistema Integrado de Gestión","Administración y Mantenimiento de Parques y Escenarios","Ofrecer parques y escenarios del Sistema Distrital para el uso y disfrute de la comunidad general, gestionando la sostenibilidad física, social, ambiental y económica","Disponibilidad de los equipamientos en parques y escenarios","Cumplimiento de las especificaciones técnicas en las actividades de mantenimiento preventivo y correctivo","Cobertura en el mantenimiento de parques y escenarios de acuerdo con la priorización","Porcentaje de avance en la ejecución de contratos de obras de mantenimiento o recuperación","(Porcentaje contrato 1 + Porcentaje contrato 2 +...+ Porcentaje contrato n)/Total de contratos de obras de mantenimiento o recuperación en ejecución\nDonde: \nPorcentaje contrato n = Avance físico ejecutado/Avance físico programado\nn = Número de contratos de obras de mantenimiento o recuperación en ejecución","Gestión","Eficacia","Bimestral",0.9,"Porcentaje","Informes mensuales de interventoría presentados según programación de los contratistas","Positiva","No",null,2019,"Agosto",5.6,6,0.93333333333333324,1.037037037037037,{"$f":"_xlfn.IFS(W642<=69%,\"Crítico\",W642>=90%,\"Aceptable\",W642>=70%,\"Tolerable\")","v":"Aceptable"}]
["Satisfacer las necesidades de los usuarios a través de la prestación de servicios eficientes, eficaces y efectivos","Diseño y Construcción de Parques y Escenarios","Ampliar y mejorar la infraestructura física recreativa y deportiva del Distrito Capital para el uso de la comunidad en general","Cumplimiento de requisitos técnicos, administrativos, financieros y jurídicos de los proyectos",null,null,"Satisfacción de los usuarios con las obras de construcción y/o adecuación entregadas","(No. de usuarios satisfechos con las obras de construcción y/o adecuación entregadas /Total de usuarios encuestados por proyecto)*100","Gestión","Efectividad","Anual",0.9,"Porcentaje","Resultados de la encuesta de satisfacción entregados por los contratistas de obra","Positiva","No","En el análisis del indicador se presentará el resultado desagregado por cada uno de los aspectos evaluados en la encuesta de satisfacción.",2019,"Agosto"]
["Mejorar continuamente los procesos del Sistema Integrado de Gestión","Diseño y Construcción de Parques y Escenarios","Ampliar y mejorar la infraestructura física recreativa y deportiva del Distrito Capital para el uso de la comunidad en general","Oportunidad en el seguimiento y adopción de medidas durante el seguimiento de la estabilidad de la obra","Cumplimiento de especificaciones técnicas conforme a lo establecido en la etapa de construcción",null,"Porcentaje de fallas de calidad o estabilidad de obra atendidas en construcción y adecuación de parques y escenarios","(No. de fallas de calidad o estabilidad de obra atendidas/Total de fallas de calidad o estabilidad de obra detectadas o reportadas por terceros)*100\n\nAtendido = Se genera requerimiento al contratista para establecer compromisos de reparación.","Gestión","Eficacia","Trimestral",0.9,"Porcentaje","Actas de visita o reconocimiento de estabilidad de obra \nActa de compromiso de reparación constructiva\nProgramación de visita\nComunicación oficial- notificación de fallas visita de inspección por estabilidad \nActa de verificación de reparación constructiva","Positiva","No","En el análisis del indicador se presentará la desagregación por parque y escenario.",2019,"Agosto"]
["Mejorar continuamente los procesos del Sistema Integrado de Gestión","Diseño y Construcción de Parques y Escenarios","Ampliar y mejorar la infraestructura física recreativa y deportiva del Distrito Capital para el uso de la comunidad en general","Cumplimiento de requisitos técnicos, administrativos, financieros y jurídicos de los proyectos","Oportunidad en el seguimiento y adopción de medidas durante la ejecución de las obras","Cumplimiento del alcance de las obras conforme a los estudios y diseños, especificaciones técnicas y normatividad vigente","Porcentaje de avance en la ejecución de obras de construcción y adecuación de parques y escenarios","((%Ejecutado Obra 1*Plazo de ejecución Obra 1)+(%Ejecutado Obra 2*Plazo de ejecución Obra 2) +...+ (%Ejecutado Obra n*Plazo de ejecución Obra n))/((%Programado Obra 1*Plazo de ejecución Obra 1)+(%Programado Obra 2*Plazo de ejecución Obra 2) +...+ (%Programado Obra n*Plazo de ejecución Obra n))\nDonde:\nn = Número de obras en ejecución","Gestión","Eficacia","Mensual",0.9,"Porcentaje","Informes mensuales de interventoría\n\nInformes mensuales de supervisión","Positiva","No","En el análisis del indicador se presentará la desagregación por parque y escenario.",2019,"Agosto",55.2,62.040999999999997,0.88973420802372638,0.98859356447080704,"Aceptable"]
["Mejorar continuamente los procesos del Sistema Integrado de Gestión","Diseño y Construcción de Parques y Escenarios","Ampliar y mejorar la infraestructura física recreativa y deportiva del Distrito Capital para el uso de la comunidad en general","\nCumplimiento de requisitos técnicos, administrativos, financieros y legales de los proyectos de estudios y diseños","Oportunidad en el seguimiento y adopción de medidas durante la ejecución de los proyectos de estudios y diseños","Cumplimiento del alcance de los proyectos de estudios y diseños conforme a las necesidades identificadas","Porcentaje de avance en la ejecución de proyectos de estudios y/o diseños de parques y escenarios","(Porcentaje proyecto 1 + Porcentaje proyecto 2 +...+ Porcentaje proyecto n)/Total de proyectos de estudios y/o diseños en ejecución\nDonde: \nPorcentaje proyecto n =(Avance ejecutado de estudios y/o diseños/Avance programado de estudios y/o diseños al corte según forma de pago)\nn = Número de proyectos de estudios y/o diseños en ejecución","Gestión","Eficacia","Mensual",0.9,"Porcentaje","Informes mensuales de interventoría\n\nInformes mensuales de supervisión","Positiva","No","En el análisis del indicador se presentará la desagregación por proyecto.",2019,"Agosto",94.28,100,0.94279999999999997,1.0475555555555556,"Aceptable"]
["Mejorar continuamente los procesos del Sistema Integrado de Gestión","Gestión Jurídica","Ejercer la defensa judicial y extrajudicial de la entidad y atender requerimientos jurídicos, para salvaguardar sus intereses y cumplir con los requisitos constitucionales y legales","Intervención oportuna en las distintas actuaciones judiciales y extrajudiciales en que sea parte la entidad","Oportunidad en el seguimiento a los procesos en los despachos e instancias judiciales",null,"Porcentaje de procesos judiciales y extrajudiciales atendidos dentro de los términos legales vigentes","(No. de procesos jurídicos atendidos dentro de los términos legales vigentes)/Total de procesos jurídicos notificados)*100","Gestión","Calidad","Trimestral",1,"Porcentaje","SIPROJ Web\nORFEO","Positiva","No","En el análisis del indicador se presentará la desagregación por procesos judiciales y extrajudiciales.",2019,"Agosto"]
["Satisfacer las necesidades de los usuarios a través de la prestación de servicios eficientes, eficaces y efectivos","Gestión Jurídica","Ejercer la defensa judicial y extrajudicial de la entidad y atender requerimientos jurídicos, para salvaguardar sus intereses y cumplir con los requisitos constitucionales y legales","Cumplimiento de los requisitos establecidos para el reconocimiento deportivo y el aval de escuelas deportivas",null,null,"Satisfacción de los usuarios con el trámite de reconocimiento deportivo","(No. de usuarios satisfechos con el trámite de reconocimiento deportivo/Total de usuarios encuestados)*100","Gestión","Efectividad","Semestral",0.95,"Porcentaje","Encuesta de satisfacción de usuarios de reconocimiento deportivo","Positiva","No","En el análisis del indicador se presentarán los resultados desagregados por cada uno de los aspectos evaluados en la encuesta de satisfacción.",2019,"Agosto"]
["Mejorar continuamente los procesos del Sistema Integrado de Gestión","Gestión Jurídica","Ejercer la defensa judicial y extrajudicial de la entidad y atender requerimientos jurídicos, para salvaguardar sus intereses y cumplir con los requisitos constitucionales y legales","Oportunidad en la respuesta del trámite de otorgamiento deportivo (45 días hábiles siguientes al cumplimiento de requisitos de otorgamiento deportivo)","Vigencia y aplicabilidad de la normatividad empleada para el reconocimiento deportivo y el aval de escuelas deportivas",null,"Porcentaje de trámites de reconocimiento deportivo atendidos dentro del término legal vigente","(No. de trámites de reconocimiento deportivo atendidos dentro del término legal vigente/Total de trámites de reconocimiento deportivo atendidos)*100 ","Gestión","Calidad","Trimestral",0.92,"Porcentaje","Matriz de control de reconocimiento deportivo","Positiva","No",null,2019,"Agosto"]
["Mejorar continuamente los procesos del Sistema Integrado de Gestión","Gestión Jurídica","Ejercer la defensa judicial y extrajudicial de la entidad y atender requerimientos jurídicos, para salvaguardar sus intereses y cumplir con los requisitos constitucionales y legales","Oportunidad en la respuesta del trámite de aval de escuelas deportivas (58 días hábiles)","Vigencia y aplicabilidad de la normatividad empleada para el reconocimiento deportivo y el aval de escuelas deportivas",null,"Porcentaje de trámites de aval de escuelas deportivas atendidos dentro del término legal vigente","(No. de trámites de aval de escuelas deportivas atendidos dentro del término legal vigente/Total de trámites de aval de escuelas deportivas atendidos)*100","Gestión","Calidad","Trimestral",0.92,"Porcentaje","Matriz de control de aval de escuelas deportivas","Positiva","No",null,2019,"Agosto"]
["Mejorar continuamente los procesos del Sistema Integrado de Gestión","Gestión Jurídica","Ejercer la defensa judicial y extrajudicial de la entidad y atender requerimientos jurídicos, para salvaguardar sus intereses y cumplir con los requisitos constitucionales y legales","Oportunidad en la respuesta a conceptos de proyectos de acuerdo con los tiempos establecidos","Suministro oportuno de la información de carácter técnico, de oportunidad y conveniencia del proyecto por parte de las dependencias y áreas de la entidad",null,"Porcentaje de solicitudes de concepto a proyectos de acuerdo, decreto o ley atendidas dentro del tiempo establecido","(No. de solicitudes de concepto a proyectos de acuerdo, decreto o ley atendidas dentro del tiempo establecido/Total de solicitudes de concepto a proyectos de acuerdo, decreto o ley recibidas)*100","Gestión","Calidad","Semestral",0.9,"Porcentaje","Matriz de seguimiento a solicitudes Congreso y Concejo","Positiva","No","En el análisis del indicador se presentará la desagregación por proyectos de acuerdo, decreto y ley.",2019,"Agosto"]
["Mejorar continuamente los procesos del Sistema Integrado de Gestión","Gestión Jurídica","Ejercer la defensa judicial y extrajudicial de la entidad y atender requerimientos jurídicos, para salvaguardar sus intereses y cumplir con los requisitos constitucionales y legales","Recuperación de la cartera en mora",null,null,"Porcentaje de procesos de cobro de cartera efectuados","(No. de procesos con etapas de cobro efectuadas/Total de procesos de cobro remitidos con documentación completa)*100","Gestión","Eficacia","Cuatrimestral",1,"Porcentaje","Matriz de seguimiento cobro de cartera","Positiva","No","Los primeros cinco días hábiles de mayo se reportará el indicador con corte a 31 de diciembre del año anterior. \nLos primeros días de septiembre se reportará con corte 30 de abril de la vigencia.\nLos primeros días de enero se reportará con corte a 31 de agosto del año anterior.\nEn el análisis del indicador se presentará la desagregación por etapa (persuasivo y coactivo), así como también el porcentaje de recuperación de cartera.",2019,"Agosto",8,8,1,1,"Aceptable"]
["Mejorar continuamente los procesos del Sistema Integrado de Gestión","Gestión Jurídica","Ejercer la defensa judicial y extrajudicial de la entidad y atender requerimientos jurídicos, para salvaguardar sus intereses y cumplir con los requisitos constitucionales y legales","Intervención oportuna en las distintas actuaciones judiciales y extrajudiciales en que sea parte la entidad - tipos de daño en que se resulte demandado o condenado",null,null,"Índice de condenas adversas","(No. de condenas adversas/Total de procesos judiciales)*100","Gestión","Calidad","Semestral",0.08,"Porcentaje","Informe Siproj web mensual (procesos judiciales)","Negativa","No","El análisis del indicador debe evaluar dentro del comité de conciliación los procesos que cursen o hayan cursado en contra de la entidad, determinando causas generadoras de conflictos y los tipos de daño.",2019,"Agosto"]
["Mejorar continuamente los procesos del Sistema Integrado de Gestión","Gestión de Comunicaciones","Dar a conocer interna y externamente las actividades, programas y obras que realiza la entidad, para generar apropiación y participación que contribuyan al posicionamiento de la imagen institucional","Exigencia de la solicitud de servicios para todos los procesos con la información completa y detallada de lo requerido","Veracidad de la información reportada por los solicitantes del servicio ",null,"Porcentaje de solicitudes de servicios de comunicaciones atendidas dentro de los tiempos establecidos","(No. de solicitudes de servicio atendidas dentro de los tiempos establecidos/Total de solicitudes de servicio de comunicaciones recibidas)*100","Gestión","Calidad","Trimestral",0.9,"Porcentaje","Consolidado de solicitudes de servicios de comunicaciones","Positiva","No",null,2019,"Agosto"]
["Mejorar continuamente los procesos del Sistema Integrado de Gestión","Gestión de Comunicaciones","Dar a conocer interna y externamente las actividades, programas y obras que realiza la entidad, para generar apropiación y participación que contribuyan al posicionamiento de la imagen institucional","Relacionamiento con medios de comunicación","Análisis de los resultados obtenidos mediante el monitoreo de medios para facilitar la toma de decisiones",null,"Impacto de noticias publicadas en medios de comunicación","(No. de noticias positivas o neutras registradas/Total de noticias publicadas en medios de comunicación)*100","Gestión","Eficacia","Trimestral",1,"Porcentaje","Informes mensuales generados por la empresa contratada para realizar el monitoreo de medios","Positiva","No","En el análisis del indicador se presentará el resultado desagregado de noticias positivas y neutras, indicando los principales medios de comunicación.\nSe colocó una meta de 100%, mientras se levanta la línea base con la primera medición.",2019,"Agosto"]
["Mejorar continuamente los procesos del Sistema Integrado de Gestión","Gestión de Comunicaciones","Dar a conocer interna y externamente las actividades, programas y obras que realiza la entidad, para generar apropiación y participación que contribuyan al posicionamiento de la imagen institucional","Seguimiento a los cambios en las condiciones de publicación en redes sociales y página web",null,null,"Tasa de variación en el alcance total de las publicaciones en redes sociales","((Alcance total de publicaciones en el trimestre actual - Alcance total de publicaciones en el trimestre anterior)/Alcance total de publicaciones en el trimestre anterior)*100\n\nDonde:\n\nAlcance total de las publicaciones = Total de usuarios que vieron las publicaciones de redes sociales","Gestión","Eficacia","Trimestral",0.2,"Porcentaje","Métricas nativas de cada red social","Positiva","No","En el análisis del indicador se presentará el resultado desagregado del alcance de las publicaciones por cada red social. ",2019,"Agosto"]
["Mejorar continuamente los procesos del Sistema Integrado de Gestión","Gestión de Comunicaciones","Dar a conocer interna y externamente las actividades, programas y obras que realiza la entidad, para generar apropiación y participación que contribuyan al posicionamiento de la imagen institucional","Análisis de los resultados obtenidos mediante el monitoreo de medios para facilitar la toma de decisiones",null,null,"Salidas publicadas en medios de comunicación","N/A","Gestión","Eficacia","Mensual",80,"Número","Informes mensuales generados por la empresa contratada para realizar el monitoreo de medios","Positiva","No","En el análisis del indicador se presentará el valor estimado de las publicaciones en medios de comunicación.",2019,"Agosto",284,1,{"$f":"+T657/U657","v":284},{"$f":"+V657/L657","v":3.55},{"$f":"_xlfn.IFS(W657<=69%,\"Crítico\",W657>=90%,\"Aceptable\",W657>=70%,\"Tolerable\")","v":"Aceptable"}]
["Mejorar continuamente los procesos del Sistema Integrado de Gestión","Planeación de la Gestión","Establecer directrices para formular y realizar seguimiento a la planeación estratégica y operativa de la entidad con el propósito de contribuir al desarrollo de la misión y objetivos institucionales, así como facilitar la oportunidad y cumplimiento de los resultados esperados","Oportunidad, veracidad y calidad de la información de inversión y gestión",null,null,"Porcentaje de reportes de información presentados dentro de los tiempos programados","(No. de reportes de información elaborados y presentados/Total de reportes de información programados)*100 ","Gestión","Calidad","Trimestral",1,"Porcentaje","Cronograma de trabajo interno, plan operativo por dependencias (Oficina Asesora de Planeación), plan de adecuación y sostenibilidad SIGD-MIPG","Positiva","No","En el análisis del indicador se desagregará la programación para cada trimestre.",2019,"Septiembre",29,29,1,{"$f":"+V658/L658","v":1},"Aceptable"]
["Mejorar continuamente los procesos del Sistema Integrado de Gestión","Planeación de la Gestión","Establecer directrices para formular y realizar seguimiento a la planeación estratégica y operativa de la entidad con el propósito de contribuir al desarrollo de la misión y objetivos institucionales, así como facilitar la oportunidad y cumplimiento de los resultados esperados","Oportunidad en el seguimiento de las acciones institucionales para la mejora (correcciones, acciones correctivas, oportunidades de mejora, acciones para abordar riesgos)",null,null,"Porcentaje de acciones de mejora con seguimiento efectuado dentro del Sistema de Gestión","[No. de acciones de mejora con seguimiento efectuado dentro del tiempo programado/Total de acciones de mejora abiertas dentro del Sistema de Gestión de la Calidad (correcciones, acciones correctivas, oportunidades de mejora, acciones para abordar riesgos)]*100","Gestión","Eficacia","Mensual",1,"Porcentaje","Isolución","Positiva","No","En el análisis del indicador se presentará el resultado desagregado por cada tipología de mejora (corrección, acciones correctivas, oportunidades de mejora, acciones para abordar riesgos).",2019,"Septiembre",59,59,1,1,"Aceptable"]
["Mejorar continuamente los procesos del Sistema Integrado de Gestión","Gestión de Recursos Físicos","Administrar y controlar los bienes muebles y servicios para el funcionamiento administrativo de la entidad","Oportunidad en la atención de requerimientos y necesidades de servicios administrativos",null,null,"Porcentaje de mantenimientos realizados a la infraestructura física de la sede administrativa","(No. de mantenimientos realizados a la infraestructura física/Total de mantenimientos programados a la infraestructura física de la sede administrativa)*100","Gestión","Eficacia","Trimestral",0.9,"Porcentaje","Expendientes contractuales en plataforma ORFEO","Positiva","No",null,2019,"Septiembre",12,12,1,1.1111111111111112,"Aceptable"]
["Mejorar continuamente los procesos del Sistema Integrado de Gestión","Gestión de Asuntos Locales","Desarrollar acciones a nivel local para promover la participación ciudadana, brindar acompañamiento a las alcaldías locales en temas misionales de la entidad y ofertar sus programas","Oportunidad en la emisión del concepto previo y favorable según los tiempos establecidos en la normatividad vigente",null,null,"Porcentaje de conceptos previos tramitados dentro de los términos legales vigentes","(No. de conceptos previos tramitados dentro de los términos legales vigentes/Total de solicitudes de conceptos previos recibidas)*100","Gestión","Calidad","Trimestral",0.5,"Porcentaje","Matriz de seguimiento a conceptos previos tramitados","Positiva","No",null,2019,"Septiembre",11,20,0.55000000000000004,1.1000000000000001,"Aceptable"]
["Mejorar continuamente los procesos del Sistema Integrado de Gestión","Control, Evaluación y Seguimiento","Evaluar los controles y la gestión de la entidad con el fin de identificar e implementar acciones de mejora, en pro de la sostenibilidad del Sistema de Control Interno","Pertinencia y oportunidad en la entrega de los resultados del seguimiento a las partes interesadas","Oportunidad y calidad en la información reportada a las entidades competentes del orden nacional y distrital",null,"Porcentaje de informes presentados por la tercera línea de defensa dentro de los tiempos programados","(No. de informes de ley y de gestión elaborados y presentados dentro de los tiempos programados/Total de informes de ley y de gestión a cargo de la tercera línea de defensa )*100  ","Gestión","Calidad","Trimestral",1,"Porcentaje","Plan anual de auditoría\nCronograma presentación de informes","Positiva","No","En el análisis del indicador se presentará el resultado desagregado por cada uno de los informes realizados.",2019,"Septiembre",18,18,1,1,"Aceptable"]
["Mejorar continuamente los procesos del Sistema Integrado de Gestión","Control, Evaluación y Seguimiento","Evaluar los controles y la gestión de la entidad con el fin de identificar e implementar acciones de mejora, en pro de la sostenibilidad del Sistema de Control Interno","Cumplimiento de los objetivos definidos en el plan de auditoría conforme al plan de pruebas","Cobertura de las unidades a auditar de acuerdo con los parámetros establecidos en la matriz de priorización, en concordancia con los recursos disponibles para la ejecución del Plan Anual de Auditoría",null,"Índice de eficacia de auditorías internas de control interno","(Índice auditoría 1 + índice auditoría 2 +...+Índice auditoría n)/Total de auditorías realizadas\nDonde: \nÍndice auditoría n = Calificación porcentual de la variable Objetivos Específicos*Peso de la variable Objetivos Específicos + Calificación porcentual de la variable Actividad Plan de Auditoría*Peso de la variable Actividad Plan de Auditoría + Calificación porcentual de la variable Oportunidad*Peso de la variable Oportunidad\nPesos de las variables:\nObjetivos Específicos = 40%\nActividades Plan de Auditoría = 30%\nOportunidad = 30%. Esta se medirá tomando como fecha de referencia la de emisión del informe preliminar de auditoría.\nn = número de auditorías realizadas","Gestión","Eficacia","Trimestral",0.85,"Porcentaje","Planes de cada una de las auditorías","Positiva","No","En el análisis del indicador se presentará el resultado desagregado por cada una de las auditorías realizadas.",2019,"Septiembre",4.5999999999999996,5,0.91999999999999993,1.0823529411764705,"Aceptable"]
["Mejorar continuamente los procesos del Sistema Integrado de Gestión","Gestión Financiera","Administrar los recursos financieros asignados y realizar los respectivos registros, para el cumplimiento de las funciones de la entidad y pago de sus obligaciones con terceros","Oportunidad en el seguimiento de las partidas pendientes por conciliar",null,null,"Porcentaje de partidas conciliatorias identificadas dentro del tiempo establecido","(No. de partidas conciliatorias identificadas con edad inferior a 60 días/Total de partidas reportadas)*100","Gestión","Calidad","Mensual",0.9,"Porcentaje","Sistema de información SEVEN","Positiva","No",null,2019,"Septiembre",83,83,1,1.1111111111111112,"Aceptable"]
["Mejorar continuamente los procesos del Sistema Integrado de Gestión","Gestión Financiera","Administrar los recursos financieros asignados y realizar los respectivos registros, para el cumplimiento de las funciones de la entidad y pago de sus obligaciones con terceros","Oportunidad e integridad de la información necesaria para realizar las diferentes conciliaciones",null,null,"Porcentaje de obligaciones contingentes registradas correctamente en la contabilidad","(No. de procesos registrados correctamente en la contabilidad/Total de procesos reportados en SIPROJ Web)*100","Gestión","Calidad","Trimestral",1,"Porcentaje","Sistema de información SEVEN","Positiva","No",null,2019,"Septiembre",51,51,1,1,"Aceptable"]
["Mejorar continuamente los procesos del Sistema Integrado de Gestión","Gestión Financiera","Administrar los recursos financieros asignados y realizar los respectivos registros, para el cumplimiento de las funciones de la entidad y pago de sus obligaciones con terceros","Oportunidad en la presentación de informes y estados financieros a los diferentes entes de vigilancia y control",null,null,"Porcentaje de notas a los estados financieros reveladas correctamente","(No. de notas sin observaciones por parte de los órganos de control internos y externos/Total de notas a los estados financieros elaboradas)*100","Gestión","Calidad","Anual",0.95,"Porcentaje","Informes de entes de control y vigilancia","Positiva","No",null,2019,"Septiembre"]
["Mejorar continuamente los procesos del Sistema Integrado de Gestión","Gestión Financiera","Administrar los recursos financieros asignados y realizar los respectivos registros, para el cumplimiento de las funciones de la entidad y pago de sus obligaciones con terceros","Oportunidad en la presentación de informes y estados financieros a los diferentes entes de vigilancia y control","Oportunidad en la presentación de las declaraciones tributarias",null,"Porcentaje de informes financieros presentados a los entes de vigilancia y control dentro de los términos legales vigentes","(No. de informes financieros presentados dentro de los términos legales vigentes/Total de informes financieros a reportar a los entes de vigilancia y control)*100","Gestión","Calidad","Trimestral",1,"Porcentaje","Matriz de seguimiento a la presentación de informes ","Positiva","No",null,2019,"Septiembre",9,9,1,1,"Aceptable"]
["Satisfacer las necesidades de los usuarios a través de la prestación de servicios eficientes, eficaces y efectivos","Promoción de la Recreación","Desarrollar actividades recreativas en función de las características y necesidades de la población de Bogotá D.C., para promover el aprovechamiento del tiempo libre y el mejoramiento en la calidad de vida","Satisfacción del usuario con las actividades recreativas realizadas",null,null,"Satisfacción de los usuarios con los eventos y/o programas recreativos","(No. de usuarios satisfechos con los eventos y/o programas recreativos/Total de usuarios de eventos y/o programas recreativos encuestados)*100","Gestión","Efectividad","Anual",1,"Porcentaje","Encuesta de satisfacción sobre eventos y/o programas recreativos","Positiva","No","En el análisis del indicador se presentará el resultado desagregado por programa y por cada uno de los aspectos evaluados en la encuesta de satisfacción.\nSe colocó una meta de 100%, mientras se levanta la línea base con la primera medición.",2019,"Septiembre"]
["Mejorar continuamente los procesos del Sistema Integrado de Gestión","Promoción de la Recreación","Desarrollar actividades recreativas en función de las características y necesidades de la población de Bogotá D.C., para promover el aprovechamiento del tiempo libre y el mejoramiento en la calidad de vida","Cumplimiento del programa de actividades recreativas, teniendo en cuenta lo establecido en las fichas técnicas o según lo concertado con la comunidad e instituciones",null,null,"Porcentaje de actividades recreativas que cumplen con los requisitos para su ejecución","(No. de actividades recreativas que cumplen con los requisitos definidos para su ejecución/Total de actividades recreativas realizadas)*100","Gestión","Eficacia","Trimestral",0.97,"Porcentaje","Sistema de información misional - SIM","Positiva","No","En el análisis del indicador se presentará el resultado desagregado por programa y por actividad.",2019,"Septiembre",15024,15094,0.99536239565390217,1.0261467996431981,"Aceptable"]
["Satisfacer las necesidades de los usuarios a través de la prestación de servicios eficientes, eficaces y efectivos","Fomento al Deporte","Desarrollar e implementar programas deportivos y de actividad física, para contribuir con el mejoramiento de la calidad de vida en la población de Bogotá D.C.","Satisfacción del usuario con las actividades deportivas  realizadas",null,null,"Satisfacción de los usuarios con las actividades realizadas en los programas deportivos","(No. de usuarios satisfechos con las actividades deportivas realizadas/Total de usuarios de actividades deportivas encuestados)*100","Gestión","Efectividad","Anual",1,"Porcentaje","Encuesta de satisfacción sobre actividades/programas deportivos","Positiva","No","En el análisis del indicador se presentará el resultado desagregado por programa y por cada uno de los aspectos evaluados en la encuesta de satisfacción.\nSe colocó una meta de 100%, mientras se levanta la línea base con la primera medición.",2019,"Septiembre"]
["Mejorar continuamente los procesos del Sistema Integrado de Gestión","Fomento al Deporte","Desarrollar e implementar programas deportivos y de actividad física, para contribuir con el mejoramiento de la calidad de vida en la población de Bogotá D.C.","Cambios comportamentales como resultados de los programas deportivos y de actividad física",null,null,"Cambio comportamental frente a la actividad física y el deporte","(No. de beneficiarios con percepción de cambio comportamental alrededor de las 4 dimensiones de la alfabetización física/Total de beneficiarios de programas deportivos y de actividad física seleccionados en la muestra)*100","Gestión","Efectividad","Anual",1,"Porcentaje","Encuesta para medir las 4 dimensiones de la alfabetización física","Positiva","No","La metodología se aplicará sobre una muestra por cada por cada programa. Se define en 4 tipos de mediciones:\n1. Medición dimensión competencia física. Aplicar test de resistencia, fuerza de torso, habilidades y flexibilidad.\n2. Medición dimensiones: competencia cognitiva, comportamental y motivacional a través de un cuestionario (on-line o presencial).\nSe colocó una meta de 100%, mientras se levanta la línea base con la primera medición.",2019,"Septiembre"]
["Satisfacer las necesidades de los usuarios a través de la prestación de servicios eficientes, eficaces y efectivos","Servicio a la Ciudadanía","Brindar información y atender los requerimientos de los grupos de valor y de interés de la entidad para responder a sus necesidades en cumplimiento de sus derechos","Oportunidad y calidad en la respuesta a los requerimientos de los grupos de valor e interés de la entidad","Satisfacción del ciudadano frente a las respuestas a sus requerimientos",null,"Satisfacción de peticionarios con la respuesta dada a sus requerimientos","(No. de peticionarios satisfechos con la respuesta dada a sus peticiones, quejas, reclamos y sugerencias/Total de peticionarios contactados)*100","Gestión","Efectividad","Mensual",0.8,"Porcentaje","Base de datos de gestión de PQRS","Positiva","No",null,2019,"Septiembre",37,43,0.86046511627906974,1.0755813953488371,"Aceptable"]
["Mejorar continuamente los procesos del Sistema Integrado de Gestión","Gestión de Recursos Físicos","Administrar y controlar los bienes muebles y servicios para el funcionamiento administrativo de la entidad","Oportunidad en la atención de requerimientos y necesidades de servicios administrativos",null,null,"Porcentaje de requerimientos de mantenimiento correctivo atendidos en la sede administrativa dentro de los tiempos establecidos","(No. de requerimientos de mantenimiento correctivo atendidos dentro de los tiempos establecidos/Total de requerimientos de mantenimiento correctivo reportados en la sede administrativa)*100","Gestión","Calidad","Trimestral",0.95,"Porcentaje","Aplicativo mesa de ayuda OTRS","Positiva","No",null,2019,"Septiembre",61,61,1,1.0526315789473684,"Aceptable"]
["Mejorar continuamente los procesos del Sistema Integrado de Gestión","Adquisición de Bienes y Servicios","Realizar actividades contractuales para adquirir bienes y servicios con la oportunidad y de acuerdo con las especificaciones establecidas por la entidad","Cumplimiento de requisitos de acuerdo con la modalidad de selección",null,null,"Porcentaje de procesos de selección publicados dentro del tiempo establecido","(No. de actos de apertura de procesos de selección publicados en un tiempo menor o igual a 30 días hábiles después de la radicación/Total de actos de apertura expedidos)*100","Gestión","Calidad","Trimestral",0.9,"Porcentaje","Plataforma ORFEO y SECOP","Positiva","No","En el análisis del indicador se presentará el resultado desagregado para licitación pública, concurso de méritos y selección abreviada.",2019,"Septiembre",8,8,1,1.1111111111111112,"Aceptable"]
["Mejorar continuamente los procesos del Sistema Integrado de Gestión","Adquisición de Bienes y Servicios","Realizar actividades contractuales para adquirir bienes y servicios con la oportunidad y de acuerdo con las especificaciones establecidas por la entidad","Oportunidad en la suscripción y legalización del contrato",null,null,"Porcentaje de contratos legalizados dentro del tiempo establecido","(No. de contratos legalizados en un tiempo menor o igual a 10 días hábiles a partir del acto administrativo de adjudicación/Total de procesos de selección adjudicados)*100","Gestión","Calidad","Mensual",0.8,"Porcentaje","SECOP y Plataforma ORFEO ","Positiva","No","En el análisis del indicador se presentará el resultado desagregado para licitación pública, concurso de méritos y selección abreviada.",2019,"Septiembre",3,9,0.33333333333333331,0.41666666666666663,"Crítico"]
["Mejorar continuamente los procesos del Sistema Integrado de Gestión","Adquisición de Bienes y Servicios","Realizar actividades contractuales para adquirir bienes y servicios con la oportunidad y de acuerdo con las especificaciones establecidas por la entidad","Definición clara y precisa de requisitos técnicos, financieros, económicos, jurídicos y de riesgos de acuerdo con el bien o servicio a adquirir",null,null,"Porcentaje de procesos de obra tramitados en análisis de costos dentro del tiempo establecido","(No. de procesos de obra (todas las Subdirecciones) tramitados en oportunidad al recibo del memorando con la solicitud estudio del sector (20 días)/Total de procesos de obra recibidos)*100","Gestión","Calidad","Trimestral",1,"Porcentaje","Matriz de tráfico ACEE","Positiva","No",null,2019,"Septiembre",9,9,1,1,"Aceptable"]
["Mejorar continuamente los procesos del Sistema Integrado de Gestión","Adquisición de Bienes y Servicios","Realizar actividades contractuales para adquirir bienes y servicios con la oportunidad y de acuerdo con las especificaciones establecidas por la entidad","Definición clara y precisa de requisitos técnicos, financieros, económicos, jurídicos y de riesgos de acuerdo con el bien o servicio a adquirir",null,null,"Porcentaje de procesos diferentes a obra tramitados en análisis de costos dentro del tiempo establecido","(No. de procesos diferentes a obra tramitados en oportunidad al recibo del memorando con la solicitud estudio del sector (10 días hábiles)/Total de procesos recibidos diferentes a obra)*100","Gestión","Calidad","Trimestral",0.9,"Porcentaje","Matriz de tráfico ACEE","Positiva","No","En el análisis del indicador se presentará el resultado desagregado para procesos diferentes a obra.",2019,"Septiembre",25,26,0.96153846153846156,1.0683760683760684,"Aceptable"]
["Mejorar continuamente los procesos del Sistema Integrado de Gestión","Adquisición de Bienes y Servicios","Realizar actividades contractuales para adquirir bienes y servicios con la oportunidad y de acuerdo con las especificaciones establecidas por la entidad","Definición clara y precisa de requisitos técnicos, financieros, económicos, jurídicos y de riesgos de acuerdo con el bien o servicio a adquirir",null,null,"Porcentaje de procesos requeridos por precios artificialmente bajos","(No. de procesos (excepto Subastas SAS) requeridos por precios artificialmente bajos/Total de procesos evaluados)*100","Gestión","Calidad","Trimestral",0.15,"Porcentaje","Evaluación económica de los proponentes\n\nAnálisis de precios realizado por la ACEE","Negativa","No","En el análisis del indicador se presentará el resultado desagregado por tipo de proceso.",2019,"Septiembre",4,30,0.13333333333333333,{"$f":"((L678-V678)+L678)/L678","v":1.1111111111111112},"Aceptable"]
["Mejorar continuamente los procesos del Sistema Integrado de Gestión","Control, Evaluación y Seguimiento","Evaluar los controles y la gestión de la entidad con el fin de identificar e implementar acciones de mejora, en pro de la sostenibilidad del Sistema de Control Interno","Pertinencia y oportunidad en la entrega de los resultados del seguimiento a las partes interesadas",null,null,"Porcentaje de acciones de mejoramiento interno con seguimiento efectuado","(No. de acciones de mejoramiento interno con seguimiento efectuado)/Total de acciones de mejoramiento interno abiertas de auditorías internas de control interno)*100","Gestión","Eficacia","Trimestral",1,"Porcentaje","Plataforma Isolución","Positiva","No","En el análisis del indicador se presentará el resultado desagregado por proceso.",2019,"Septiembre",115,201,0.57213930348258701,{"$f":"+V679/L679","v":0.57213930348258701},"Crítico"]
["Mejorar continuamente los procesos del Sistema Integrado de Gestión","Control, Evaluación y Seguimiento","Evaluar los controles y la gestión de la entidad con el fin de identificar e implementar acciones de mejora, en pro de la sostenibilidad del Sistema de Control Interno","Pertinencia y oportunidad en la entrega de los resultados del seguimiento a las partes interesadas",null,null,"Porcentaje de acciones de mejoramiento externo con seguimiento efectuado","(No. de acciones de mejoramiento externo con seguimiento efectuado)/Total de acciones de mejoramiento externo abiertas de auditorías externas)*100","Gestión","Eficacia","Trimestral",1,"Porcentaje","Matrices de consolidación del estado de las acciones de los diferentes entes de control y vigilancia","Positiva","No","En el análisis del indicador se presentará el resultado desagregado por auditoría externa.",2019,"Septiembre",146,146,1,1,"Aceptable"]
["Mejorar continuamente los procesos del Sistema Integrado de Gestión","Gestión Financiera","Administrar los recursos financieros asignados y realizar los respectivos registros, para el cumplimiento de las funciones de la entidad y pago de sus obligaciones con terceros","Oportunidad en la expedición de los certificados presupuestales y en la presentación de los informes de ejecución",null,null,"Porcentaje de ejecución presupuestal en gastos de funcionamiento","(Presupuesto de funcionamiento ejecutado/Presupuesto disponible de funcionamiento)*100","Gestión","Eficiencia","Mensual",0.95,"Porcentaje","Ejecución presupuestal en SEVEN","Positiva","Si","La meta es anual con medición y análisis mensual.\nLa medición está a cargo del Área Financiera y el análisis a cargo de la Subdirección Administrativa y Financiera.\nLa medición y el análisis se deben realizar a más tardar el quinto día hábil de cada mes.\nUna vez se realice el Comité Financiero, el Área Financiera debe enviar a la Oficina Asesora de Planeación la presentación correspondiente, con el análisis respectivo en cuanto al desempeño del indicador.",2019,"Septiembre",22482887565,35208442000,0.63856524991932329,0.67217394728349822]
["Mejorar continuamente los procesos del Sistema Integrado de Gestión","Gestión Financiera","Administrar los recursos financieros asignados y realizar los respectivos registros, para el cumplimiento de las funciones de la entidad y pago de sus obligaciones con terceros","Oportunidad en la expedición de los certificados presupuestales y en la presentación de los informes de ejecución","Oportunidad en la autorización de giro de los recursos de transferencia",null,"Porcentaje de ejecución presupuestal en gastos de inversión","(Presupuesto de inversión ejecutado/Presupuesto disponible de inversión)*100","Gestión","Eficiencia","Mensual",1,"Porcentaje","Ejecución presupuestal en SEVEN","Positiva","Si","La meta es anual con medición y análisis mensual.\nLa medición está a cargo del Área Financiera y el análisis a cargo de los Ordenadores del Gasto.\nLa medición y el análisis se deben realizar a más tardar el quinto día hábil de cada mes.\nUna vez se realice el Comité Financiero, el Área Financiera debe enviar a la Oficina Asesora de Planeación la presentación correspondiente, con el análisis respectivo en cuanto al desempeño del indicador.",2019,"Septiembre",416648944026,742020022000,0.56150633631554492,0.56150633631554492]
["Mejorar continuamente los procesos del Sistema Integrado de Gestión","Gestión Financiera","Administrar los recursos financieros asignados y realizar los respectivos registros, para el cumplimiento de las funciones de la entidad y pago de sus obligaciones con terceros","Oportunidad en el pago de las obligaciones financieras de la entidad",null,null,"Porcentaje de ejecución del programa anual de caja","(Recursos ejecutados de reserva, vigencia y pasivos exigibles/Recursos programados de reserva, vigencia y pasivos exigibles)*100","Gestión","Eficiencia","Mensual",1,"Porcentaje","Sistema de información SEVEN","Positiva","Si","La meta es anual con medición y análisis mensual.\nLa medición está a cargo del Área Financiera y el análisis a cargo de los Ordenadores del Gasto.\nLa medición y el análisis se deben realizar a más tardar el quinto día hábil de cada mes.\nUna vez se realice el Comité Financiero, el Área Financiera debe enviar a la Oficina Asesora de Planeación la presentación correspondiente, con el análisis respectivo en cuanto al desempeño del indicador.",2019,"Septiembre",3233669,3734624,{"$f":"+T683/U683","v":0.86586199842340217},0.86586199842340217]
["Mejorar continuamente los procesos del Sistema Integrado de Gestión","Gestión Financiera","Administrar los recursos financieros asignados y realizar los respectivos registros, para el cumplimiento de las funciones de la entidad y pago de sus obligaciones con terceros","Oportunidad en el pago de las obligaciones financieras de la entidad","Oportunidad en la causación de ordenes de pago que cumplan con todos los requisitos establecidos","Oportunidad y veracidad de la información necesaria para la causación de las ordenes de pago reportada por los ordenadores del gasto","Porcentaje de cuentas individuales pagadas dentro del tiempo establecido","(No. de cuentas individuales pagadas en un tiempo menor o igual a 6 días/Total de cuentas de pago individuales tramitadas)*100 ","Gestión","Calidad","Mensual",1,"Porcentaje","Bitácora de cuentas en SEVEN","Positiva","No","La medición y el análisis están a cargo del Área Financiera.\nEn el análisis del indicador se presentará el resultado del tiempo promedio en cada una de las etapas para el pago, según la bitácora de cuentas de SEVEN.",2019,"Septiembre",250,250,1,1,{"$f":"_xlfn.IFS(W684<=69%,\"Crítico\",W684>=90%,\"Aceptable\",W684>=70%,\"Tolerable\")","v":"Aceptable"}]
["Mejorar continuamente los procesos del Sistema Integrado de Gestión","Gestión Financiera","Administrar los recursos financieros asignados y realizar los respectivos registros, para el cumplimiento de las funciones de la entidad y pago de sus obligaciones con terceros","Oportunidad en el pago de las obligaciones financieras de la entidad","Oportunidad en la causación de ordenes de pago que cumplan con todos los requisitos establecidos","Oportunidad y veracidad de la información necesaria para la causación de las ordenes de pago reportada por los ordenadores del gasto","Porcentaje de cuentas colectivas pagadas dentro del tiempo establecido","(No. de cuentas colectivas pagadas en un tiempo menor o igual a 10 días/Total de cuentas de pago colectivas tramitadas)*100","Gestión","Calidad","Mensual",1,"Porcentaje","Bitácora de cuentas en SEVEN","Positiva","No","La medición y el análisis están a cargo del Área Financiera.\nEn el análisis del indicador se debe presentar el resultado del tiempo promedio en cada una de las etapas para el pago, según la bitácora de cuentas de SEVEN.",2019,"Septiembre",56,56,1,1,{"$f":"_xlfn.IFS(W685<=69%,\"Crítico\",W685>=90%,\"Aceptable\",W685>=70%,\"Tolerable\")","v":"Aceptable"}]
["Implementar las políticas y líneas de acción para la preservación e integridad de la documentación","Gestión Documental","Administrar, conservar y custodiar la documentación generada en la entidad, desde su origen hasta su disposición final, para preservar la memoria institucional","Actualización del inventario documental en el Formato Único de Inventario Documental, con base en la aplicación de las tablas de retención documental","Cumplimiento de los tiempos de retención documental establecidos en las tablas","Actualización de los instrumentos archivísticos","Porcentaje de inventario validado del fondo documental acumulado del archivo central","(No. de metros lineales de inventario validado en cuanto a series, subseries, asuntos y oficinas productoras/Total de metros lineales de archivo inventariado en estado natural del archivo central)*100 ","Gestión","Eficacia","Mensual",1,"Porcentaje","Matriz de seguimiento a inventario documental","Positiva","Si","La meta es anual con medición y análisis mensual",2019,"Septiembre",1621.46,2180.5,0.74361843613850032,0.74361843613850032]
["Implementar las políticas y líneas de acción para la preservación e integridad de la documentación","Gestión Documental","Administrar, conservar y custodiar la documentación generada en la entidad, desde su origen hasta su disposición final, para preservar la memoria institucional","Oportunidad en las transferencias documentales de acuerdo con los tiempos de retención establecidos en las tablas",null,null,"Porcentaje de transferencias primarias realizadas de acuerdo con los tiempos de retención","(No. de transferencias primarias realizadas de acuerdo con los tiempos de retención establecidos en las TRD/Total de transferencias documentales programadas)*100","Gestión","Eficacia","Mensual",0.8,"Porcentaje","Matriz de seguimiento a transferencias documentales","Positiva","Si","La meta es anual con medición y análisis mensual",2019,"Septiembre",42,33,1.2727272727272727,1.5909090909090908]
["Implementar las políticas y líneas de acción para la preservación e integridad de la documentación","Gestión Documental","Administrar, conservar y custodiar la documentación generada en la entidad, desde su origen hasta su disposición final, para preservar la memoria institucional","Cumplimiento de los estándares de temperatura, humedad relativa y luminosidad de los espacios de almacenamiento de material documental, dentro de los rangos establecidos en la normatividad vigente",null,null,"Porcentaje de espacios controlados para la conservación documental","(No. de espacios monitoreados e intervenidos/Total de espacios monitoreados)*100","Gestión","Eficacia","Mensual",1,"Porcentaje","Informe de monitoreo de espacios controlados","Positiva","No","La medición es mes vencido",2019,"Septiembre",11,11,1,1,{"$f":"_xlfn.IFS(W688<=69%,\"Crítico\",W688>=90%,\"Aceptable\",W688>=70%,\"Tolerable\")","v":"Aceptable"}]
["Mejorar continuamente los procesos del Sistema Integrado de Gestión","Servicio a la Ciudadanía","Brindar información y atender los requerimientos de los grupos de valor y de interés de la entidad para responder a sus necesidades en cumplimiento de sus derechos","Oportunidad y calidad en la respuesta a los requerimientos de los grupos de valor e interés de la entidad",null,null,"Porcentaje de peticiones, quejas, reclamos y sugerencias contestadas dentro de los términos legales vigentes","(No. de peticiones, quejas, reclamos y sugerencias contestadas en el aplicativo SDQS dentro de los términos legales vigentes/Total de peticiones, quejas, reclamos y sugerencias recibidas)*100","Gestión","Calidad","Mensual",1,"Porcentaje","Sistema SDQS","Positiva","No","La medición es mes vencido",2019,"Septiembre",299,324,0.9228395061728395,0.9228395061728395,"Aceptable"]
["Satisfacer las necesidades de los usuarios a través de la prestación de servicios eficientes, eficaces y efectivos","Servicio a la Ciudadanía","Brindar información y atender los requerimientos de los grupos de valor y de interés de la entidad para responder a sus necesidades en cumplimiento de sus derechos","Satisfacción del ciudadano frente a la atención brindada por la entidad",null,null,"Satisfacción del ciudadano con la atención recibida en los SUPERCADE","(No. de ciudadanos satisfechos con la atención recibida en los SUPERCADE/Total de ciudadanos atendidos en los SUPERCADE)*100","Gestión","Efectividad","Mensual",0.95,"Porcentaje","Encuesta de satisfacción con la atención brindada en SUPERCADES","Positiva","No",null,2019,"Septiembre",2971,2971,1,1.0526315789473684,"Aceptable"]
["Mejorar continuamente los procesos del Sistema Integrado de Gestión","Servicio a la Ciudadanía","Brindar información y atender los requerimientos de los grupos de valor y de interés de la entidad para responder a sus necesidades en cumplimiento de sus derechos","Oportunidad en la actualización de la información publicada en la sección de ley de transparencia en la página web de la entidad",null,null,"Porcentaje de información actualizada en ley de transparencia","(No. de subcategorías con información actualizada en la página web/Total de subcategorías definidas en ley de transparencia)*100","Gestión","Eficacia","Trimestral",1,"Porcentaje","Página web","Positiva","No",null,2019,"Septiembre",53,56,0.9464285714285714,0.9464285714285714,"Aceptable"]
["Mejorar continuamente los procesos del Sistema Integrado de Gestión","Servicio a la Ciudadanía","Brindar información y atender los requerimientos de los grupos de valor y de interés de la entidad para responder a sus necesidades en cumplimiento de sus derechos","Coherencia, claridad, solución de fondo, calidez y manejo del sistema en relación con los requerimientos atendidos por la entidad",null,null,"Porcentaje de requerimientos atendidos con oportunidad y calidad","(No. de respuestas a requerimientos sin observaciones en cuanto a los criterios de oportunidad y calidad/Total de requerimientos evaluados en el aplicativo SDQS)*100","Gestión","Eficacia","Mensual",0.8,"Porcentaje","SDQS y base de datos de gestión de PQRS","Positiva","No","La medición es mes vencido",2019,"Septiembre",230,279,0.82437275985663083,1.0304659498207884,"Aceptable"]
["Implementar buenas prácticas ambientales para la prevención de la contaminación en el marco de una Bogotá que defiende lo público en su función administrativa y de desarrollo institucional","Gestión de Recursos Físicos","Administrar y controlar los bienes muebles y servicios para el funcionamiento administrativo de la entidad","Calificación de la implementación del Plan Institucional de Gestión Ambiental, por parte de la Secretaría Distrital de Ambiente","Oportunidad en el reporte de formularios y registros electrónicos del PIGA ante la Secretaría Distrital de Ambiente",null,"Índice de implementación del PIGA","Promedio ponderado de cumplimiento de aspectos normativos y de implementación del PIGA, según auditoría realizada por la Secretaría Distrital de Ambiente en cada vigencia","Gestión","Eficacia","Anual",0.7,"Porcentaje","Informe de auditoría anual realizada por la Secretaría Distrital de Ambiente","Positiva","No","En el análisis del indicador se presentará el resultado desagregado por cada uno de los aspectos evaluados en la visita de control y seguimiento por parte de la Secretaría Distrital de Ambiente.\nLa meta está configurada como mayor a 70%.",2019,"Septiembre"]
["Proteger la integridad, confidencialidad y disponibilidad de la información","Gestión de Tecnología de la Información y las Comunicaciones","Proporcionar soluciones estratégicas de tecnologías de la información y las comunicaciones, para contribuir con la eficiencia administrativa, la mejora de los trámites y servicios y la protección de los activos de información de la entidad","Impacto del plan de remediación frente a las vulnerabilidades identificadas","Aseguramiento de incidencias en la seguridad de la información que afecten la confidencialidad, integridad y disponibilidad",null,"Porcentaje de remediación de vulnerabilidades de seguridad de la información","(No. de vulnerabilidades críticas o altas remediadas/Total de vulnerabilidades de seguridad de la información detectadas como críticas o altas)*100 ","Gestión","Eficacia","Anual",0.7,"Porcentaje","Matriz de vulnerabilidades","Positiva","No","La meta está configurada como mínimo 70%.",2019,"Septiembre"]
["Proteger la integridad, confidencialidad y disponibilidad de la información","Gestión de Tecnología de la Información y las Comunicaciones","Proporcionar soluciones estratégicas de tecnologías de la información y las comunicaciones, para contribuir con la eficiencia administrativa, la mejora de los trámites y servicios y la protección de los activos de información de la entidad","Avances en la implementación de gobierno digital de acuerdo con los componentes evaluados por MINTIC",null,null,"Índice de implementación de gobierno digital","Sumatoria de la calificación obtenida por cada componente/Total de componentes de la política de gobierno digital","Gestión","Eficacia","Anual",0.65,"Porcentaje","Instrumento de medición suministrado para el seguimiento a la política de gobierno digital  ","Positiva","No","En el análisis del indicador se presentará el resultado desagregado de las calificaciones obtenidas en cada componente de la política de seguridad digital.",2019,"Septiembre"]
["Mejorar continuamente los procesos del Sistema Integrado de Gestión","Gestión de Tecnología de la Información y las Comunicaciones","Proporcionar soluciones estratégicas de tecnologías de la información y las comunicaciones, para contribuir con la eficiencia administrativa, la mejora de los trámites y servicios y la protección de los activos de información de la entidad","Cumplimiento del Plan Estratégico de Tecnologías de la Información PETI",null,null,"Porcentaje de avance en proyectos de TI","(No. de hitos en proyectos de TI alcanzados/Total de hitos en proyectos de TI programados en la vigencia)*100","Gestión","Eficacia","Semestral",1,"Porcentaje","Cronograma de proyectos del PETI","Positiva","Si","La meta es anual con medición y análisis semestral.",2019,"Septiembre"]
["Proteger la integridad, confidencialidad y disponibilidad de la información","Gestión de Tecnología de la Información y las Comunicaciones","Proporcionar soluciones estratégicas de tecnologías de la información y las comunicaciones, para contribuir con la eficiencia administrativa, la mejora de los trámites y servicios y la protección de los activos de información de la entidad","Disponibilidad de los sistemas de información de la entidad",null,null,"Porcentaje de disponibilidad de los sistemas de información","(No. de horas disponibles de los sistemas de información/Total de horas en servicio de los sistemas de información)*100","Gestión","Eficiencia","Mensual",0.9,"Porcentaje","Herramienta de monitoreo ZABBIX","Positiva","No","En el análisis del indidicador se presentará el resultado desagregado de disponibilidad en ORFEO, SEVEN, KACTUS y SIM.\nLa meta está configurada como mayor o igual a 90%.",2019,"Septiembre",719.75,720,0.99965277777777772,1.1107253086419753,{"$f":"_xlfn.IFS(W697<=69%,\"Crítico\",W697>=90%,\"Aceptable\",W697>=70%,\"Tolerable\")","v":"Aceptable"}]
["Mejorar continuamente los procesos del Sistema Integrado de Gestión","Gestión de Tecnología de la Información y las Comunicaciones","Proporcionar soluciones estratégicas de tecnologías de la información y las comunicaciones, para contribuir con la eficiencia administrativa, la mejora de los trámites y servicios y la protección de los activos de información de la entidad","Disponibilidad de los servicios de comunicaciones en la entidad, según los acuerdos de niveles de servicios establecidos",null,null,"Porcentaje de disponibilidad de los servicios de comunicaciones","(No. de horas disponibles de los servicios de comunicaciones /Total de horas de los servicios de comunicaciones)*100","Gestión","Eficiencia","Mensual",0.9,"Porcentaje","Herramienta de monitoreo ZABBIX","Positiva","No","En el análisis del indidicador se presentará el resultado desagregado de disponibilidad en Internet y Telefonía IP.\nLa meta está configurada como mayor o igual a 90%.",2019,"Septiembre",719.98,720,0.99997222222222226,1.1110802469135803,"Aceptable"]
["Mejorar continuamente los procesos del Sistema Integrado de Gestión","Gestión de Tecnología de la Información y las Comunicaciones","Proporcionar soluciones estratégicas de tecnologías de la información y las comunicaciones, para contribuir con la eficiencia administrativa, la mejora de los trámites y servicios y la protección de los activos de información de la entidad","Incidencias reportadas en el funcionamiento del módulo o sistema de información implementado","Cumplimiento de los acuerdos de niveles de servicios establecidos",null,"Porcentaje de solicitudes de servicio tecnológico atendidas dentro de los tiempos establecidos","(No. de solicitudes atendidas dentro de los tiempos establecidos en los acuerdos de nivel de servicio/Total de solicitudes de servicio tecnológico recibidas)*100","Gestión","Calidad","Mensual",0.9,"Porcentaje","Herramienta GLPI","Positiva","No",null,2019,"Septiembre",655,658,0.99544072948328266,1.1060452549814253,"Aceptable"]
["Mejorar continuamente los procesos del Sistema Integrado de Gestión","Gestión de Talento Humano","Gestionar el potencial del talento humano como factor estratégico, para contribuir con el desarrollo de la entidad en un ambiente seguro y saludable","Cumplimiento de compromisos y competencias del servidor público en el desempeño laboral","Oportunidad en el seguimiento y la evaluación anual u ordinaria del servidor público para continuar su permanencia en el servicio",null,"Índice de desempeño laboral de funcionarios","(Sumatoria de calificaciones finales de la evaluación de desempeño de los funcionarios/Total de funcionarios evaluados)*100","Gestión","Eficacia","Anual",0.9,"Porcentaje","Consolidado de las calificaciones finales de la evaluación de desempeño","Positiva","No","En el análisis del indicador se presentará el resultado desagregado por niveles jerárquicos y comparar con la evaluación de las áreas.\nLa meta está configurada como mayor a 90%.\nNota: Se mide para vigencia 2018-2019.",2019,"Septiembre",null,null,null,null,"Crítico"]
["Mejorar continuamente los procesos del Sistema Integrado de Gestión","Gestión de Talento Humano","Gestionar el potencial del talento humano como factor estratégico, para contribuir con el desarrollo de la entidad en un ambiente seguro y saludable","Cobertura de servidores públicos en las actividades del plan de bienestar e incentivos",null,null,"Porcentaje de funcionarios que participan en las actividades del plan de bienestar e incentivos","(No. de funcionarios participantes en las actividades del plan de bienestar e incentivos/Total de funcionarios de la entidad)*100 ","Gestión","Eficacia","Semestral",0.8,"Porcentaje","Registros de asistencia a las actividades del plan de bienestar","Positiva","No",null,2019,"Septiembre"]
["Mejorar continuamente los procesos del Sistema Integrado de Gestión","Gestión de Talento Humano","Gestionar el potencial del talento humano como factor estratégico, para contribuir con el desarrollo de la entidad en un ambiente seguro y saludable","Cobertura de servidores públicos en las actividades del plan institucional de capacitación",null,null,"Porcentaje de funcionarios que asisten a las actividades del plan institucional de capacitación","(No. de funcionarios asistentes a las actividades del plan institucional de capacitación/Total de funcionarios citados a las actividades del plan institucional de capacitación)*100","Gestión","Eficacia","Semestral",0.8,"Porcentaje","Registros de asistencia a las actividades del plan de capacitación","Positiva","No","Las capacitaciones que se incluyen en el indicador son las que implican recursos.",2019,"Septiembre"]
["Mejorar continuamente los procesos del Sistema Integrado de Gestión","Gestión de Talento Humano","Gestionar el potencial del talento humano como factor estratégico, para contribuir con el desarrollo de la entidad en un ambiente seguro y saludable","Evaluación del impacto de la capacitación en el desempeño de los servidores públicos y de la entidad",null,null,"Impacto de la capacitación en el desempeño laboral de funcionarios","(No. de funcionarios con capacitaciones efectivas/Total de funcionarios evaluados)*100","Gestión","Eficacia","Trimestral",0.95,"Porcentaje","Consolidado de las evaluaciones de impacto de la capacitación","Positiva","No",null,2019,"Septiembre",82,83,0.98795180722891562,1.0399492707672797,"Aceptable"]
["Mejorar continuamente los procesos del Sistema Integrado de Gestión","Gestión de Talento Humano","Gestionar el potencial del talento humano como factor estratégico, para contribuir con el desarrollo de la entidad en un ambiente seguro y saludable","Satisfacción de los servidores públicos frente a las actividades de  bienestar e incentivos","Satisfacción de los servidores públicos frente a las actividades de capacitación",null,"Índice de clima organizacional","Promedio ponderado de las dimensiones evaluadas en la encuesta de medición de clima organizacional","Gestión","Eficacia","Anual",0.8,"Porcentaje","Informe de medición de clima organizacional","Positiva","No","En el análisis del indicador se presentará el resultado desagregado por áreas y/o dependencias, y por las dimensiones evaluadas.",2019,"Septiembre"]
["Mejorar continuamente los procesos del Sistema Integrado de Gestión","Gestión de Talento Humano","Gestionar el potencial del talento humano como factor estratégico, para contribuir con el desarrollo de la entidad en un ambiente seguro y saludable","Cumplimiento del plan anual de  bienestar e incentivos",null,null,"Porcentaje de ejecución del plan anual de bienestar e incentivos","(No. de actividades de bienestar e incentivos desarrolladas/Total de actividades programadas en el plan anual de bienestar e incentivos)*100","Gestión","Eficacia","Semestral",1,"Porcentaje","Matriz de seguimiento a la ejecución de actividades de bienestar e incentivos","Positiva","Si","La meta es anual con medición y análisis semestral.",2019,"Septiembre"]
["Mejorar continuamente los procesos del Sistema Integrado de Gestión","Gestión de Talento Humano","Gestionar el potencial del talento humano como factor estratégico, para contribuir con el desarrollo de la entidad en un ambiente seguro y saludable","Cumplimiento del plan institucional de capacitación",null,null,"Porcentaje de ejecución del plan institucional de capacitación","(No. de actividades de capacitación desarrolladas/Total de actividades programadas en el plan institucional de capacitación)*100","Gestión","Eficacia","Semestral",1,"Porcentaje","Matriz de seguimiento a la ejecución de actividades de capacitación","Positiva","Si","La meta es anual con medición y análisis semestral.",2019,"Septiembre"]
["Prevenir los factores que afecten la salud y seguridad a fin de mejorar las condiciones del ambiente de trabajo","Gestión de Talento Humano","Gestionar el potencial del talento humano como factor estratégico, para contribuir con el desarrollo de la entidad en un ambiente seguro y saludable","Cumplimiento del plan anual de trabajo",null,null,"Porcentaje de ejecución del plan anual de seguridad y salud en el trabajo","(No. de actividades de seguridad y salud desarrolladas/Total de actividades programadas en el plan anual de seguridad y salud en el trabajo)*100","Gestión","Eficacia","Mensual",0.95,"Porcentaje","Plan de trabajo anual del Sistema de Gestión de Seguridad y Salud en el Trabajo","Positiva","No",null,2019,"Septiembre",248,269,0.92193308550185871,0.97045587947564083,{"$f":"_xlfn.IFS(W707<=69%,\"Crítico\",W707>=90%,\"Aceptable\",W707>=70%,\"Tolerable\")","v":"Aceptable"}]
["Prevenir los factores que afecten la salud y seguridad a fin de mejorar las condiciones del ambiente de trabajo","Gestión de Talento Humano","Gestionar el potencial del talento humano como factor estratégico, para contribuir con el desarrollo de la entidad en un ambiente seguro y saludable","Tasa de accidentalidad",null,null,"Tasa de accidentalidad","(No. de accidentes de trabajo reportados/Total de trabajadores (funcionarios y contratistas)*100","Gestión","Efectividad","Mensual",0.04,"Porcentaje","Matriz de accidentes de trabajo","Negativa","No","La meta está configurada como menor o igual a 4%.",2019,"Septiembre",86,3181,2.7035523420308079E-2,{"$f":"((L708-V708)+L708)/L708","v":1.3241119144922981},"Aceptable"]
["Prevenir los factores que afecten la salud y seguridad a fin de mejorar las condiciones del ambiente de trabajo","Gestión de Talento Humano","Gestionar el potencial del talento humano como factor estratégico, para contribuir con el desarrollo de la entidad en un ambiente seguro y saludable","Incidencia y prevalencia de enfermedades laborales",null,null," Prevalencia de la enfermedad laboral","(No. de casos de enfermedad laboral calificada/Total de funcionarios)*100","Gestión","Efectividad","Trimestral",0.02,"Porcentaje","Matriz de seguimiento de enfermedades laborales","Negativa","No","La meta está configurada como menor o igual a 2%.",2019,"Septiembre",4,248,1.6129032258064516E-2,{"$f":"((L709-V709)+L709)/L709","v":1.1935483870967742},"Aceptable"]
["Prevenir los factores que afecten la salud y seguridad a fin de mejorar las condiciones del ambiente de trabajo","Gestión de Talento Humano","Gestionar el potencial del talento humano como factor estratégico, para contribuir con el desarrollo de la entidad en un ambiente seguro y saludable","Incidencia y prevalencia de enfermedades laborales",null,null,"Incidencia de la enfermedad laboral","(No. de casos nuevos de enfermedad laboral calificados/Total de funcionarios)*100","Gestión","Efectividad","Trimestral",0.01,"Porcentaje","Matriz de seguimiento de enfermedades laborales","Negativa","No","La meta está configurada como menor o igual a 1%.",2019,"Septiembre",0,248,0,{"$f":"((L710-V710)+L710)/L710","v":2},"Aceptable"]
["Mejorar continuamente los procesos del Sistema Integrado de Gestión","Gestión de Recursos Físicos","Administrar y controlar los bienes muebles y servicios para el funcionamiento administrativo de la entidad","Confiabilidad del inventario de bienes devolutivos",null,null,"Porcentaje de inventario individual validado físicamente","(No. de elementos devolutivos del inventario individual validados físicamente/Total de elementos devolutivos del inventario individual registrados en el sistema de información SEVEN)*100 ","Gestión","Eficacia","Anual",1,"Porcentaje","Sistema de información SEVEN","Positiva","No",null,2019,"Septiembre"]
["Mejorar continuamente los procesos del Sistema Integrado de Gestión","Gestión de Recursos Físicos","Administrar y controlar los bienes muebles y servicios para el funcionamiento administrativo de la entidad","Confiabilidad del inventario de bienes devolutivos",null,null,"Porcentaje de inventario aleatorio validado físicamente en bodega","(No. de elementos devolutivos y de consumo en bodegas validados físicamente/Muestra de inventario de elementos devolutivos y de consumo registrados en el sistema de información SEVEN)*100 ","Gestión","Eficacia","Trimestral",1,"Porcentaje","Sistema de información SEVEN","Positiva","No",null,2019,"Septiembre",5,5,1,{"$f":"+V712/L712","v":1},"Aceptable"]
["Mejorar continuamente los procesos del Sistema Integrado de Gestión","Gestión de Asuntos Locales","Desarrollar acciones a nivel local para promover la participación ciudadana, brindar acompañamiento a las alcaldías locales en temas misionales de la entidad y ofertar sus programas","Cumplimiento de los compromisos adquiridos por la entidad, en el marco de las instancias de participación locales",null,null,"Porcentaje de compromisos atendidos en el marco de las instancias de participación locales","(No. de compromisos atendidos en las instancias Consejo Local de Gobierno, Unidad de Apoyo Técnico y Comisión Local Intersectorial de Participación /Total de compromisos generados en las instancias Consejo Local de Gobierno, Unidad de Apoyo Técnico y Comisión Local Intersectorial de Participación)*100","Gestión","Eficacia","Trimestral",1,"Porcentaje","Matriz de seguimiento a compromisos derivados de instancias de participación locales","Positiva","No",null,2019,"Septiembre",31,31,1,1,"Aceptable"]
["Mejorar continuamente los procesos del Sistema Integrado de Gestión","Gestión de Asuntos Locales","Desarrollar acciones a nivel local para promover la participación ciudadana, brindar acompañamiento a las alcaldías locales en temas misionales de la entidad y ofertar sus programas","Efectividad en la atención de la demanda de actividades recreodeportivas en las localidades de Bogotá",null,null,"Porcentaje de actividades recreativas programadas por asuntos locales","(No. de actividades recreativas programadas en la plataforma SIM por los gestores locales/Total de actividades recreativas solicitadas por Promoción de la Recreación)*100","Gestión","Eficacia","Mensual",1,"Porcentaje","Sistema de información misional - SIM\nCuadro de metas de actividades recreativas","Positiva","No",null,2019,"Septiembre",2958,2605,1.1355086372360845,1.1355086372360845,"Aceptable"]
["Mejorar continuamente los procesos del Sistema Integrado de Gestión","Gestión de Asuntos Locales","Desarrollar acciones a nivel local para promover la participación ciudadana, brindar acompañamiento a las alcaldías locales en temas misionales de la entidad y ofertar sus programas","Efectividad en la atención de la demanda de actividades recreodeportivas en las localidades de Bogotá",null,null,"Porcentaje de beneficiarios inscritos por asuntos locales en actividades deportivas","(No. de beneficiarios inscritos en actividades deportivas por los gestores locales/Total de beneficiarios de actividades deportivas programados por Fomento al Deporte)*100","Gestión","Eficacia","Trimestral",1,"Porcentaje","Reporte de las distintas plataformas para inscripciones\nCuadro de metas de actividades deportivas","Positiva","No",null,2019,"Septiembre",644,680,{"$f":"+T715/U715","v":0.94705882352941173},0.94705882352941173,"Aceptable"]
["Mejorar continuamente los procesos del Sistema Integrado de Gestión","Gestión de Asuntos Locales","Desarrollar acciones a nivel local para promover la participación ciudadana, brindar acompañamiento a las alcaldías locales en temas misionales de la entidad y ofertar sus programas","Cumplimiento de lineamientos y criterios de elegibilidad y viabilidad de los proyectos de contratación",null,null,"Porcentaje de asistencias técnicas realizadas a los Fondos de Desarrollo Local","(No. de asistencias técnicas realizadas a los Fondos de Desarrollo Local/Total de asistencias técnicas programadas a los Fondos de Desarrollo Local en las cuatro líneas de inversión)*100","Gestión","Eficacia","Trimestral",1,"Porcentaje","Cronograma de asistencias técnicas a los Fondos de Desarrollo Local","Positiva","No",null,2019,"Septiembre",19,19,1,1,"Aceptable"]
["Mejorar continuamente los procesos del Sistema Integrado de Gestión","Gestión de Asuntos Locales","Desarrollar acciones a nivel local para promover la participación ciudadana, brindar acompañamiento a las alcaldías locales en temas misionales de la entidad y ofertar sus programas","Ejecución de los proyectos con recursos de los fondos de desarrollo local, en concordancia con el concepto previo y favorable emitido por la entidad",null,null,"Porcentaje de proyectos viabilizados con seguimiento efectuado","(No. de proyectos contratados con seguimiento efectuado/Total de proyectos viabilizados con contratación por parte de los Fondos de Desarrollo Local)*100","Gestión","Eficacia","Trimestral",1,"Porcentaje","SECOP\nInforme de seguimiento a viabilidades","Positiva","No",null,2019,"Septiembre",20,20,1,1,"Aceptable"]
["Mejorar continuamente los procesos del Sistema Integrado de Gestión","Control Disciplinario","Investigar conductas presuntamente disciplinables e imponer sanciones cuando haya lugar, tanto a servidores como a ex-servidores públicos de la entidad, con el fin de que éstos cumplan con sus deberes y funciones","Cumplimiento de los términos legales en las distintas etapas procesales",null,null,"Porcentaje de procesos disciplinarios resueltos de fondo","(No. de procesos disciplinarios decididos de fondo/Total de procesos disciplinarios activos)*100","Gestión","Eficacia","Semestral",0.6,"Porcentaje","Matriz de autos","Positiva","No",null,2019,"Septiembre"]
["Mejorar continuamente los procesos del Sistema Integrado de Gestión","Control Disciplinario","Investigar conductas presuntamente disciplinables e imponer sanciones cuando haya lugar, tanto a servidores como a ex-servidores públicos de la entidad, con el fin de que éstos cumplan con sus deberes y funciones","Garantía del debido proceso en las distintas etapas procesales",null,null,"Porcentaje de procesos disciplinarios sin nulidades decretadas","(No. de procesos disciplinarios sin nulidades decretadas/Total de procesos disciplinarios activos)*100 ","Gestión","Eficacia","Trimestral",1,"Porcentaje","Matriz de autos","Positiva","No",null,2019,"Septiembre",98,99,0.98989898989898994,0.98989898989898994,"Aceptable"]
["Mejorar continuamente los procesos del Sistema Integrado de Gestión","Control Disciplinario","Investigar conductas presuntamente disciplinables e imponer sanciones cuando haya lugar, tanto a servidores como a ex-servidores públicos de la entidad, con el fin de que éstos cumplan con sus deberes y funciones","Cumplimiento de los términos legales en las distintas etapas procesales",null,null,"Porcentaje de procesos disciplinarios sin vencimiento de términos","(No. de procesos disciplinarios sin vencimiento de términos/Total de procesos disciplinarios activos)*100","Gestión","Calidad","Trimestral",1,"Porcentaje","Expediente del proceso disciplinario ","Positiva","No",null,2019,"Septiembre",97,99,0.97979797979797978,0.97979797979797978,"Aceptable"]
["Mejorar continuamente los procesos del Sistema Integrado de Gestión","Administración y Mantenimiento de Parques y Escenarios","Ofrecer parques y escenarios del Sistema Distrital para el uso y disfrute de la comunidad general, gestionando la sostenibilidad física, social, ambiental y económica","Uso de parques y escenarios con motivación económica que generen recursos para el mantenimiento de los mismos",null,null,"Aprovechamiento económico de parques y/o escenarios","(Ingresos del mes + acumulado de los ingresos del mes anterior/Total presupuesto anual)*100","Gestión","Eficiencia","Mensual",1,"Porcentaje","Sistema de información SEVEN","Positiva","Si","La meta es anual con medición y análisis mensual.\n\nEn el análisis del indicador se presentará la desagregación del aprovechamiento económico por tipo de parque y/o escenario, expresado en ingresos y participación porcentual.",2019,"Septiembre",18055241,22044017,0.81905403175836777,0.81905403175836777]
["Satisfacer las necesidades de los usuarios a través de la prestación de servicios eficientes, eficaces y efectivos","Administración y Mantenimiento de Parques y Escenarios","Ofrecer parques y escenarios del Sistema Distrital para el uso y disfrute de la comunidad general, gestionando la sostenibilidad física, social, ambiental y económica","Satisfacción de los usuarios con las actividades de mantenimiento preventivo y correctivo",null,null,"Satisfacción de los usuarios con las obras de mantenimiento de nuevas tendencias","(No. de usuarios satisfechos con las obras de mantenimiento realizadas/Total de usuarios de parques y escenarios encuestados para obras de mantenimiento de nuevas tendencias)*100","Gestión","Efectividad","Anual",0.9,"Porcentaje","Encuesta de satisfacción con las obras de mantenimiento de nuevas tendencias","Positiva","No","En el análisis del indicador se presentará el resultado desagregado por cada uno de los aspectos evaluados en la encuesta de satisfacción.",2019,"Septiembre"]
["Mejorar continuamente los procesos del Sistema Integrado de Gestión","Administración y Mantenimiento de Parques y Escenarios","Ofrecer parques y escenarios del Sistema Distrital para el uso y disfrute de la comunidad general, gestionando la sostenibilidad física, social, ambiental y económica","Oportunidad y cumplimiento en la generación de compromisos o acuerdos ciudadanos frente al uso y sostenibilidad de los parques administrados",null,null,"Porcentaje de cumplimiento en acuerdos de sostenibilidad social de parques","(No. de compromisos gestionados/Total de compromisos adquiridos mediante acuerdos ciudadanos en parques)*100","Gestión","Eficacia","Trimestral",1,"Porcentaje","Matriz de seguimiento a compromisos o acuerdos ciudadanos","Positiva","No",null,2019,"Septiembre",79,82,0.96341463414634143,0.96341463414634143,{"$f":"_xlfn.IFS(W723<=69%,\"Crítico\",W723>=90%,\"Aceptable\",W723>=70%,\"Tolerable\")","v":"Aceptable"}]
["Mejorar continuamente los procesos del Sistema Integrado de Gestión","Administración y Mantenimiento de Parques y Escenarios","Ofrecer parques y escenarios del Sistema Distrital para el uso y disfrute de la comunidad general, gestionando la sostenibilidad física, social, ambiental y económica","Disponibilidad de los equipamientos en parques y escenarios","Cumplimiento de las especificaciones técnicas en las actividades de mantenimiento preventivo y correctivo","Cobertura en el mantenimiento de parques y escenarios de acuerdo con la priorización","Porcentaje de avance en la ejecución de contratos de obras de mantenimiento o recuperación","(Porcentaje contrato 1 + Porcentaje contrato 2 +...+ Porcentaje contrato n)/Total de contratos de obras de mantenimiento o recuperación en ejecución\nDonde: \nPorcentaje contrato n = Avance físico ejecutado/Avance físico programado\nn = Número de contratos de obras de mantenimiento o recuperación en ejecución","Gestión","Eficacia","Bimestral",0.9,"Porcentaje","Informes mensuales de interventoría presentados según programación de los contratistas","Positiva","No",null,2019,"Septiembre"]
["Satisfacer las necesidades de los usuarios a través de la prestación de servicios eficientes, eficaces y efectivos","Diseño y Construcción de Parques y Escenarios","Ampliar y mejorar la infraestructura física recreativa y deportiva del Distrito Capital para el uso de la comunidad en general","Cumplimiento de requisitos técnicos, administrativos, financieros y jurídicos de los proyectos",null,null,"Satisfacción de los usuarios con las obras de construcción y/o adecuación entregadas","(No. de usuarios satisfechos con las obras de construcción y/o adecuación entregadas /Total de usuarios encuestados por proyecto)*100","Gestión","Efectividad","Anual",0.9,"Porcentaje","Resultados de la encuesta de satisfacción entregados por los contratistas de obra","Positiva","No","En el análisis del indicador se presentará el resultado desagregado por cada uno de los aspectos evaluados en la encuesta de satisfacción.",2019,"Septiembre"]
["Mejorar continuamente los procesos del Sistema Integrado de Gestión","Diseño y Construcción de Parques y Escenarios","Ampliar y mejorar la infraestructura física recreativa y deportiva del Distrito Capital para el uso de la comunidad en general","Oportunidad en el seguimiento y adopción de medidas durante el seguimiento de la estabilidad de la obra","Cumplimiento de especificaciones técnicas conforme a lo establecido en la etapa de construcción",null,"Porcentaje de fallas de calidad o estabilidad de obra atendidas en construcción y adecuación de parques y escenarios","(No. de fallas de calidad o estabilidad de obra atendidas/Total de fallas de calidad o estabilidad de obra detectadas o reportadas por terceros)*100\n\nAtendido = Se genera requerimiento al contratista para establecer compromisos de reparación.","Gestión","Eficacia","Trimestral",0.9,"Porcentaje","Actas de visita o reconocimiento de estabilidad de obra \nActa de compromiso de reparación constructiva\nProgramación de visita\nComunicación oficial- notificación de fallas visita de inspección por estabilidad \nActa de verificación de reparación constructiva","Positiva","No","En el análisis del indicador se presentará la desagregación por parque y escenario.",2019,"Septiembre",13,14,0.9285714285714286,1.0317460317460319,"Aceptable"]
["Mejorar continuamente los procesos del Sistema Integrado de Gestión","Diseño y Construcción de Parques y Escenarios","Ampliar y mejorar la infraestructura física recreativa y deportiva del Distrito Capital para el uso de la comunidad en general","Cumplimiento de requisitos técnicos, administrativos, financieros y jurídicos de los proyectos","Oportunidad en el seguimiento y adopción de medidas durante la ejecución de las obras","Cumplimiento del alcance de las obras conforme a los estudios y diseños, especificaciones técnicas y normatividad vigente","Porcentaje de avance en la ejecución de obras de construcción y adecuación de parques y escenarios","((%Ejecutado Obra 1*Plazo de ejecución Obra 1)+(%Ejecutado Obra 2*Plazo de ejecución Obra 2) +...+ (%Ejecutado Obra n*Plazo de ejecución Obra n))/((%Programado Obra 1*Plazo de ejecución Obra 1)+(%Programado Obra 2*Plazo de ejecución Obra 2) +...+ (%Programado Obra n*Plazo de ejecución Obra n))\nDonde:\nn = Número de obras en ejecución","Gestión","Eficacia","Mensual",0.9,"Porcentaje","Informes mensuales de interventoría\n\nInformes mensuales de supervisión","Positiva","No","En el análisis del indicador se presentará la desagregación por parque y escenario.",2019,"Septiembre",58.25,64.430000000000007,0.90408194940245212,1.0045354993360578,"Aceptable"]
["Mejorar continuamente los procesos del Sistema Integrado de Gestión","Diseño y Construcción de Parques y Escenarios","Ampliar y mejorar la infraestructura física recreativa y deportiva del Distrito Capital para el uso de la comunidad en general","\nCumplimiento de requisitos técnicos, administrativos, financieros y legales de los proyectos de estudios y diseños","Oportunidad en el seguimiento y adopción de medidas durante la ejecución de los proyectos de estudios y diseños","Cumplimiento del alcance de los proyectos de estudios y diseños conforme a las necesidades identificadas","Porcentaje de avance en la ejecución de proyectos de estudios y/o diseños de parques y escenarios","(Porcentaje proyecto 1 + Porcentaje proyecto 2 +...+ Porcentaje proyecto n)/Total de proyectos de estudios y/o diseños en ejecución\nDonde: \nPorcentaje proyecto n =(Avance ejecutado de estudios y/o diseños/Avance programado de estudios y/o diseños al corte según forma de pago)\nn = Número de proyectos de estudios y/o diseños en ejecución","Gestión","Eficacia","Mensual",0.9,"Porcentaje","Informes mensuales de interventoría\n\nInformes mensuales de supervisión","Positiva","No","En el análisis del indicador se presentará la desagregación por proyecto.",2019,"Septiembre",94.85,100,0.9484999999999999,1.0538888888888887,"Aceptable"]
["Mejorar continuamente los procesos del Sistema Integrado de Gestión","Gestión Jurídica","Ejercer la defensa judicial y extrajudicial de la entidad y atender requerimientos jurídicos, para salvaguardar sus intereses y cumplir con los requisitos constitucionales y legales","Intervención oportuna en las distintas actuaciones judiciales y extrajudiciales en que sea parte la entidad","Oportunidad en el seguimiento a los procesos en los despachos e instancias judiciales",null,"Porcentaje de procesos judiciales y extrajudiciales atendidos dentro de los términos legales vigentes","(No. de procesos jurídicos atendidos dentro de los términos legales vigentes)/Total de procesos jurídicos notificados)*100","Gestión","Calidad","Trimestral",1,"Porcentaje","SIPROJ Web\nORFEO","Positiva","No","En el análisis del indicador se presentará la desagregación por procesos judiciales y extrajudiciales.",2019,"Septiembre",25,25,1,1,"Aceptable"]
["Satisfacer las necesidades de los usuarios a través de la prestación de servicios eficientes, eficaces y efectivos","Gestión Jurídica","Ejercer la defensa judicial y extrajudicial de la entidad y atender requerimientos jurídicos, para salvaguardar sus intereses y cumplir con los requisitos constitucionales y legales","Cumplimiento de los requisitos establecidos para el reconocimiento deportivo y el aval de escuelas deportivas",null,null,"Satisfacción de los usuarios con el trámite de reconocimiento deportivo","(No. de usuarios satisfechos con el trámite de reconocimiento deportivo/Total de usuarios encuestados)*100","Gestión","Efectividad","Semestral",0.95,"Porcentaje","Encuesta de satisfacción de usuarios de reconocimiento deportivo","Positiva","No","En el análisis del indicador se presentarán los resultados desagregados por cada uno de los aspectos evaluados en la encuesta de satisfacción.",2019,"Septiembre"]
["Mejorar continuamente los procesos del Sistema Integrado de Gestión","Gestión Jurídica","Ejercer la defensa judicial y extrajudicial de la entidad y atender requerimientos jurídicos, para salvaguardar sus intereses y cumplir con los requisitos constitucionales y legales","Oportunidad en la respuesta del trámite de otorgamiento deportivo (45 días hábiles siguientes al cumplimiento de requisitos de otorgamiento deportivo)","Vigencia y aplicabilidad de la normatividad empleada para el reconocimiento deportivo y el aval de escuelas deportivas",null,"Porcentaje de trámites de reconocimiento deportivo atendidos dentro del término legal vigente","(No. de trámites de reconocimiento deportivo atendidos dentro del término legal vigente/Total de trámites de reconocimiento deportivo atendidos)*100 ","Gestión","Calidad","Trimestral",0.92,"Porcentaje","Matriz de control de reconocimiento deportivo","Positiva","No",null,2019,"Septiembre",303,304,0.99671052631578949,1.0833810068649885,"Aceptable"]
["Mejorar continuamente los procesos del Sistema Integrado de Gestión","Gestión Jurídica","Ejercer la defensa judicial y extrajudicial de la entidad y atender requerimientos jurídicos, para salvaguardar sus intereses y cumplir con los requisitos constitucionales y legales","Oportunidad en la respuesta del trámite de aval de escuelas deportivas (58 días hábiles)","Vigencia y aplicabilidad de la normatividad empleada para el reconocimiento deportivo y el aval de escuelas deportivas",null,"Porcentaje de trámites de aval de escuelas deportivas atendidos dentro del término legal vigente","(No. de trámites de aval de escuelas deportivas atendidos dentro del término legal vigente/Total de trámites de aval de escuelas deportivas atendidos)*100","Gestión","Calidad","Trimestral",0.92,"Porcentaje","Matriz de control de aval de escuelas deportivas","Positiva","No",null,2019,"Septiembre",11,11,1,1.0869565217391304,"Aceptable"]
["Mejorar continuamente los procesos del Sistema Integrado de Gestión","Gestión Jurídica","Ejercer la defensa judicial y extrajudicial de la entidad y atender requerimientos jurídicos, para salvaguardar sus intereses y cumplir con los requisitos constitucionales y legales","Oportunidad en la respuesta a conceptos de proyectos de acuerdo con los tiempos establecidos","Suministro oportuno de la información de carácter técnico, de oportunidad y conveniencia del proyecto por parte de las dependencias y áreas de la entidad",null,"Porcentaje de solicitudes de concepto a proyectos de acuerdo, decreto o ley atendidas dentro del tiempo establecido","(No. de solicitudes de concepto a proyectos de acuerdo, decreto o ley atendidas dentro del tiempo establecido/Total de solicitudes de concepto a proyectos de acuerdo, decreto o ley recibidas)*100","Gestión","Calidad","Semestral",0.9,"Porcentaje","Matriz de seguimiento a solicitudes Congreso y Concejo","Positiva","No","En el análisis del indicador se presentará la desagregación por proyectos de acuerdo, decreto y ley.",2019,"Septiembre"]
["Mejorar continuamente los procesos del Sistema Integrado de Gestión","Gestión Jurídica","Ejercer la defensa judicial y extrajudicial de la entidad y atender requerimientos jurídicos, para salvaguardar sus intereses y cumplir con los requisitos constitucionales y legales","Recuperación de la cartera en mora",null,null,"Porcentaje de procesos de cobro de cartera efectuados","(No. de procesos con etapas de cobro efectuadas/Total de procesos de cobro remitidos con documentación completa)*100","Gestión","Eficacia","Cuatrimestral",1,"Porcentaje","Matriz de seguimiento cobro de cartera","Positiva","No","Los primeros cinco días hábiles de mayo se reportará el indicador con corte a 31 de diciembre del año anterior. \nLos primeros días de septiembre se reportará con corte 30 de abril de la vigencia.\nLos primeros días de enero se reportará con corte a 31 de agosto del año anterior.\nEn el análisis del indicador se presentará la desagregación por etapa (persuasivo y coactivo), así como también el porcentaje de recuperación de cartera.",2019,"Septiembre"]
["Mejorar continuamente los procesos del Sistema Integrado de Gestión","Gestión Jurídica","Ejercer la defensa judicial y extrajudicial de la entidad y atender requerimientos jurídicos, para salvaguardar sus intereses y cumplir con los requisitos constitucionales y legales","Intervención oportuna en las distintas actuaciones judiciales y extrajudiciales en que sea parte la entidad - tipos de daño en que se resulte demandado o condenado",null,null,"Índice de condenas adversas","(No. de condenas adversas/Total de procesos judiciales)*100","Gestión","Calidad","Semestral",0.08,"Porcentaje","Informe Siproj web mensual (procesos judiciales)","Negativa","No","El análisis del indicador debe evaluar dentro del comité de conciliación los procesos que cursen o hayan cursado en contra de la entidad, determinando causas generadoras de conflictos y los tipos de daño.",2019,"Septiembre"]
["Mejorar continuamente los procesos del Sistema Integrado de Gestión","Gestión de Comunicaciones","Dar a conocer interna y externamente las actividades, programas y obras que realiza la entidad, para generar apropiación y participación que contribuyan al posicionamiento de la imagen institucional","Exigencia de la solicitud de servicios para todos los procesos con la información completa y detallada de lo requerido","Veracidad de la información reportada por los solicitantes del servicio ",null,"Porcentaje de solicitudes de servicios de comunicaciones atendidas dentro de los tiempos establecidos","(No. de solicitudes de servicio atendidas dentro de los tiempos establecidos/Total de solicitudes de servicio de comunicaciones recibidas)*100","Gestión","Calidad","Trimestral",0.9,"Porcentaje","Consolidado de solicitudes de servicios de comunicaciones","Positiva","No",null,2019,"Septiembre",360,395,{"$f":"+T736/U736","v":0.91139240506329111},{"$f":"+V736/L736","v":1.0126582278481011},{"$f":"_xlfn.IFS(W736<=69%,\"Crítico\",W736>=90%,\"Aceptable\",W736>=70%,\"Tolerable\")","v":"Aceptable"}]
["Mejorar continuamente los procesos del Sistema Integrado de Gestión","Gestión de Comunicaciones","Dar a conocer interna y externamente las actividades, programas y obras que realiza la entidad, para generar apropiación y participación que contribuyan al posicionamiento de la imagen institucional","Relacionamiento con medios de comunicación","Análisis de los resultados obtenidos mediante el monitoreo de medios para facilitar la toma de decisiones",null,"Impacto de noticias publicadas en medios de comunicación","(No. de noticias positivas o neutras registradas/Total de noticias publicadas en medios de comunicación)*100","Gestión","Eficacia","Trimestral",1,"Porcentaje","Informes mensuales generados por la empresa contratada para realizar el monitoreo de medios","Positiva","No","En el análisis del indicador se presentará el resultado desagregado de noticias positivas y neutras, indicando los principales medios de comunicación.\nSe colocó una meta de 100%, mientras se levanta la línea base con la primera medición.",2019,"Septiembre",258,330,0.78181818181818186,0.78181818181818186,"Tolerable"]
["Mejorar continuamente los procesos del Sistema Integrado de Gestión","Gestión de Comunicaciones","Dar a conocer interna y externamente las actividades, programas y obras que realiza la entidad, para generar apropiación y participación que contribuyan al posicionamiento de la imagen institucional","Seguimiento a los cambios en las condiciones de publicación en redes sociales y página web",null,null,"Tasa de variación en el alcance total de las publicaciones en redes sociales","((Alcance total de publicaciones en el trimestre actual - Alcance total de publicaciones en el trimestre anterior)/Alcance total de publicaciones en el trimestre anterior)*100\n\nDonde:\n\nAlcance total de las publicaciones = Total de usuarios que vieron las publicaciones de redes sociales","Gestión","Eficacia","Trimestral",0.2,"Porcentaje","Métricas nativas de cada red social","Positiva","No","En el análisis del indicador se presentará el resultado desagregado del alcance de las publicaciones por cada red social. ",2019,"Septiembre",1060757,3294287,0.3219989636604218,{"$f":"+V738/L738","v":1.6099948183021089},"Aceptable"]
["Mejorar continuamente los procesos del Sistema Integrado de Gestión","Gestión de Comunicaciones","Dar a conocer interna y externamente las actividades, programas y obras que realiza la entidad, para generar apropiación y participación que contribuyan al posicionamiento de la imagen institucional","Análisis de los resultados obtenidos mediante el monitoreo de medios para facilitar la toma de decisiones",null,null,"Salidas publicadas en medios de comunicación","N/A","Gestión","Eficacia","Mensual",80,"Número","Informes mensuales generados por la empresa contratada para realizar el monitoreo de medios","Positiva","No","En el análisis del indicador se presentará el valor estimado de las publicaciones en medios de comunicación.",2019,"Septiembre",284,1,284,3.55,"Aceptable"]
["Mejorar continuamente los procesos del Sistema Integrado de Gestión","Planeación de la Gestión","Establecer directrices para formular y realizar seguimiento a la planeación estratégica y operativa de la entidad con el propósito de contribuir al desarrollo de la misión y objetivos institucionales, así como facilitar la oportunidad y cumplimiento de los resultados esperados","Oportunidad, veracidad y calidad de la información de inversión y gestión",null,null,"Porcentaje de reportes de información presentados dentro de los tiempos programados","(No. de reportes de información elaborados y presentados/Total de reportes de información programados)*100","Gestión","Calidad","Trimestral",1,"Porcentaje","Cronograma de trabajo interno, plan operativo por dependencias (Oficina Asesora de Planeación), plan de adecuación y sostenibilidad SIGD-MIPG","Positiva","No","En el análisis del indicador se desagregará la programación para cada trimestre.",2019,"Octubre"]
["Mejorar continuamente los procesos del Sistema Integrado de Gestión","Planeación de la Gestión","Establecer directrices para formular y realizar seguimiento a la planeación estratégica y operativa de la entidad con el propósito de contribuir al desarrollo de la misión y objetivos institucionales, así como facilitar la oportunidad y cumplimiento de los resultados esperados","Oportunidad en el seguimiento de las acciones institucionales para la mejora (correcciones, acciones correctivas, oportunidades de mejora, acciones para abordar riesgos)",null,null,"Porcentaje de acciones de mejora con seguimiento efectuado dentro del Sistema de Gestión","[No. de acciones de mejora con seguimiento efectuado dentro del tiempo programado/Total de acciones de mejora abiertas dentro del Sistema de Gestión de la Calidad (correcciones, acciones correctivas, oportunidades de mejora, acciones para abordar riesgos)]*100","Gestión","Eficacia","Mensual",1,"Porcentaje","Isolución","Positiva","No","En el análisis del indicador se presentará el resultado desagregado por cada tipología de mejora (corrección, acciones correctivas, oportunidades de mejora, acciones para abordar riesgos).",2019,"Octubre",129,129,1,1,"Aceptable"]
["Mejorar continuamente los procesos del Sistema Integrado de Gestión","Gestión de Recursos Físicos","Administrar y controlar los bienes muebles y servicios para el funcionamiento administrativo de la entidad","Oportunidad en la atención de requerimientos y necesidades de servicios administrativos",null,null,"Porcentaje de mantenimientos realizados a la infraestructura física de la sede administrativa","(No. de mantenimientos realizados a la infraestructura física/Total de mantenimientos programados a la infraestructura física de la sede administrativa)*100","Gestión","Eficacia","Trimestral",0.9,"Porcentaje","Expendientes contractuales en plataforma ORFEO","Positiva","No",null,2019,"Octubre"]
["Mejorar continuamente los procesos del Sistema Integrado de Gestión","Gestión de Asuntos Locales","Desarrollar acciones a nivel local para promover la participación ciudadana, brindar acompañamiento a las alcaldías locales en temas misionales de la entidad y ofertar sus programas","Oportunidad en la emisión del concepto previo y favorable según los tiempos establecidos en la normatividad vigente",null,null,"Porcentaje de conceptos previos tramitados dentro de los términos legales vigentes","(No. de conceptos previos tramitados dentro de los términos legales vigentes/Total de solicitudes de conceptos previos recibidas)*100","Gestión","Calidad","Trimestral",0.5,"Porcentaje","Matriz de seguimiento a conceptos previos tramitados","Positiva","No",null,2019,"Octubre"]
["Mejorar continuamente los procesos del Sistema Integrado de Gestión","Control, Evaluación y Seguimiento","Evaluar los controles y la gestión de la entidad con el fin de identificar e implementar acciones de mejora, en pro de la sostenibilidad del Sistema de Control Interno","Pertinencia y oportunidad en la entrega de los resultados del seguimiento a las partes interesadas","Oportunidad y calidad en la información reportada a las entidades competentes del orden nacional y distrital",null,"Porcentaje de informes presentados por la tercera línea de defensa dentro de los tiempos programados","(No. de informes de ley y de gestión elaborados y presentados dentro de los tiempos programados/Total de informes de ley y de gestión a cargo de la tercera línea de defensa )*100  ","Gestión","Calidad","Trimestral",1,"Porcentaje","Plan anual de auditoría\nCronograma presentación de informes","Positiva","No","En el análisis del indicador se presentará el resultado desagregado por cada uno de los informes realizados.",2019,"Octubre"]
["Mejorar continuamente los procesos del Sistema Integrado de Gestión","Control, Evaluación y Seguimiento","Evaluar los controles y la gestión de la entidad con el fin de identificar e implementar acciones de mejora, en pro de la sostenibilidad del Sistema de Control Interno","Cumplimiento de los objetivos definidos en el plan de auditoría conforme al plan de pruebas","Cobertura de las unidades a auditar de acuerdo con los parámetros establecidos en la matriz de priorización, en concordancia con los recursos disponibles para la ejecución del Plan Anual de Auditoría",null,"Índice de eficacia de auditorías internas de control interno","(Índice auditoría 1 + índice auditoría 2 +...+Índice auditoría n)/Total de auditorías realizadas\nDonde: \nÍndice auditoría n = Calificación porcentual de la variable Objetivos Específicos*Peso de la variable Objetivos Específicos + Calificación porcentual de la variable Actividad Plan de Auditoría*Peso de la variable Actividad Plan de Auditoría + Calificación porcentual de la variable Oportunidad*Peso de la variable Oportunidad\nPesos de las variables:\nObjetivos Específicos = 40%\nActividades Plan de Auditoría = 30%\nOportunidad = 30%. Esta se medirá tomando como fecha de referencia la de emisión del informe preliminar de auditoría.\nn = número de auditorías realizadas","Gestión","Eficacia","Trimestral",0.85,"Porcentaje","Planes de cada una de las auditorías","Positiva","No","En el análisis del indicador se presentará el resultado desagregado por cada una de las auditorías realizadas.",2019,"Octubre"]
["Mejorar continuamente los procesos del Sistema Integrado de Gestión","Gestión Financiera","Administrar los recursos financieros asignados y realizar los respectivos registros, para el cumplimiento de las funciones de la entidad y pago de sus obligaciones con terceros","Oportunidad en el seguimiento de las partidas pendientes por conciliar",null,null,"Porcentaje de partidas conciliatorias identificadas dentro del tiempo establecido","(No. de partidas conciliatorias identificadas con edad inferior a 60 días/Total de partidas reportadas)*100","Gestión","Calidad","Mensual",0.9,"Porcentaje","Sistema de información SEVEN","Positiva","No",null,2019,"Octubre",17,17,1,1.1111111111111112,"Aceptable"]
["Mejorar continuamente los procesos del Sistema Integrado de Gestión","Gestión Financiera","Administrar los recursos financieros asignados y realizar los respectivos registros, para el cumplimiento de las funciones de la entidad y pago de sus obligaciones con terceros","Oportunidad e integridad de la información necesaria para realizar las diferentes conciliaciones",null,null,"Porcentaje de obligaciones contingentes registradas correctamente en la contabilidad","(No. de procesos registrados correctamente en la contabilidad/Total de procesos reportados en SIPROJ Web)*100","Gestión","Calidad","Trimestral",1,"Porcentaje","Sistema de información SEVEN","Positiva","No",null,2019,"Octubre"]
["Mejorar continuamente los procesos del Sistema Integrado de Gestión","Gestión Financiera","Administrar los recursos financieros asignados y realizar los respectivos registros, para el cumplimiento de las funciones de la entidad y pago de sus obligaciones con terceros","Oportunidad en la presentación de informes y estados financieros a los diferentes entes de vigilancia y control",null,null,"Porcentaje de notas a los estados financieros reveladas correctamente","(No. de notas sin observaciones por parte de los órganos de control internos y externos/Total de notas a los estados financieros elaboradas)*100","Gestión","Calidad","Anual",0.95,"Porcentaje","Informes de entes de control y vigilancia","Positiva","No",null,2019,"Octubre"]
["Mejorar continuamente los procesos del Sistema Integrado de Gestión","Gestión Financiera","Administrar los recursos financieros asignados y realizar los respectivos registros, para el cumplimiento de las funciones de la entidad y pago de sus obligaciones con terceros","Oportunidad en la presentación de informes y estados financieros a los diferentes entes de vigilancia y control","Oportunidad en la presentación de las declaraciones tributarias",null,"Porcentaje de informes financieros presentados a los entes de vigilancia y control dentro de los términos legales vigentes","(No. de informes financieros presentados dentro de los términos legales vigentes/Total de informes financieros a reportar a los entes de vigilancia y control)*100","Gestión","Calidad","Mensual",1,"Porcentaje","Matriz de seguimiento a la presentación de informes ","Positiva","No",null,2019,"Octubre",3,3,1,1,"Aceptable"]
["Satisfacer las necesidades de los usuarios a través de la prestación de servicios eficientes, eficaces y efectivos","Promoción de la Recreación","Desarrollar actividades recreativas en función de las características y necesidades de la población de Bogotá D.C., para promover el aprovechamiento del tiempo libre y el mejoramiento en la calidad de vida","Satisfacción del usuario con las actividades recreativas realizadas",null,null,"Satisfacción de los usuarios con los eventos y/o programas recreativos","(No. de usuarios satisfechos con los eventos y/o programas recreativos/Total de usuarios de eventos y/o programas recreativos encuestados)*100","Gestión","Efectividad","Anual",1,"Porcentaje","Encuesta de satisfacción sobre eventos y/o programas recreativos","Positiva","No","En el análisis del indicador se presentará el resultado desagregado por programa y por cada uno de los aspectos evaluados en la encuesta de satisfacción.\nSe colocó una meta de 100%, mientras se levanta la línea base con la primera medición.",2019,"Octubre"]
["Mejorar continuamente los procesos del Sistema Integrado de Gestión","Promoción de la Recreación","Desarrollar actividades recreativas en función de las características y necesidades de la población de Bogotá D.C., para promover el aprovechamiento del tiempo libre y el mejoramiento en la calidad de vida","Cumplimiento del programa de actividades recreativas, teniendo en cuenta lo establecido en las fichas técnicas o según lo concertado con la comunidad e instituciones",null,null,"Porcentaje de actividades recreativas que cumplen con los requisitos para su ejecución","(No. de actividades recreativas que cumplen con los requisitos definidos para su ejecución/Total de actividades recreativas realizadas)*100","Gestión","Eficacia","Trimestral",0.97,"Porcentaje","Sistema de información misional - SIM","Positiva","No","En el análisis del indicador se presentará el resultado desagregado por programa y por actividad.",2019,"Octubre"]
["Satisfacer las necesidades de los usuarios a través de la prestación de servicios eficientes, eficaces y efectivos","Fomento al Deporte","Desarrollar e implementar programas deportivos y de actividad física, para contribuir con el mejoramiento de la calidad de vida en la población de Bogotá D.C.","Satisfacción del usuario con las actividades deportivas  realizadas",null,null,"Satisfacción de los usuarios con las actividades realizadas en los programas deportivos","(No. de usuarios satisfechos con las actividades deportivas realizadas/Total de usuarios de actividades deportivas encuestados)*100","Gestión","Efectividad","Anual",1,"Porcentaje","Encuesta de satisfacción sobre actividades/programas deportivos","Positiva","No","En el análisis del indicador se presentará el resultado desagregado por programa y por cada uno de los aspectos evaluados en la encuesta de satisfacción.\nSe colocó una meta de 100%, mientras se levanta la línea base con la primera medición.",2019,"Octubre"]
["Mejorar continuamente los procesos del Sistema Integrado de Gestión","Fomento al Deporte","Desarrollar e implementar programas deportivos y de actividad física, para contribuir con el mejoramiento de la calidad de vida en la población de Bogotá D.C.","Cambios comportamentales como resultados de los programas deportivos y de actividad física",null,null,"Cambio comportamental frente a la actividad física y el deporte","(No. de beneficiarios con percepción de cambio comportamental alrededor de las 4 dimensiones de la alfabetización física/Total de beneficiarios de programas deportivos y de actividad física seleccionados en la muestra)*100","Gestión","Efectividad","Anual",1,"Porcentaje","Encuesta para medir las 4 dimensiones de la alfabetización física","Positiva","No","La metodología se aplicará sobre una muestra por cada por cada programa. Se define en 4 tipos de mediciones:\n1. Medición dimensión competencia física. Aplicar test de resistencia, fuerza de torso, habilidades y flexibilidad.\n2. Medición dimensiones: competencia cognitiva, comportamental y motivacional a través de un cuestionario (on-line o presencial).\nSe colocó una meta de 100%, mientras se levanta la línea base con la primera medición.",2019,"Octubre"]
["Satisfacer las necesidades de los usuarios a través de la prestación de servicios eficientes, eficaces y efectivos","Servicio a la Ciudadanía","Brindar información y atender los requerimientos de los grupos de valor y de interés de la entidad para responder a sus necesidades en cumplimiento de sus derechos","Oportunidad y calidad en la respuesta a los requerimientos de los grupos de valor e interés de la entidad","Satisfacción del ciudadano frente a las respuestas a sus requerimientos",null,"Satisfacción de peticionarios con la respuesta dada a sus requerimientos","(No. de peticionarios satisfechos con la respuesta dada a sus peticiones, quejas, reclamos y sugerencias/Total de peticionarios contactados)*100","Gestión","Efectividad","Mensual",0.8,"Porcentaje","Base de datos de gestión de PQRS","Positiva","No",null,2019,"Octubre",32,38,0.84210526315789469,1.0526315789473684,"Aceptable"]
["Mejorar continuamente los procesos del Sistema Integrado de Gestión","Gestión de Recursos Físicos","Administrar y controlar los bienes muebles y servicios para el funcionamiento administrativo de la entidad","Oportunidad en la atención de requerimientos y necesidades de servicios administrativos",null,null,"Porcentaje de requerimientos de mantenimiento correctivo atendidos en la sede administrativa dentro de los tiempos establecidos","(No. de requerimientos de mantenimiento correctivo atendidos dentro de los tiempos establecidos/Total de requerimientos de mantenimiento correctivo reportados en la sede administrativa)*100","Gestión","Calidad","Trimestral",0.95,"Porcentaje","Aplicativo mesa de ayuda OTRS","Positiva","No",null,2019,"Octubre"]
["Mejorar continuamente los procesos del Sistema Integrado de Gestión","Adquisición de Bienes y Servicios","Realizar actividades contractuales para adquirir bienes y servicios con la oportunidad y de acuerdo con las especificaciones establecidas por la entidad","Cumplimiento de requisitos de acuerdo con la modalidad de selección",null,null,"Porcentaje de procesos de selección publicados dentro del tiempo establecido","(No. de actos de apertura de procesos de selección publicados en un tiempo menor o igual a 30 días hábiles después de la radicación/Total de actos de apertura expedidos)*100","Gestión","Calidad","Trimestral",0.9,"Porcentaje","Plataforma ORFEO y SECOP","Positiva","No","En el análisis del indicador se presentará el resultado desagregado para licitación pública, concurso de méritos y selección abreviada.",2019,"Octubre"]
["Mejorar continuamente los procesos del Sistema Integrado de Gestión","Adquisición de Bienes y Servicios","Realizar actividades contractuales para adquirir bienes y servicios con la oportunidad y de acuerdo con las especificaciones establecidas por la entidad","Oportunidad en la suscripción y legalización del contrato",null,null,"Porcentaje de contratos legalizados dentro del tiempo establecido","(No. de contratos legalizados en un tiempo menor o igual a 10 días hábiles a partir del acto administrativo de adjudicación/Total de procesos de selección adjudicados)*100","Gestión","Calidad","Mensual",0.8,"Porcentaje","SECOP y Plataforma ORFEO ","Positiva","No","En el análisis del indicador se presentará el resultado desagregado para licitación pública, concurso de méritos y selección abreviada.",2019,"Octubre",1,3,0.33333333333333331,0.41666666666666663,"Crítico"]
["Mejorar continuamente los procesos del Sistema Integrado de Gestión","Adquisición de Bienes y Servicios","Realizar actividades contractuales para adquirir bienes y servicios con la oportunidad y de acuerdo con las especificaciones establecidas por la entidad","Definición clara y precisa de requisitos técnicos, financieros, económicos, jurídicos y de riesgos de acuerdo con el bien o servicio a adquirir",null,null,"Porcentaje de procesos de obra tramitados en análisis de costos dentro del tiempo establecido","(No. de procesos de obra (todas las Subdirecciones) tramitados en oportunidad al recibo del memorando con la solicitud estudio del sector (20 días)/Total de procesos de obra recibidos)*100","Gestión","Calidad","Trimestral",1,"Porcentaje","Matriz de tráfico ACEE","Positiva","No",null,2019,"Octubre"]
["Mejorar continuamente los procesos del Sistema Integrado de Gestión","Adquisición de Bienes y Servicios","Realizar actividades contractuales para adquirir bienes y servicios con la oportunidad y de acuerdo con las especificaciones establecidas por la entidad","Definición clara y precisa de requisitos técnicos, financieros, económicos, jurídicos y de riesgos de acuerdo con el bien o servicio a adquirir",null,null,"Porcentaje de procesos diferentes a obra tramitados en análisis de costos dentro del tiempo establecido","(No. de procesos diferentes a obra tramitados en oportunidad al recibo del memorando con la solicitud estudio del sector (10 días hábiles)/Total de procesos recibidos diferentes a obra)*100","Gestión","Calidad","Trimestral",0.9,"Porcentaje","Matriz de tráfico ACEE","Positiva","No","En el análisis del indicador se presentará el resultado desagregado para procesos diferentes a obra.",2019,"Octubre"]
["Mejorar continuamente los procesos del Sistema Integrado de Gestión","Adquisición de Bienes y Servicios","Realizar actividades contractuales para adquirir bienes y servicios con la oportunidad y de acuerdo con las especificaciones establecidas por la entidad","Definición clara y precisa de requisitos técnicos, financieros, económicos, jurídicos y de riesgos de acuerdo con el bien o servicio a adquirir",null,null,"Porcentaje de procesos requeridos por precios artificialmente bajos","(No. de procesos (excepto Subastas SAS) requeridos por precios artificialmente bajos/Total de procesos evaluados)*100","Gestión","Calidad","Trimestral",0.15,"Porcentaje","Evaluación económica de los proponentes\n\nAnálisis de precios realizado por la ACEE","Negativa","No","En el análisis del indicador se presentará el resultado desagregado por tipo de proceso.",2019,"Octubre"]
["Mejorar continuamente los procesos del Sistema Integrado de Gestión","Control, Evaluación y Seguimiento","Evaluar los controles y la gestión de la entidad con el fin de identificar e implementar acciones de mejora, en pro de la sostenibilidad del Sistema de Control Interno","Pertinencia y oportunidad en la entrega de los resultados del seguimiento a las partes interesadas",null,null,"Porcentaje de acciones de mejoramiento interno con seguimiento efectuado","(No. de acciones de mejoramiento interno con seguimiento efectuado)/Total de acciones de mejoramiento interno abiertas de auditorías internas de control interno)*100","Gestión","Eficacia","Trimestral",1,"Porcentaje","Plataforma Isolución","Positiva","No","En el análisis del indicador se presentará el resultado desagregado por proceso.",2019,"Octubre"]
["Mejorar continuamente los procesos del Sistema Integrado de Gestión","Control, Evaluación y Seguimiento","Evaluar los controles y la gestión de la entidad con el fin de identificar e implementar acciones de mejora, en pro de la sostenibilidad del Sistema de Control Interno","Pertinencia y oportunidad en la entrega de los resultados del seguimiento a las partes interesadas",null,null,"Porcentaje de acciones de mejoramiento externo con seguimiento efectuado","(No. de acciones de mejoramiento externo con seguimiento efectuado)/Total de acciones de mejoramiento externo abiertas de auditorías externas)*100","Gestión","Eficacia","Trimestral",1,"Porcentaje","Matrices de consolidación del estado de las acciones de los diferentes entes de control y vigilancia","Positiva","No","En el análisis del indicador se presentará el resultado desagregado por auditoría externa.",2019,"Octubre"]
["Mejorar continuamente los procesos del Sistema Integrado de Gestión","Gestión Financiera","Administrar los recursos financieros asignados y realizar los respectivos registros, para el cumplimiento de las funciones de la entidad y pago de sus obligaciones con terceros","Oportunidad en la expedición de los certificados presupuestales y en la presentación de los informes de ejecución",null,null,"Porcentaje de ejecución presupuestal en gastos de funcionamiento","(Presupuesto de funcionamiento ejecutado/Presupuesto disponible de funcionamiento)*100","Gestión","Eficiencia","Mensual",0.9,"Porcentaje","Ejecución presupuestal en SEVEN","Positiva","Si","La meta es anual con medición y análisis mensual.\nLa medición está a cargo del Área Financiera y el análisis a cargo de la Subdirección Administrativa y Financiera.\nLa medición y el análisis se deben realizar a más tardar el quinto día hábil de cada mes.\nUna vez se realice el Comité Financiero, el Área Financiera debe enviar a la Oficina Asesora de Planeación la presentación correspondiente, con el análisis respectivo en cuanto al desempeño del indicador.",2019,"Octubre",24416222019,35208442000,0.69347635487534498,{"$f":"+V763/L763","v":0.77052928319482772}]
["Mejorar continuamente los procesos del Sistema Integrado de Gestión","Gestión Financiera","Administrar los recursos financieros asignados y realizar los respectivos registros, para el cumplimiento de las funciones de la entidad y pago de sus obligaciones con terceros","Oportunidad en la expedición de los certificados presupuestales y en la presentación de los informes de ejecución","Oportunidad en la autorización de giro de los recursos de transferencia",null,"Porcentaje de ejecución presupuestal en gastos de inversión","(Presupuesto de inversión ejecutado/Presupuesto disponible de inversión)*100","Gestión","Eficiencia","Mensual",0.95,"Porcentaje","Ejecución presupuestal en SEVEN","Positiva","Si","La meta es anual con medición y análisis mensual.\nLa medición está a cargo del Área Financiera y el análisis a cargo de los Ordenadores del Gasto.\nLa medición y el análisis se deben realizar a más tardar el quinto día hábil de cada mes.\nUna vez se realice el Comité Financiero, el Área Financiera debe enviar a la Oficina Asesora de Planeación la presentación correspondiente, con el análisis respectivo en cuanto al desempeño del indicador.",2019,"Octubre",425171952702,745023641031,0.57068249822733996,0.60071841918667368]
["Mejorar continuamente los procesos del Sistema Integrado de Gestión","Gestión Financiera","Administrar los recursos financieros asignados y realizar los respectivos registros, para el cumplimiento de las funciones de la entidad y pago de sus obligaciones con terceros","Oportunidad en el pago de las obligaciones financieras de la entidad",null,null,"Porcentaje de ejecución del programa anual de caja","(Recursos ejecutados de reserva, vigencia y pasivos exigibles/Recursos programados de reserva, vigencia y pasivos exigibles)*100","Gestión","Eficiencia","Mensual",0.95,"Porcentaje","Sistema de información SEVEN","Positiva","Si","La meta es anual con medición y análisis mensual.\nLa medición está a cargo del Área Financiera y el análisis a cargo de los Ordenadores del Gasto.\nLa medición y el análisis se deben realizar a más tardar el quinto día hábil de cada mes.\nUna vez se realice el Comité Financiero, el Área Financiera debe enviar a la Oficina Asesora de Planeación la presentación correspondiente, con el análisis respectivo en cuanto al desempeño del indicador.",2019,"Octubre",4000736,4511191,{"$f":"+T765/U765","v":0.88684695460688767},0.93352311011251343]
["Mejorar continuamente los procesos del Sistema Integrado de Gestión","Gestión Financiera","Administrar los recursos financieros asignados y realizar los respectivos registros, para el cumplimiento de las funciones de la entidad y pago de sus obligaciones con terceros","Oportunidad en el pago de las obligaciones financieras de la entidad","Oportunidad en la causación de ordenes de pago que cumplan con todos los requisitos establecidos","Oportunidad y veracidad de la información necesaria para la causación de las ordenes de pago reportada por los ordenadores del gasto","Porcentaje de cuentas individuales pagadas dentro del tiempo establecido","(No. de cuentas individuales pagadas en un tiempo menor o igual a 6 días/Total de cuentas de pago individuales tramitadas)*100 ","Gestión","Calidad","Mensual",1,"Porcentaje","Bitácora de cuentas en SEVEN","Positiva","No","La medición y el análisis están a cargo del Área Financiera.\nEn el análisis del indicador se presentará el resultado del tiempo promedio en cada una de las etapas para el pago, según la bitácora de cuentas de SEVEN.",2019,"Octubre",303,303,1,1,{"$f":"_xlfn.IFS(W766<=69%,\"Crítico\",W766>=90%,\"Aceptable\",W766>=70%,\"Tolerable\")","v":"Aceptable"}]
["Mejorar continuamente los procesos del Sistema Integrado de Gestión","Gestión Financiera","Administrar los recursos financieros asignados y realizar los respectivos registros, para el cumplimiento de las funciones de la entidad y pago de sus obligaciones con terceros","Oportunidad en el pago de las obligaciones financieras de la entidad","Oportunidad en la causación de ordenes de pago que cumplan con todos los requisitos establecidos","Oportunidad y veracidad de la información necesaria para la causación de las ordenes de pago reportada por los ordenadores del gasto","Porcentaje de cuentas colectivas pagadas dentro del tiempo establecido","(No. de cuentas colectivas pagadas en un tiempo menor o igual a 10 días/Total de cuentas de pago colectivas tramitadas)*100","Gestión","Calidad","Mensual",1,"Porcentaje","Bitácora de cuentas en SEVEN","Positiva","No","La medición y el análisis están a cargo del Área Financiera.\nEn el análisis del indicador se debe presentar el resultado del tiempo promedio en cada una de las etapas para el pago, según la bitácora de cuentas de SEVEN.",2019,"Octubre",54,54,1,1,{"$f":"_xlfn.IFS(W767<=69%,\"Crítico\",W767>=90%,\"Aceptable\",W767>=70%,\"Tolerable\")","v":"Aceptable"}]
["Implementar las políticas y líneas de acción para la preservación e integridad de la documentación","Gestión Documental","Administrar, conservar y custodiar la documentación generada en la entidad, desde su origen hasta su disposición final, para preservar la memoria institucional","Actualización del inventario documental en el Formato Único de Inventario Documental, con base en la aplicación de las tablas de retención documental","Cumplimiento de los tiempos de retención documental establecidos en las tablas","Actualización de los instrumentos archivísticos","Porcentaje de inventario validado del fondo documental acumulado del archivo central","(No. de metros lineales de inventario validado en cuanto a series, subseries, asuntos y oficinas productoras/Total de metros lineales de archivo inventariado en estado natural del archivo central)*100 ","Gestión","Eficacia","Mensual",1,"Porcentaje","Matriz de seguimiento a inventario documental","Positiva","Si","La meta es anual con medición y análisis mensual",2019,"Octubre",2184.83,2180.5,1.0019857830772758,1.0019857830772758,{"$f":"_xlfn.IFS(W768<=69%,\"Crítico\",W768>=90%,\"Aceptable\",W768>=70%,\"Tolerable\")","v":"Aceptable"}]
["Implementar las políticas y líneas de acción para la preservación e integridad de la documentación","Gestión Documental","Administrar, conservar y custodiar la documentación generada en la entidad, desde su origen hasta su disposición final, para preservar la memoria institucional","Oportunidad en las transferencias documentales de acuerdo con los tiempos de retención establecidos en las tablas",null,null,"Porcentaje de transferencias primarias realizadas de acuerdo con los tiempos de retención","(No. de transferencias primarias realizadas de acuerdo con los tiempos de retención establecidos en las TRD/Total de transferencias documentales programadas)*100","Gestión","Eficacia","Mensual",0.8,"Porcentaje","Matriz de seguimiento a transferencias documentales","Positiva","Si","La meta es anual con medición y análisis mensual",2019,"Octubre",47,33,1.4242424242424243,1.7803030303030303]
["Implementar las políticas y líneas de acción para la preservación e integridad de la documentación","Gestión Documental","Administrar, conservar y custodiar la documentación generada en la entidad, desde su origen hasta su disposición final, para preservar la memoria institucional","Cumplimiento de los estándares de temperatura, humedad relativa y luminosidad de los espacios de almacenamiento de material documental, dentro de los rangos establecidos en la normatividad vigente",null,null,"Porcentaje de espacios controlados para la conservación documental","(No. de espacios monitoreados e intervenidos/Total de espacios monitoreados)*100","Gestión","Eficacia","Mensual",1,"Porcentaje","Informe de monitoreo de espacios controlados","Positiva","No","La medición es mes vencido",2019,"Octubre",7,7,1,1,{"$f":"_xlfn.IFS(W770<=69%,\"Crítico\",W770>=90%,\"Aceptable\",W770>=70%,\"Tolerable\")","v":"Aceptable"}]
["Mejorar continuamente los procesos del Sistema Integrado de Gestión","Servicio a la Ciudadanía","Brindar información y atender los requerimientos de los grupos de valor y de interés de la entidad para responder a sus necesidades en cumplimiento de sus derechos","Oportunidad y calidad en la respuesta a los requerimientos de los grupos de valor e interés de la entidad",null,null,"Porcentaje de peticiones, quejas, reclamos y sugerencias contestadas dentro de los términos legales vigentes","(No. de peticiones, quejas, reclamos y sugerencias contestadas en el aplicativo SDQS dentro de los términos legales vigentes/Total de peticiones, quejas, reclamos y sugerencias recibidas)*100","Gestión","Calidad","Mensual",1,"Porcentaje","Sistema SDQS","Positiva","No","La medición es mes vencido",2019,"Octubre",282,324,0.87037037037037035,0.87037037037037035,"Tolerable"]
["Satisfacer las necesidades de los usuarios a través de la prestación de servicios eficientes, eficaces y efectivos","Servicio a la Ciudadanía","Brindar información y atender los requerimientos de los grupos de valor y de interés de la entidad para responder a sus necesidades en cumplimiento de sus derechos","Satisfacción del ciudadano frente a la atención brindada por la entidad",null,null,"Satisfacción del ciudadano con la atención recibida en los SUPERCADE","(No. de ciudadanos satisfechos con la atención recibida en los SUPERCADE/Total de ciudadanos atendidos en los SUPERCADE)*100","Gestión","Efectividad","Mensual",0.95,"Porcentaje","Encuesta de satisfacción con la atención brindada en SUPERCADES","Positiva","No",null,2019,"Octubre",2406,2407,0.99958454507685912,1.0521942579756411,"Aceptable"]
["Mejorar continuamente los procesos del Sistema Integrado de Gestión","Servicio a la Ciudadanía","Brindar información y atender los requerimientos de los grupos de valor y de interés de la entidad para responder a sus necesidades en cumplimiento de sus derechos","Oportunidad en la actualización de la información publicada en la sección de ley de transparencia en la página web de la entidad",null,null,"Porcentaje de información actualizada en ley de transparencia","(No. de subcategorías con información actualizada en la página web/Total de subcategorías definidas en ley de transparencia)*100","Gestión","Eficacia","Trimestral",1,"Porcentaje","Página web","Positiva","No",null,2019,"Octubre"]
["Mejorar continuamente los procesos del Sistema Integrado de Gestión","Servicio a la Ciudadanía","Brindar información y atender los requerimientos de los grupos de valor y de interés de la entidad para responder a sus necesidades en cumplimiento de sus derechos","Coherencia, claridad, solución de fondo, calidez y manejo del sistema en relación con los requerimientos atendidos por la entidad",null,null,"Porcentaje de requerimientos atendidos con oportunidad y calidad","(No. de respuestas a requerimientos sin observaciones en cuanto a los criterios de oportunidad y calidad/Total de requerimientos evaluados en el aplicativo SDQS)*100","Gestión","Eficacia","Mensual",0.8,"Porcentaje","SDQS y base de datos de gestión de PQRS","Positiva","No","La medición es mes vencido",2019,"Octubre",170,193,0.88082901554404147,1.1010362694300517,"Aceptable"]
["Implementar buenas prácticas ambientales para la prevención de la contaminación en el marco de una Bogotá que defiende lo público en su función administrativa y de desarrollo institucional","Gestión de Recursos Físicos","Administrar y controlar los bienes muebles y servicios para el funcionamiento administrativo de la entidad","Calificación de la implementación del Plan Institucional de Gestión Ambiental, por parte de la Secretaría Distrital de Ambiente","Oportunidad en el reporte de formularios y registros electrónicos del PIGA ante la Secretaría Distrital de Ambiente",null,"Índice de implementación del PIGA","Promedio ponderado de cumplimiento de aspectos normativos y de implementación del PIGA, según auditoría realizada por la Secretaría Distrital de Ambiente en cada vigencia","Gestión","Eficacia","Anual",0.7,"Porcentaje","Informe de auditoría anual realizada por la Secretaría Distrital de Ambiente","Positiva","No","En el análisis del indicador se presentará el resultado desagregado por cada uno de los aspectos evaluados en la visita de control y seguimiento por parte de la Secretaría Distrital de Ambiente.\nLa meta está configurada como mayor a 70%.",2019,"Octubre"]
["Proteger la integridad, confidencialidad y disponibilidad de la información","Gestión de Tecnología de la Información y las Comunicaciones","Proporcionar soluciones estratégicas de tecnologías de la información y las comunicaciones, para contribuir con la eficiencia administrativa, la mejora de los trámites y servicios y la protección de los activos de información de la entidad","Impacto del plan de remediación frente a las vulnerabilidades identificadas","Aseguramiento de incidencias en la seguridad de la información que afecten la confidencialidad, integridad y disponibilidad",null,"Porcentaje de remediación de vulnerabilidades de seguridad de la información","(No. de vulnerabilidades críticas o altas remediadas/Total de vulnerabilidades de seguridad de la información detectadas como críticas o altas)*100 ","Gestión","Eficacia","Anual",0.7,"Porcentaje","Matriz de vulnerabilidades","Positiva","No","La meta está configurada como mínimo 70%.",2019,"Octubre"]
["Proteger la integridad, confidencialidad y disponibilidad de la información","Gestión de Tecnología de la Información y las Comunicaciones","Proporcionar soluciones estratégicas de tecnologías de la información y las comunicaciones, para contribuir con la eficiencia administrativa, la mejora de los trámites y servicios y la protección de los activos de información de la entidad","Avances en la implementación de gobierno digital de acuerdo con los componentes evaluados por MINTIC",null,null,"Índice de implementación de gobierno digital","Sumatoria de la calificación obtenida por cada componente/Total de componentes de la política de gobierno digital","Gestión","Eficacia","Anual",0.65,"Porcentaje","Instrumento de medición suministrado para el seguimiento a la política de gobierno digital  ","Positiva","No","En el análisis del indicador se presentará el resultado desagregado de las calificaciones obtenidas en cada componente de la política de seguridad digital.",2019,"Octubre"]
["Mejorar continuamente los procesos del Sistema Integrado de Gestión","Gestión de Tecnología de la Información y las Comunicaciones","Proporcionar soluciones estratégicas de tecnologías de la información y las comunicaciones, para contribuir con la eficiencia administrativa, la mejora de los trámites y servicios y la protección de los activos de información de la entidad","Cumplimiento del Plan Estratégico de Tecnologías de la Información PETI",null,null,"Porcentaje de avance en proyectos de TI","(No. de hitos en proyectos de TI alcanzados/Total de hitos en proyectos de TI programados en la vigencia)*100","Gestión","Eficacia","Semestral",1,"Porcentaje","Cronograma de proyectos del PETI","Positiva","Si","La meta es anual con medición y análisis semestral.",2019,"Octubre"]
["Proteger la integridad, confidencialidad y disponibilidad de la información","Gestión de Tecnología de la Información y las Comunicaciones","Proporcionar soluciones estratégicas de tecnologías de la información y las comunicaciones, para contribuir con la eficiencia administrativa, la mejora de los trámites y servicios y la protección de los activos de información de la entidad","Disponibilidad de los sistemas de información de la entidad",null,null,"Porcentaje de disponibilidad de los sistemas de información","(No. de horas disponibles de los sistemas de información/Total de horas en servicio de los sistemas de información)*100","Gestión","Eficiencia","Mensual",0.9,"Porcentaje","Herramienta de monitoreo ZABBIX","Positiva","No","En el análisis del indidicador se presentará el resultado desagregado de disponibilidad en ORFEO, SEVEN, KACTUS y SIM.\nLa meta está configurada como mayor o igual a 90%.",2019,"Octubre",743.70799999999997,744,0.99960752688172039,1.1106750298685781,{"$f":"_xlfn.IFS(W779<=69%,\"Crítico\",W779>=90%,\"Aceptable\",W779>=70%,\"Tolerable\")","v":"Aceptable"}]
["Mejorar continuamente los procesos del Sistema Integrado de Gestión","Gestión de Tecnología de la Información y las Comunicaciones","Proporcionar soluciones estratégicas de tecnologías de la información y las comunicaciones, para contribuir con la eficiencia administrativa, la mejora de los trámites y servicios y la protección de los activos de información de la entidad","Disponibilidad de los servicios de comunicaciones en la entidad, según los acuerdos de niveles de servicios establecidos",null,null,"Porcentaje de disponibilidad de los servicios de comunicaciones","(No. de horas disponibles de los servicios de comunicaciones /Total de horas de los servicios de comunicaciones)*100","Gestión","Eficiencia","Mensual",0.9,"Porcentaje","Herramienta de monitoreo ZABBIX","Positiva","No","En el análisis del indidicador se presentará el resultado desagregado de disponibilidad en Internet y Telefonía IP.\nLa meta está configurada como mayor o igual a 90%.",2019,"Octubre",743.98,744,0.99997311827956992,1.1110812425328553,"Aceptable"]
["Mejorar continuamente los procesos del Sistema Integrado de Gestión","Gestión de Tecnología de la Información y las Comunicaciones","Proporcionar soluciones estratégicas de tecnologías de la información y las comunicaciones, para contribuir con la eficiencia administrativa, la mejora de los trámites y servicios y la protección de los activos de información de la entidad","Incidencias reportadas en el funcionamiento del módulo o sistema de información implementado","Cumplimiento de los acuerdos de niveles de servicios establecidos",null,"Porcentaje de solicitudes de servicio tecnológico atendidas dentro de los tiempos establecidos","(No. de solicitudes atendidas dentro de los tiempos establecidos en los acuerdos de nivel de servicio/Total de solicitudes de servicio tecnológico recibidas)*100","Gestión","Calidad","Mensual",0.9,"Porcentaje","Herramienta GLPI","Positiva","No",null,2019,"Octubre",766,767,0.99869621903520212,1.109662465594669,"Aceptable"]
["Mejorar continuamente los procesos del Sistema Integrado de Gestión","Gestión de Talento Humano","Gestionar el potencial del talento humano como factor estratégico, para contribuir con el desarrollo de la entidad en un ambiente seguro y saludable","Cumplimiento de compromisos y competencias del servidor público en el desempeño laboral","Oportunidad en el seguimiento y la evaluación anual u ordinaria del servidor público para continuar su permanencia en el servicio",null,"Índice de desempeño laboral de funcionarios","(Sumatoria de calificaciones finales de la evaluación de desempeño de los funcionarios/Total de funcionarios evaluados)*100","Gestión","Eficacia","Anual",0.9,"Porcentaje","Consolidado de las calificaciones finales de la evaluación de desempeño","Positiva","No","En el análisis del indicador se presentará el resultado desagregado por niveles jerárquicos y comparar con la evaluación de las áreas.\nLa meta está configurada como mayor a 90%.\nNota: Se mide para vigencia 2018-2019.",2019,"Octubre"]
["Mejorar continuamente los procesos del Sistema Integrado de Gestión","Gestión de Talento Humano","Gestionar el potencial del talento humano como factor estratégico, para contribuir con el desarrollo de la entidad en un ambiente seguro y saludable","Cobertura de servidores públicos en las actividades del plan de bienestar e incentivos",null,null,"Porcentaje de funcionarios que participan en las actividades del plan de bienestar e incentivos","(No. de funcionarios participantes en las actividades del plan de bienestar e incentivos/Total de funcionarios de la entidad)*100 ","Gestión","Eficacia","Semestral",0.8,"Porcentaje","Registros de asistencia a las actividades del plan de bienestar","Positiva","No",null,2019,"Octubre"]
["Mejorar continuamente los procesos del Sistema Integrado de Gestión","Gestión de Talento Humano","Gestionar el potencial del talento humano como factor estratégico, para contribuir con el desarrollo de la entidad en un ambiente seguro y saludable","Cobertura de servidores públicos en las actividades del plan institucional de capacitación",null,null,"Porcentaje de funcionarios que asisten a las actividades del plan institucional de capacitación","(No. de funcionarios asistentes a las actividades del plan institucional de capacitación/Total de funcionarios citados a las actividades del plan institucional de capacitación)*100","Gestión","Eficacia","Semestral",0.8,"Porcentaje","Registros de asistencia a las actividades del plan de capacitación","Positiva","No","Las capacitaciones que se incluyen en el indicador son las que implican recursos.",2019,"Octubre"]
["Mejorar continuamente los procesos del Sistema Integrado de Gestión","Gestión de Talento Humano","Gestionar el potencial del talento humano como factor estratégico, para contribuir con el desarrollo de la entidad en un ambiente seguro y saludable","Evaluación del impacto de la capacitación en el desempeño de los servidores públicos y de la entidad",null,null,"Impacto de la capacitación en el desempeño laboral de funcionarios","(No. de funcionarios con capacitaciones efectivas/Total de funcionarios evaluados)*100","Gestión","Eficacia","Trimestral",0.95,"Porcentaje","Consolidado de las evaluaciones de impacto de la capacitación","Positiva","No",null,2019,"Octubre"]
["Mejorar continuamente los procesos del Sistema Integrado de Gestión","Gestión de Talento Humano","Gestionar el potencial del talento humano como factor estratégico, para contribuir con el desarrollo de la entidad en un ambiente seguro y saludable","Satisfacción de los servidores públicos frente a las actividades de  bienestar e incentivos","Satisfacción de los servidores públicos frente a las actividades de capacitación",null,"Índice de clima organizacional","Promedio ponderado de las dimensiones evaluadas en la encuesta de medición de clima organizacional","Gestión","Eficacia","Anual",0.8,"Porcentaje","Informe de medición de clima organizacional","Positiva","No","En el análisis del indicador se presentará el resultado desagregado por áreas y/o dependencias, y por las dimensiones evaluadas.",2019,"Octubre"]
["Mejorar continuamente los procesos del Sistema Integrado de Gestión","Gestión de Talento Humano","Gestionar el potencial del talento humano como factor estratégico, para contribuir con el desarrollo de la entidad en un ambiente seguro y saludable","Cumplimiento del plan anual de  bienestar e incentivos",null,null,"Porcentaje de ejecución del plan anual de bienestar e incentivos","(No. de actividades de bienestar e incentivos desarrolladas/Total de actividades programadas en el plan anual de bienestar e incentivos)*100","Gestión","Eficacia","Semestral",1,"Porcentaje","Matriz de seguimiento a la ejecución de actividades de bienestar e incentivos","Positiva","Si","La meta es anual con medición y análisis semestral.",2019,"Octubre"]
["Mejorar continuamente los procesos del Sistema Integrado de Gestión","Gestión de Talento Humano","Gestionar el potencial del talento humano como factor estratégico, para contribuir con el desarrollo de la entidad en un ambiente seguro y saludable","Cumplimiento del plan institucional de capacitación",null,null,"Porcentaje de ejecución del plan institucional de capacitación","(No. de actividades de capacitación desarrolladas/Total de actividades programadas en el plan institucional de capacitación)*100","Gestión","Eficacia","Semestral",1,"Porcentaje","Matriz de seguimiento a la ejecución de actividades de capacitación","Positiva","Si","La meta es anual con medición y análisis semestral.",2019,"Octubre"]
["Prevenir los factores que afecten la salud y seguridad a fin de mejorar las condiciones del ambiente de trabajo","Gestión de Talento Humano","Gestionar el potencial del talento humano como factor estratégico, para contribuir con el desarrollo de la entidad en un ambiente seguro y saludable","Cumplimiento del plan anual de trabajo",null,null,"Porcentaje de ejecución del plan anual de seguridad y salud en el trabajo","(No. de actividades de seguridad y salud desarrolladas/Total de actividades programadas en el plan anual de seguridad y salud en el trabajo)*100","Gestión","Eficacia","Mensual",0.95,"Porcentaje","Plan de trabajo anual del Sistema de Gestión de Seguridad y Salud en el Trabajo","Positiva","No",null,2019,"Octubre",273,294,0.9285714285714286,0.97744360902255645,{"$f":"_xlfn.IFS(W789<=69%,\"Crítico\",W789>=90%,\"Aceptable\",W789>=70%,\"Tolerable\")","v":"Aceptable"}]
["Prevenir los factores que afecten la salud y seguridad a fin de mejorar las condiciones del ambiente de trabajo","Gestión de Talento Humano","Gestionar el potencial del talento humano como factor estratégico, para contribuir con el desarrollo de la entidad en un ambiente seguro y saludable","Tasa de accidentalidad",null,null,"Tasa de accidentalidad","(No. de accidentes de trabajo reportados/Total de trabajadores (funcionarios y contratistas)*100","Gestión","Efectividad","Mensual",0.04,"Porcentaje","Matriz de accidentes de trabajo","Negativa","No","La meta está configurada como menor o igual a 4%.",2019,"Octubre",94,3181,2.9550455831499529E-2,{"$f":"((L790-V790)+L790)/L790","v":1.2612386042125119},"Aceptable"]
["Prevenir los factores que afecten la salud y seguridad a fin de mejorar las condiciones del ambiente de trabajo","Gestión de Talento Humano","Gestionar el potencial del talento humano como factor estratégico, para contribuir con el desarrollo de la entidad en un ambiente seguro y saludable","Incidencia y prevalencia de enfermedades laborales",null,null," Prevalencia de la enfermedad laboral","(No. de casos de enfermedad laboral calificada/Total de funcionarios)*100","Gestión","Efectividad","Trimestral",0.02,"Porcentaje","Matriz de seguimiento de enfermedades laborales","Negativa","No","La meta está configurada como menor o igual a 2%.",2019,"Octubre"]
["Prevenir los factores que afecten la salud y seguridad a fin de mejorar las condiciones del ambiente de trabajo","Gestión de Talento Humano","Gestionar el potencial del talento humano como factor estratégico, para contribuir con el desarrollo de la entidad en un ambiente seguro y saludable","Incidencia y prevalencia de enfermedades laborales",null,null,"Incidencia de la enfermedad laboral","(No. de casos nuevos de enfermedad laboral calificados/Total de funcionarios)*100","Gestión","Efectividad","Trimestral",0.01,"Porcentaje","Matriz de seguimiento de enfermedades laborales","Negativa","No","La meta está configurada como menor o igual a 1%.",2019,"Octubre"]
["Mejorar continuamente los procesos del Sistema Integrado de Gestión","Gestión de Recursos Físicos","Administrar y controlar los bienes muebles y servicios para el funcionamiento administrativo de la entidad","Confiabilidad del inventario de bienes devolutivos",null,null,"Porcentaje de inventario individual validado físicamente","(No. de elementos devolutivos del inventario individual validados físicamente/Total de elementos devolutivos del inventario individual registrados en el sistema de información SEVEN)*100 ","Gestión","Eficacia","Anual",1,"Porcentaje","Sistema de información SEVEN","Positiva","No",null,2019,"Octubre"]
["Mejorar continuamente los procesos del Sistema Integrado de Gestión","Gestión de Recursos Físicos","Administrar y controlar los bienes muebles y servicios para el funcionamiento administrativo de la entidad","Confiabilidad del inventario de bienes devolutivos",null,null,"Porcentaje de inventario aleatorio validado físicamente en bodega","(No. de elementos devolutivos y de consumo en bodegas validados físicamente/Muestra de inventario de elementos devolutivos y de consumo registrados en el sistema de información SEVEN)*100 ","Gestión","Eficacia","Trimestral",1,"Porcentaje","Sistema de información SEVEN","Positiva","No",null,2019,"Octubre"]
["Mejorar continuamente los procesos del Sistema Integrado de Gestión","Gestión de Asuntos Locales","Desarrollar acciones a nivel local para promover la participación ciudadana, brindar acompañamiento a las alcaldías locales en temas misionales de la entidad y ofertar sus programas","Cumplimiento de los compromisos adquiridos por la entidad, en el marco de las instancias de participación locales",null,null,"Porcentaje de compromisos atendidos en el marco de las instancias de participación locales","(No. de compromisos atendidos en las instancias Consejo Local de Gobierno, Unidad de Apoyo Técnico y Comisión Local Intersectorial de Participación /Total de compromisos generados en las instancias Consejo Local de Gobierno, Unidad de Apoyo Técnico y Comisión Local Intersectorial de Participación)*100","Gestión","Eficacia","Trimestral",1,"Porcentaje","Matriz de seguimiento a compromisos derivados de instancias de participación locales","Positiva","No",null,2019,"Octubre"]
["Mejorar continuamente los procesos del Sistema Integrado de Gestión","Gestión de Asuntos Locales","Desarrollar acciones a nivel local para promover la participación ciudadana, brindar acompañamiento a las alcaldías locales en temas misionales de la entidad y ofertar sus programas","Efectividad en la atención de la demanda de actividades recreodeportivas en las localidades de Bogotá",null,null,"Porcentaje de actividades recreativas programadas por asuntos locales","(No. de actividades recreativas programadas en la plataforma SIM por los gestores locales/Total de actividades recreativas solicitadas por Promoción de la Recreación)*100","Gestión","Eficacia","Mensual",1,"Porcentaje","Sistema de información misional - SIM\nCuadro de metas de actividades recreativas","Positiva","No",null,2019,"Octubre",3798,2691,1.4113712374581939,{"$f":"+V796/L796","v":1.4113712374581939},"Aceptable"]
["Mejorar continuamente los procesos del Sistema Integrado de Gestión","Gestión de Asuntos Locales","Desarrollar acciones a nivel local para promover la participación ciudadana, brindar acompañamiento a las alcaldías locales en temas misionales de la entidad y ofertar sus programas","Efectividad en la atención de la demanda de actividades recreodeportivas en las localidades de Bogotá",null,null,"Porcentaje de beneficiarios inscritos por asuntos locales en actividades deportivas","(No. de beneficiarios inscritos en actividades deportivas por los gestores locales/Total de beneficiarios de actividades deportivas programados por Fomento al Deporte)*100","Gestión","Eficacia","Trimestral",1,"Porcentaje","Reporte de las distintas plataformas para inscripciones\nCuadro de metas de actividades deportivas","Positiva","No",null,2019,"Octubre"]
["Mejorar continuamente los procesos del Sistema Integrado de Gestión","Gestión de Asuntos Locales","Desarrollar acciones a nivel local para promover la participación ciudadana, brindar acompañamiento a las alcaldías locales en temas misionales de la entidad y ofertar sus programas","Cumplimiento de lineamientos y criterios de elegibilidad y viabilidad de los proyectos de contratación",null,null,"Porcentaje de asistencias técnicas realizadas a los Fondos de Desarrollo Local","(No. de asistencias técnicas realizadas a los Fondos de Desarrollo Local/Total de asistencias técnicas programadas a los Fondos de Desarrollo Local en las cuatro líneas de inversión)*100","Gestión","Eficacia","Trimestral",1,"Porcentaje","Cronograma de asistencias técnicas a los Fondos de Desarrollo Local","Positiva","No",null,2019,"Octubre"]
["Mejorar continuamente los procesos del Sistema Integrado de Gestión","Gestión de Asuntos Locales","Desarrollar acciones a nivel local para promover la participación ciudadana, brindar acompañamiento a las alcaldías locales en temas misionales de la entidad y ofertar sus programas","Ejecución de los proyectos con recursos de los fondos de desarrollo local, en concordancia con el concepto previo y favorable emitido por la entidad",null,null,"Porcentaje de proyectos viabilizados con seguimiento efectuado","(No. de proyectos contratados con seguimiento efectuado/Total de proyectos viabilizados con contratación por parte de los Fondos de Desarrollo Local)*100","Gestión","Eficacia","Trimestral",1,"Porcentaje","SECOP\nInforme de seguimiento a viabilidades","Positiva","No",null,2019,"Octubre"]
["Mejorar continuamente los procesos del Sistema Integrado de Gestión","Control Disciplinario","Investigar conductas presuntamente disciplinables e imponer sanciones cuando haya lugar, tanto a servidores como a ex-servidores públicos de la entidad, con el fin de que éstos cumplan con sus deberes y funciones","Cumplimiento de los términos legales en las distintas etapas procesales",null,null,"Porcentaje de procesos disciplinarios resueltos de fondo","(No. de procesos disciplinarios decididos de fondo/Total de procesos disciplinarios activos)*100","Gestión","Eficacia","Semestral",0.6,"Porcentaje","Matriz de autos","Positiva","No",null,2019,"Octubre"]
["Mejorar continuamente los procesos del Sistema Integrado de Gestión","Control Disciplinario","Investigar conductas presuntamente disciplinables e imponer sanciones cuando haya lugar, tanto a servidores como a ex-servidores públicos de la entidad, con el fin de que éstos cumplan con sus deberes y funciones","Garantía del debido proceso en las distintas etapas procesales",null,null,"Porcentaje de procesos disciplinarios sin nulidades decretadas","(No. de procesos disciplinarios sin nulidades decretadas/Total de procesos disciplinarios activos)*100 ","Gestión","Eficacia","Trimestral",1,"Porcentaje","Matriz de autos","Positiva","No",null,2019,"Octubre"]
["Mejorar continuamente los procesos del Sistema Integrado de Gestión","Control Disciplinario","Investigar conductas presuntamente disciplinables e imponer sanciones cuando haya lugar, tanto a servidores como a ex-servidores públicos de la entidad, con el fin de que éstos cumplan con sus deberes y funciones","Cumplimiento de los términos legales en las distintas etapas procesales",null,null,"Porcentaje de procesos disciplinarios sin vencimiento de términos","(No. de procesos disciplinarios sin vencimiento de términos/Total de procesos disciplinarios activos)*100","Gestión","Calidad","Trimestral",1,"Porcentaje","Expediente del proceso disciplinario ","Positiva","No",null,2019,"Octubre"]
["Mejorar continuamente los procesos del Sistema Integrado de Gestión","Administración y Mantenimiento de Parques y Escenarios","Ofrecer parques y escenarios del Sistema Distrital para el uso y disfrute de la comunidad general, gestionando la sostenibilidad física, social, ambiental y económica","Uso de parques y escenarios con motivación económica que generen recursos para el mantenimiento de los mismos",null,null,"Aprovechamiento económico de parques y/o escenarios","(Ingresos del mes + acumulado de los ingresos del mes anterior/Total presupuesto anual)*100","Gestión","Eficiencia","Mensual",1,"Porcentaje","Sistema de información SEVEN","Positiva","Si","La meta es anual con medición y análisis mensual.\n\nEn el análisis del indicador se presentará la desagregación del aprovechamiento económico por tipo de parque y/o escenario, expresado en ingresos y participación porcentual.",2019,"Octubre",20173244,22044017,{"$f":"+T803/U803","v":0.91513465989433773},0.91513465989433773]
["Satisfacer las necesidades de los usuarios a través de la prestación de servicios eficientes, eficaces y efectivos","Administración y Mantenimiento de Parques y Escenarios","Ofrecer parques y escenarios del Sistema Distrital para el uso y disfrute de la comunidad general, gestionando la sostenibilidad física, social, ambiental y económica","Satisfacción de los usuarios con las actividades de mantenimiento preventivo y correctivo",null,null,"Satisfacción de los usuarios con las obras de mantenimiento de nuevas tendencias","(No. de usuarios satisfechos con las obras de mantenimiento realizadas/Total de usuarios de parques y escenarios encuestados para obras de mantenimiento de nuevas tendencias)*100","Gestión","Efectividad","Anual",0.9,"Porcentaje","Encuesta de satisfacción con las obras de mantenimiento de nuevas tendencias","Positiva","No","En el análisis del indicador se presentará el resultado desagregado por cada uno de los aspectos evaluados en la encuesta de satisfacción.",2019,"Octubre"]
["Mejorar continuamente los procesos del Sistema Integrado de Gestión","Administración y Mantenimiento de Parques y Escenarios","Ofrecer parques y escenarios del Sistema Distrital para el uso y disfrute de la comunidad general, gestionando la sostenibilidad física, social, ambiental y económica","Oportunidad y cumplimiento en la generación de compromisos o acuerdos ciudadanos frente al uso y sostenibilidad de los parques administrados",null,null,"Porcentaje de cumplimiento en acuerdos de sostenibilidad social de parques","(No. de compromisos gestionados/Total de compromisos adquiridos mediante acuerdos ciudadanos en parques)*100","Gestión","Eficacia","Trimestral",1,"Porcentaje","Matriz de seguimiento a compromisos o acuerdos ciudadanos","Positiva","No",null,2019,"Octubre"]
["Mejorar continuamente los procesos del Sistema Integrado de Gestión","Administración y Mantenimiento de Parques y Escenarios","Ofrecer parques y escenarios del Sistema Distrital para el uso y disfrute de la comunidad general, gestionando la sostenibilidad física, social, ambiental y económica","Disponibilidad de los equipamientos en parques y escenarios","Cumplimiento de las especificaciones técnicas en las actividades de mantenimiento preventivo y correctivo","Cobertura en el mantenimiento de parques y escenarios de acuerdo con la priorización","Porcentaje de avance en la ejecución de contratos de obras de mantenimiento o recuperación","(Porcentaje contrato 1 + Porcentaje contrato 2 +...+ Porcentaje contrato n)/Total de contratos de obras de mantenimiento o recuperación en ejecución\nDonde: \nPorcentaje contrato n = Avance físico ejecutado/Avance físico programado\nn = Número de contratos de obras de mantenimiento o recuperación en ejecución","Gestión","Eficacia","Bimestral",0.9,"Porcentaje","Informes mensuales de interventoría presentados según programación de los contratistas","Positiva","No",null,2019,"Octubre",5.85,6,0.97499999999999998,1.0833333333333333,{"$f":"_xlfn.IFS(W806<=69%,\"Crítico\",W806>=90%,\"Aceptable\",W806>=70%,\"Tolerable\")","v":"Aceptable"}]
["Satisfacer las necesidades de los usuarios a través de la prestación de servicios eficientes, eficaces y efectivos","Diseño y Construcción de Parques y Escenarios","Ampliar y mejorar la infraestructura física recreativa y deportiva del Distrito Capital para el uso de la comunidad en general","Cumplimiento de requisitos técnicos, administrativos, financieros y jurídicos de los proyectos",null,null,"Satisfacción de los usuarios con las obras de construcción y/o adecuación entregadas","(No. de usuarios satisfechos con las obras de construcción y/o adecuación entregadas /Total de usuarios encuestados por proyecto)*100","Gestión","Efectividad","Anual",0.9,"Porcentaje","Resultados de la encuesta de satisfacción entregados por los contratistas de obra","Positiva","No","En el análisis del indicador se presentará el resultado desagregado por cada uno de los aspectos evaluados en la encuesta de satisfacción.",2019,"Octubre"]
["Mejorar continuamente los procesos del Sistema Integrado de Gestión","Diseño y Construcción de Parques y Escenarios","Ampliar y mejorar la infraestructura física recreativa y deportiva del Distrito Capital para el uso de la comunidad en general","Oportunidad en el seguimiento y adopción de medidas durante el seguimiento de la estabilidad de la obra","Cumplimiento de especificaciones técnicas conforme a lo establecido en la etapa de construcción",null,"Porcentaje de fallas de calidad o estabilidad de obra atendidas en construcción y adecuación de parques y escenarios","(No. de fallas de calidad o estabilidad de obra atendidas/Total de fallas de calidad o estabilidad de obra detectadas o reportadas por terceros)*100\n\nAtendido = Se genera requerimiento al contratista para establecer compromisos de reparación.","Gestión","Eficacia","Trimestral",0.9,"Porcentaje","Actas de visita o reconocimiento de estabilidad de obra \nActa de compromiso de reparación constructiva\nProgramación de visita\nComunicación oficial- notificación de fallas visita de inspección por estabilidad \nActa de verificación de reparación constructiva","Positiva","No","En el análisis del indicador se presentará la desagregación por parque y escenario.",2019,"Octubre"]
["Mejorar continuamente los procesos del Sistema Integrado de Gestión","Diseño y Construcción de Parques y Escenarios","Ampliar y mejorar la infraestructura física recreativa y deportiva del Distrito Capital para el uso de la comunidad en general","Cumplimiento de requisitos técnicos, administrativos, financieros y jurídicos de los proyectos","Oportunidad en el seguimiento y adopción de medidas durante la ejecución de las obras","Cumplimiento del alcance de las obras conforme a los estudios y diseños, especificaciones técnicas y normatividad vigente","Porcentaje de avance en la ejecución de obras de construcción y adecuación de parques y escenarios","((%Ejecutado Obra 1*Plazo de ejecución Obra 1)+(%Ejecutado Obra 2*Plazo de ejecución Obra 2) +...+ (%Ejecutado Obra n*Plazo de ejecución Obra n))/((%Programado Obra 1*Plazo de ejecución Obra 1)+(%Programado Obra 2*Plazo de ejecución Obra 2) +...+ (%Programado Obra n*Plazo de ejecución Obra n))\nDonde:\nn = Número de obras en ejecución","Gestión","Eficacia","Mensual",0.9,"Porcentaje","Informes mensuales de interventoría\n\nInformes mensuales de supervisión","Positiva","No","En el análisis del indicador se presentará la desagregación por parque y escenario.",2019,"Octubre",67.38,72.599999999999994,0.92809917355371907,1.0312213039485767,"Aceptable"]
["Mejorar continuamente los procesos del Sistema Integrado de Gestión","Diseño y Construcción de Parques y Escenarios","Ampliar y mejorar la infraestructura física recreativa y deportiva del Distrito Capital para el uso de la comunidad en general","\nCumplimiento de requisitos técnicos, administrativos, financieros y legales de los proyectos de estudios y diseños","Oportunidad en el seguimiento y adopción de medidas durante la ejecución de los proyectos de estudios y diseños","Cumplimiento del alcance de los proyectos de estudios y diseños conforme a las necesidades identificadas","Porcentaje de avance en la ejecución de proyectos de estudios y/o diseños de parques y escenarios","(Porcentaje proyecto 1 + Porcentaje proyecto 2 +...+ Porcentaje proyecto n)/Total de proyectos de estudios y/o diseños en ejecución\nDonde: \nPorcentaje proyecto n =(Avance ejecutado de estudios y/o diseños/Avance programado de estudios y/o diseños al corte según forma de pago)\nn = Número de proyectos de estudios y/o diseños en ejecución","Gestión","Eficacia","Mensual",0.9,"Porcentaje","Informes mensuales de interventoría\n\nInformes mensuales de supervisión","Positiva","No","En el análisis del indicador se presentará la desagregación por proyecto.",2019,"Octubre",95.39,100,0.95389999999999997,1.0598888888888889,"Aceptable"]
["Mejorar continuamente los procesos del Sistema Integrado de Gestión","Gestión Jurídica","Ejercer la defensa judicial y extrajudicial de la entidad y atender requerimientos jurídicos, para salvaguardar sus intereses y cumplir con los requisitos constitucionales y legales","Intervención oportuna en las distintas actuaciones judiciales y extrajudiciales en que sea parte la entidad","Oportunidad en el seguimiento a los procesos en los despachos e instancias judiciales",null,"Porcentaje de procesos judiciales y extrajudiciales atendidos dentro de los términos legales vigentes","(No. de procesos jurídicos atendidos dentro de los términos legales vigentes)/Total de procesos jurídicos notificados)*100","Gestión","Calidad","Trimestral",1,"Porcentaje","SIPROJ Web\nORFEO","Positiva","No","En el análisis del indicador se presentará la desagregación por procesos judiciales y extrajudiciales.",2019,"Octubre"]
["Satisfacer las necesidades de los usuarios a través de la prestación de servicios eficientes, eficaces y efectivos","Gestión Jurídica","Ejercer la defensa judicial y extrajudicial de la entidad y atender requerimientos jurídicos, para salvaguardar sus intereses y cumplir con los requisitos constitucionales y legales","Cumplimiento de los requisitos establecidos para el reconocimiento deportivo y el aval de escuelas deportivas",null,null,"Satisfacción de los usuarios con el trámite de reconocimiento deportivo","(No. de usuarios satisfechos con el trámite de reconocimiento deportivo/Total de usuarios encuestados)*100","Gestión","Efectividad","Semestral",0.95,"Porcentaje","Encuesta de satisfacción de usuarios de reconocimiento deportivo","Positiva","No","En el análisis del indicador se presentarán los resultados desagregados por cada uno de los aspectos evaluados en la encuesta de satisfacción.",2019,"Octubre"]
["Mejorar continuamente los procesos del Sistema Integrado de Gestión","Gestión Jurídica","Ejercer la defensa judicial y extrajudicial de la entidad y atender requerimientos jurídicos, para salvaguardar sus intereses y cumplir con los requisitos constitucionales y legales","Oportunidad en la respuesta del trámite de otorgamiento deportivo (45 días hábiles siguientes al cumplimiento de requisitos de otorgamiento deportivo)","Vigencia y aplicabilidad de la normatividad empleada para el reconocimiento deportivo y el aval de escuelas deportivas",null,"Porcentaje de trámites de reconocimiento deportivo atendidos dentro del término legal vigente","(No. de trámites de reconocimiento deportivo atendidos dentro del término legal vigente/Total de trámites de reconocimiento deportivo atendidos)*100 ","Gestión","Calidad","Trimestral",0.92,"Porcentaje","Matriz de control de reconocimiento deportivo","Positiva","No",null,2019,"Octubre"]
["Mejorar continuamente los procesos del Sistema Integrado de Gestión","Gestión Jurídica","Ejercer la defensa judicial y extrajudicial de la entidad y atender requerimientos jurídicos, para salvaguardar sus intereses y cumplir con los requisitos constitucionales y legales","Oportunidad en la respuesta del trámite de aval de escuelas deportivas (58 días hábiles)","Vigencia y aplicabilidad de la normatividad empleada para el reconocimiento deportivo y el aval de escuelas deportivas",null,"Porcentaje de trámites de aval de escuelas deportivas atendidos dentro del término legal vigente","(No. de trámites de aval de escuelas deportivas atendidos dentro del término legal vigente/Total de trámites de aval de escuelas deportivas atendidos)*100","Gestión","Calidad","Trimestral",0.92,"Porcentaje","Matriz de control de aval de escuelas deportivas","Positiva","No",null,2019,"Octubre"]
["Mejorar continuamente los procesos del Sistema Integrado de Gestión","Gestión Jurídica","Ejercer la defensa judicial y extrajudicial de la entidad y atender requerimientos jurídicos, para salvaguardar sus intereses y cumplir con los requisitos constitucionales y legales","Oportunidad en la respuesta a conceptos de proyectos de acuerdo con los tiempos establecidos","Suministro oportuno de la información de carácter técnico, de oportunidad y conveniencia del proyecto por parte de las dependencias y áreas de la entidad",null,"Porcentaje de solicitudes de concepto a proyectos de acuerdo, decreto o ley atendidas dentro del tiempo establecido","(No. de solicitudes de concepto a proyectos de acuerdo, decreto o ley atendidas dentro del tiempo establecido/Total de solicitudes de concepto a proyectos de acuerdo, decreto o ley recibidas)*100","Gestión","Calidad","Semestral",0.9,"Porcentaje","Matriz de seguimiento a solicitudes Congreso y Concejo","Positiva","No","En el análisis del indicador se presentará la desagregación por proyectos de acuerdo, decreto y ley.",2019,"Octubre"]
["Mejorar continuamente los procesos del Sistema Integrado de Gestión","Gestión Jurídica","Ejercer la defensa judicial y extrajudicial de la entidad y atender requerimientos jurídicos, para salvaguardar sus intereses y cumplir con los requisitos constitucionales y legales","Recuperación de la cartera en mora",null,null,"Porcentaje de procesos de cobro de cartera efectuados","(No. de procesos con etapas de cobro efectuadas/Total de procesos de cobro remitidos con documentación completa)*100","Gestión","Eficacia","Cuatrimestral",1,"Porcentaje","Matriz de seguimiento cobro de cartera","Positiva","No","Los primeros cinco días hábiles de mayo se reportará el indicador con corte a 31 de diciembre del año anterior. \nLos primeros días de septiembre se reportará con corte 30 de abril de la vigencia.\nLos primeros días de enero se reportará con corte a 31 de agosto del año anterior.\nEn el análisis del indicador se presentará la desagregación por etapa (persuasivo y coactivo), así como también el porcentaje de recuperación de cartera.",2019,"Octubre"]
["Mejorar continuamente los procesos del Sistema Integrado de Gestión","Gestión Jurídica","Ejercer la defensa judicial y extrajudicial de la entidad y atender requerimientos jurídicos, para salvaguardar sus intereses y cumplir con los requisitos constitucionales y legales","Intervención oportuna en las distintas actuaciones judiciales y extrajudiciales en que sea parte la entidad - tipos de daño en que se resulte demandado o condenado",null,null,"Índice de condenas adversas","(No. de condenas adversas/Total de procesos judiciales)*100","Gestión","Calidad","Semestral",0.08,"Porcentaje","Informe Siproj web mensual (procesos judiciales)","Negativa","No","El análisis del indicador debe evaluar dentro del comité de conciliación los procesos que cursen o hayan cursado en contra de la entidad, determinando causas generadoras de conflictos y los tipos de daño.",2019,"Octubre"]
["Mejorar continuamente los procesos del Sistema Integrado de Gestión","Gestión de Comunicaciones","Dar a conocer interna y externamente las actividades, programas y obras que realiza la entidad, para generar apropiación y participación que contribuyan al posicionamiento de la imagen institucional","Exigencia de la solicitud de servicios para todos los procesos con la información completa y detallada de lo requerido","Veracidad de la información reportada por los solicitantes del servicio ",null,"Porcentaje de solicitudes de servicios de comunicaciones atendidas dentro de los tiempos establecidos","(No. de solicitudes de servicio atendidas dentro de los tiempos establecidos/Total de solicitudes de servicio de comunicaciones recibidas)*100","Gestión","Calidad","Trimestral",0.9,"Porcentaje","Consolidado de solicitudes de servicios de comunicaciones","Positiva","No",null,2019,"Octubre"]
["Mejorar continuamente los procesos del Sistema Integrado de Gestión","Gestión de Comunicaciones","Dar a conocer interna y externamente las actividades, programas y obras que realiza la entidad, para generar apropiación y participación que contribuyan al posicionamiento de la imagen institucional","Relacionamiento con medios de comunicación","Análisis de los resultados obtenidos mediante el monitoreo de medios para facilitar la toma de decisiones",null,"Impacto de noticias publicadas en medios de comunicación","(No. de noticias positivas o neutras registradas/Total de noticias publicadas en medios de comunicación)*100","Gestión","Eficacia","Trimestral",1,"Porcentaje","Informes mensuales generados por la empresa contratada para realizar el monitoreo de medios","Positiva","No","En el análisis del indicador se presentará el resultado desagregado de noticias positivas y neutras, indicando los principales medios de comunicación.\nSe colocó una meta de 100%, mientras se levanta la línea base con la primera medición.",2019,"Octubre"]
["Mejorar continuamente los procesos del Sistema Integrado de Gestión","Gestión de Comunicaciones","Dar a conocer interna y externamente las actividades, programas y obras que realiza la entidad, para generar apropiación y participación que contribuyan al posicionamiento de la imagen institucional","Seguimiento a los cambios en las condiciones de publicación en redes sociales y página web",null,null,"Tasa de variación en el alcance total de las publicaciones en redes sociales","((Alcance total de publicaciones en el trimestre actual - Alcance total de publicaciones en el trimestre anterior)/Alcance total de publicaciones en el trimestre anterior)*100\n\nDonde:\n\nAlcance total de las publicaciones = Total de usuarios que vieron las publicaciones de redes sociales","Gestión","Eficacia","Trimestral",0.2,"Porcentaje","Métricas nativas de cada red social","Positiva","No","En el análisis del indicador se presentará el resultado desagregado del alcance de las publicaciones por cada red social. ",2019,"Octubre"]
["Mejorar continuamente los procesos del Sistema Integrado de Gestión","Gestión de Comunicaciones","Dar a conocer interna y externamente las actividades, programas y obras que realiza la entidad, para generar apropiación y participación que contribuyan al posicionamiento de la imagen institucional","Análisis de los resultados obtenidos mediante el monitoreo de medios para facilitar la toma de decisiones",null,null,"Salidas publicadas en medios de comunicación","N/A","Gestión","Eficacia","Mensual",80,"Número","Informes mensuales generados por la empresa contratada para realizar el monitoreo de medios","Positiva","No","En el análisis del indicador se presentará el valor estimado de las publicaciones en medios de comunicación.",2019,"Octubre",134,1,{"$f":"+T821/U821","v":134},{"$f":"+V821/L821","v":1.675},{"$f":"_xlfn.IFS(W821<=69%,\"Crítico\",W821>=90%,\"Aceptable\",W821>=70%,\"Tolerable\")","v":"Aceptable"}]
["Mejorar continuamente los procesos del Sistema Integrado de Gestión","Planeación de la Gestión","Establecer directrices para formular y realizar seguimiento a la planeación estratégica y operativa de la entidad con el propósito de contribuir al desarrollo de la misión y objetivos institucionales, así como facilitar la oportunidad y cumplimiento de los resultados esperados","Oportunidad, veracidad y calidad de la información de inversión y gestión",null,null,"Porcentaje de reportes de información presentados dentro de los tiempos programados","(No. de reportes de información elaborados y presentados/Total de reportes de información programados)*100","Gestión","Calidad","Trimestral",1,"Porcentaje","Cronograma de trabajo interno, plan operativo por dependencias (Oficina Asesora de Planeación), plan de adecuación y sostenibilidad SIGD-MIPG","Positiva","No","En el análisis del indicador se desagregará la programación para cada trimestre.",2019,"Noviembre"]
["Mejorar continuamente los procesos del Sistema Integrado de Gestión","Planeación de la Gestión","Establecer directrices para formular y realizar seguimiento a la planeación estratégica y operativa de la entidad con el propósito de contribuir al desarrollo de la misión y objetivos institucionales, así como facilitar la oportunidad y cumplimiento de los resultados esperados","Oportunidad en el seguimiento de las acciones institucionales para la mejora (correcciones, acciones correctivas, oportunidades de mejora, acciones para abordar riesgos)",null,null,"Porcentaje de acciones de mejora con seguimiento efectuado dentro del Sistema de Gestión","[No. de acciones de mejora con seguimiento efectuado dentro del tiempo programado/Total de acciones de mejora abiertas dentro del Sistema de Gestión de la Calidad (correcciones, acciones correctivas, oportunidades de mejora, acciones para abordar riesgos)]*100","Gestión","Eficacia","Mensual",1,"Porcentaje","Isolución","Positiva","No","En el análisis del indicador se presentará el resultado desagregado por cada tipología de mejora (corrección, acciones correctivas, oportunidades de mejora, acciones para abordar riesgos).",2019,"Noviembre",131,131,1,1,"Aceptable"]
["Mejorar continuamente los procesos del Sistema Integrado de Gestión","Gestión de Recursos Físicos","Administrar y controlar los bienes muebles y servicios para el funcionamiento administrativo de la entidad","Oportunidad en la atención de requerimientos y necesidades de servicios administrativos",null,null,"Porcentaje de mantenimientos realizados a la infraestructura física de la sede administrativa","(No. de mantenimientos realizados a la infraestructura física/Total de mantenimientos programados a la infraestructura física de la sede administrativa)*100","Gestión","Eficacia","Trimestral",0.9,"Porcentaje","Expendientes contractuales en plataforma ORFEO","Positiva","No",null,2019,"Noviembre"]
["Mejorar continuamente los procesos del Sistema Integrado de Gestión","Gestión de Asuntos Locales","Desarrollar acciones a nivel local para promover la participación ciudadana, brindar acompañamiento a las alcaldías locales en temas misionales de la entidad y ofertar sus programas","Oportunidad en la emisión del concepto previo y favorable según los tiempos establecidos en la normatividad vigente",null,null,"Porcentaje de conceptos previos tramitados dentro de los términos legales vigentes","(No. de conceptos previos tramitados dentro de los términos legales vigentes/Total de solicitudes de conceptos previos recibidas)*100","Gestión","Calidad","Trimestral",0.5,"Porcentaje","Matriz de seguimiento a conceptos previos tramitados","Positiva","No",null,2019,"Noviembre"]
["Mejorar continuamente los procesos del Sistema Integrado de Gestión","Control, Evaluación y Seguimiento","Evaluar los controles y la gestión de la entidad con el fin de identificar e implementar acciones de mejora, en pro de la sostenibilidad del Sistema de Control Interno","Pertinencia y oportunidad en la entrega de los resultados del seguimiento a las partes interesadas","Oportunidad y calidad en la información reportada a las entidades competentes del orden nacional y distrital",null,"Porcentaje de informes presentados por la tercera línea de defensa dentro de los tiempos programados","(No. de informes de ley y de gestión elaborados y presentados dentro de los tiempos programados/Total de informes de ley y de gestión a cargo de la tercera línea de defensa )*100  ","Gestión","Calidad","Trimestral",1,"Porcentaje","Plan anual de auditoría\nCronograma presentación de informes","Positiva","No","En el análisis del indicador se presentará el resultado desagregado por cada uno de los informes realizados.",2019,"Noviembre"]
["Mejorar continuamente los procesos del Sistema Integrado de Gestión","Control, Evaluación y Seguimiento","Evaluar los controles y la gestión de la entidad con el fin de identificar e implementar acciones de mejora, en pro de la sostenibilidad del Sistema de Control Interno","Cumplimiento de los objetivos definidos en el plan de auditoría conforme al plan de pruebas","Cobertura de las unidades a auditar de acuerdo con los parámetros establecidos en la matriz de priorización, en concordancia con los recursos disponibles para la ejecución del Plan Anual de Auditoría",null,"Índice de eficacia de auditorías internas de control interno","(Índice auditoría 1 + índice auditoría 2 +...+Índice auditoría n)/Total de auditorías realizadas\nDonde: \nÍndice auditoría n = Calificación porcentual de la variable Objetivos Específicos*Peso de la variable Objetivos Específicos + Calificación porcentual de la variable Actividad Plan de Auditoría*Peso de la variable Actividad Plan de Auditoría + Calificación porcentual de la variable Oportunidad*Peso de la variable Oportunidad\nPesos de las variables:\nObjetivos Específicos = 40%\nActividades Plan de Auditoría = 30%\nOportunidad = 30%. Esta se medirá tomando como fecha de referencia la de emisión del informe preliminar de auditoría.\nn = número de auditorías realizadas","Gestión","Eficacia","Trimestral",0.85,"Porcentaje","Planes de cada una de las auditorías","Positiva","No","En el análisis del indicador se presentará el resultado desagregado por cada una de las auditorías realizadas.",2019,"Noviembre"]
["Mejorar continuamente los procesos del Sistema Integrado de Gestión","Gestión Financiera","Administrar los recursos financieros asignados y realizar los respectivos registros, para el cumplimiento de las funciones de la entidad y pago de sus obligaciones con terceros","Oportunidad en el seguimiento de las partidas pendientes por conciliar",null,null,"Porcentaje de partidas conciliatorias identificadas dentro del tiempo establecido","(No. de partidas conciliatorias identificadas con edad inferior a 60 días/Total de partidas reportadas)*100","Gestión","Calidad","Mensual",0.9,"Porcentaje","Sistema de información SEVEN","Positiva","No",null,2019,"Noviembre",null,null,null,null,null,"No reportado por el proceso en Isolución para el mes "]
["Mejorar continuamente los procesos del Sistema Integrado de Gestión","Gestión Financiera","Administrar los recursos financieros asignados y realizar los respectivos registros, para el cumplimiento de las funciones de la entidad y pago de sus obligaciones con terceros","Oportunidad e integridad de la información necesaria para realizar las diferentes conciliaciones",null,null,"Porcentaje de obligaciones contingentes registradas correctamente en la contabilidad","(No. de procesos registrados correctamente en la contabilidad/Total de procesos reportados en SIPROJ Web)*100","Gestión","Calidad","Trimestral",1,"Porcentaje","Sistema de información SEVEN","Positiva","No",null,2019,"Noviembre"]
["Mejorar continuamente los procesos del Sistema Integrado de Gestión","Gestión Financiera","Administrar los recursos financieros asignados y realizar los respectivos registros, para el cumplimiento de las funciones de la entidad y pago de sus obligaciones con terceros","Oportunidad en la presentación de informes y estados financieros a los diferentes entes de vigilancia y control",null,null,"Porcentaje de notas a los estados financieros reveladas correctamente","(No. de notas sin observaciones por parte de los órganos de control internos y externos/Total de notas a los estados financieros elaboradas)*100","Gestión","Calidad","Anual",0.95,"Porcentaje","Informes de entes de control y vigilancia","Positiva","No",null,2019,"Noviembre"]
["Mejorar continuamente los procesos del Sistema Integrado de Gestión","Gestión Financiera","Administrar los recursos financieros asignados y realizar los respectivos registros, para el cumplimiento de las funciones de la entidad y pago de sus obligaciones con terceros","Oportunidad en la presentación de informes y estados financieros a los diferentes entes de vigilancia y control","Oportunidad en la presentación de las declaraciones tributarias",null,"Porcentaje de informes financieros presentados a los entes de vigilancia y control dentro de los términos legales vigentes","(No. de informes financieros presentados dentro de los términos legales vigentes/Total de informes financieros a reportar a los entes de vigilancia y control)*100","Gestión","Calidad","Mensual",1,"Porcentaje","Matriz de seguimiento a la presentación de informes ","Positiva","No",null,2019,"Noviembre",3,3,1,1,"Aceptable"]
["Satisfacer las necesidades de los usuarios a través de la prestación de servicios eficientes, eficaces y efectivos","Promoción de la Recreación","Desarrollar actividades recreativas en función de las características y necesidades de la población de Bogotá D.C., para promover el aprovechamiento del tiempo libre y el mejoramiento en la calidad de vida","Satisfacción del usuario con las actividades recreativas realizadas",null,null,"Satisfacción de los usuarios con los eventos y/o programas recreativos","(No. de usuarios satisfechos con los eventos y/o programas recreativos/Total de usuarios de eventos y/o programas recreativos encuestados)*100","Gestión","Efectividad","Anual",1,"Porcentaje","Encuesta de satisfacción sobre eventos y/o programas recreativos","Positiva","No","En el análisis del indicador se presentará el resultado desagregado por programa y por cada uno de los aspectos evaluados en la encuesta de satisfacción.\nSe colocó una meta de 100%, mientras se levanta la línea base con la primera medición.",2019,"Noviembre"]
["Mejorar continuamente los procesos del Sistema Integrado de Gestión","Promoción de la Recreación","Desarrollar actividades recreativas en función de las características y necesidades de la población de Bogotá D.C., para promover el aprovechamiento del tiempo libre y el mejoramiento en la calidad de vida","Cumplimiento del programa de actividades recreativas, teniendo en cuenta lo establecido en las fichas técnicas o según lo concertado con la comunidad e instituciones",null,null,"Porcentaje de actividades recreativas que cumplen con los requisitos para su ejecución","(No. de actividades recreativas que cumplen con los requisitos definidos para su ejecución/Total de actividades recreativas realizadas)*100","Gestión","Eficacia","Trimestral",0.97,"Porcentaje","Sistema de información misional - SIM","Positiva","No","En el análisis del indicador se presentará el resultado desagregado por programa y por actividad.",2019,"Noviembre"]
["Satisfacer las necesidades de los usuarios a través de la prestación de servicios eficientes, eficaces y efectivos","Fomento al Deporte","Desarrollar e implementar programas deportivos y de actividad física, para contribuir con el mejoramiento de la calidad de vida en la población de Bogotá D.C.","Satisfacción del usuario con las actividades deportivas  realizadas",null,null,"Satisfacción de los usuarios con las actividades realizadas en los programas deportivos","(No. de usuarios satisfechos con las actividades deportivas realizadas/Total de usuarios de actividades deportivas encuestados)*100","Gestión","Efectividad","Anual",1,"Porcentaje","Encuesta de satisfacción sobre actividades/programas deportivos","Positiva","No","En el análisis del indicador se presentará el resultado desagregado por programa y por cada uno de los aspectos evaluados en la encuesta de satisfacción.\nSe colocó una meta de 100%, mientras se levanta la línea base con la primera medición.",2019,"Noviembre"]
["Mejorar continuamente los procesos del Sistema Integrado de Gestión","Fomento al Deporte","Desarrollar e implementar programas deportivos y de actividad física, para contribuir con el mejoramiento de la calidad de vida en la población de Bogotá D.C.","Cambios comportamentales como resultados de los programas deportivos y de actividad física",null,null,"Cambio comportamental frente a la actividad física y el deporte","(No. de beneficiarios con percepción de cambio comportamental alrededor de las 4 dimensiones de la alfabetización física/Total de beneficiarios de programas deportivos y de actividad física seleccionados en la muestra)*100","Gestión","Efectividad","Anual",1,"Porcentaje","Encuesta para medir las 4 dimensiones de la alfabetización física","Positiva","No","La metodología se aplicará sobre una muestra por cada por cada programa. Se define en 4 tipos de mediciones:\n1. Medición dimensión competencia física. Aplicar test de resistencia, fuerza de torso, habilidades y flexibilidad.\n2. Medición dimensiones: competencia cognitiva, comportamental y motivacional a través de un cuestionario (on-line o presencial).\nSe colocó una meta de 100%, mientras se levanta la línea base con la primera medición.",2019,"Noviembre"]
["Satisfacer las necesidades de los usuarios a través de la prestación de servicios eficientes, eficaces y efectivos","Servicio a la Ciudadanía","Brindar información y atender los requerimientos de los grupos de valor y de interés de la entidad para responder a sus necesidades en cumplimiento de sus derechos","Oportunidad y calidad en la respuesta a los requerimientos de los grupos de valor e interés de la entidad","Satisfacción del ciudadano frente a las respuestas a sus requerimientos",null,"Satisfacción de peticionarios con la respuesta dada a sus requerimientos","(No. de peticionarios satisfechos con la respuesta dada a sus peticiones, quejas, reclamos y sugerencias/Total de peticionarios contactados)*100","Gestión","Efectividad","Mensual",0.8,"Porcentaje","Base de datos de gestión de PQRS","Positiva","No",null,2019,"Noviembre",27,32,{"$f":"+T836/U836","v":0.84375},1.0546875,"Aceptable"]
["Mejorar continuamente los procesos del Sistema Integrado de Gestión","Gestión de Recursos Físicos","Administrar y controlar los bienes muebles y servicios para el funcionamiento administrativo de la entidad","Oportunidad en la atención de requerimientos y necesidades de servicios administrativos",null,null,"Porcentaje de requerimientos de mantenimiento correctivo atendidos en la sede administrativa dentro de los tiempos establecidos","(No. de requerimientos de mantenimiento correctivo atendidos dentro de los tiempos establecidos/Total de requerimientos de mantenimiento correctivo reportados en la sede administrativa)*100","Gestión","Calidad","Trimestral",0.95,"Porcentaje","Aplicativo mesa de ayuda OTRS","Positiva","No",null,2019,"Noviembre"]
["Mejorar continuamente los procesos del Sistema Integrado de Gestión","Adquisición de Bienes y Servicios","Realizar actividades contractuales para adquirir bienes y servicios con la oportunidad y de acuerdo con las especificaciones establecidas por la entidad","Cumplimiento de requisitos de acuerdo con la modalidad de selección",null,null,"Porcentaje de procesos de selección publicados dentro del tiempo establecido","(No. de actos de apertura de procesos de selección publicados en un tiempo menor o igual a 30 días hábiles después de la radicación/Total de actos de apertura expedidos)*100","Gestión","Calidad","Trimestral",0.9,"Porcentaje","Plataforma ORFEO y SECOP","Positiva","No","En el análisis del indicador se presentará el resultado desagregado para licitación pública, concurso de méritos y selección abreviada.",2019,"Noviembre"]
["Mejorar continuamente los procesos del Sistema Integrado de Gestión","Adquisición de Bienes y Servicios","Realizar actividades contractuales para adquirir bienes y servicios con la oportunidad y de acuerdo con las especificaciones establecidas por la entidad","Oportunidad en la suscripción y legalización del contrato",null,null,"Porcentaje de contratos legalizados dentro del tiempo establecido","(No. de contratos legalizados en un tiempo menor o igual a 10 días hábiles a partir del acto administrativo de adjudicación/Total de procesos de selección adjudicados)*100","Gestión","Calidad","Mensual",0.8,"Porcentaje","SECOP y Plataforma ORFEO ","Positiva","No","En el análisis del indicador se presentará el resultado desagregado para licitación pública, concurso de méritos y selección abreviada.",2019,"Noviembre",0,1,{"$f":"+T839/U839","v":0},0,"Crítico","Se revisará el comportamiento de este indicador por presentar estado crítico en forma reiterativa."]
["Mejorar continuamente los procesos del Sistema Integrado de Gestión","Adquisición de Bienes y Servicios","Realizar actividades contractuales para adquirir bienes y servicios con la oportunidad y de acuerdo con las especificaciones establecidas por la entidad","Definición clara y precisa de requisitos técnicos, financieros, económicos, jurídicos y de riesgos de acuerdo con el bien o servicio a adquirir",null,null,"Porcentaje de procesos de obra tramitados en análisis de costos dentro del tiempo establecido","(No. de procesos de obra (todas las Subdirecciones) tramitados en oportunidad al recibo del memorando con la solicitud estudio del sector (20 días)/Total de procesos de obra recibidos)*100","Gestión","Calidad","Trimestral",1,"Porcentaje","Matriz de tráfico ACEE","Positiva","No",null,2019,"Noviembre"]
["Mejorar continuamente los procesos del Sistema Integrado de Gestión","Adquisición de Bienes y Servicios","Realizar actividades contractuales para adquirir bienes y servicios con la oportunidad y de acuerdo con las especificaciones establecidas por la entidad","Definición clara y precisa de requisitos técnicos, financieros, económicos, jurídicos y de riesgos de acuerdo con el bien o servicio a adquirir",null,null,"Porcentaje de procesos diferentes a obra tramitados en análisis de costos dentro del tiempo establecido","(No. de procesos diferentes a obra tramitados en oportunidad al recibo del memorando con la solicitud estudio del sector (10 días hábiles)/Total de procesos recibidos diferentes a obra)*100","Gestión","Calidad","Trimestral",0.9,"Porcentaje","Matriz de tráfico ACEE","Positiva","No","En el análisis del indicador se presentará el resultado desagregado para procesos diferentes a obra.",2019,"Noviembre"]
["Mejorar continuamente los procesos del Sistema Integrado de Gestión","Adquisición de Bienes y Servicios","Realizar actividades contractuales para adquirir bienes y servicios con la oportunidad y de acuerdo con las especificaciones establecidas por la entidad","Definición clara y precisa de requisitos técnicos, financieros, económicos, jurídicos y de riesgos de acuerdo con el bien o servicio a adquirir",null,null,"Porcentaje de procesos requeridos por precios artificialmente bajos","(No. de procesos (excepto Subastas SAS) requeridos por precios artificialmente bajos/Total de procesos evaluados)*100","Gestión","Calidad","Trimestral",0.15,"Porcentaje","Evaluación económica de los proponentes\n\nAnálisis de precios realizado por la ACEE","Negativa","No","En el análisis del indicador se presentará el resultado desagregado por tipo de proceso.",2019,"Noviembre"]
["Mejorar continuamente los procesos del Sistema Integrado de Gestión","Control, Evaluación y Seguimiento","Evaluar los controles y la gestión de la entidad con el fin de identificar e implementar acciones de mejora, en pro de la sostenibilidad del Sistema de Control Interno","Pertinencia y oportunidad en la entrega de los resultados del seguimiento a las partes interesadas",null,null,"Porcentaje de acciones de mejoramiento interno con seguimiento efectuado","(No. de acciones de mejoramiento interno con seguimiento efectuado)/Total de acciones de mejoramiento interno abiertas de auditorías internas de control interno)*100","Gestión","Eficacia","Trimestral",1,"Porcentaje","Plataforma Isolución","Positiva","No","En el análisis del indicador se presentará el resultado desagregado por proceso.",2019,"Noviembre"]
["Mejorar continuamente los procesos del Sistema Integrado de Gestión","Control, Evaluación y Seguimiento","Evaluar los controles y la gestión de la entidad con el fin de identificar e implementar acciones de mejora, en pro de la sostenibilidad del Sistema de Control Interno","Pertinencia y oportunidad en la entrega de los resultados del seguimiento a las partes interesadas",null,null,"Porcentaje de acciones de mejoramiento externo con seguimiento efectuado","(No. de acciones de mejoramiento externo con seguimiento efectuado)/Total de acciones de mejoramiento externo abiertas de auditorías externas)*100","Gestión","Eficacia","Trimestral",1,"Porcentaje","Matrices de consolidación del estado de las acciones de los diferentes entes de control y vigilancia","Positiva","No","En el análisis del indicador se presentará el resultado desagregado por auditoría externa.",2019,"Noviembre"]
["Mejorar continuamente los procesos del Sistema Integrado de Gestión","Gestión Financiera","Administrar los recursos financieros asignados y realizar los respectivos registros, para el cumplimiento de las funciones de la entidad y pago de sus obligaciones con terceros","Oportunidad en la expedición de los certificados presupuestales y en la presentación de los informes de ejecución",null,null,"Porcentaje de ejecución presupuestal en gastos de funcionamiento","(Presupuesto de funcionamiento ejecutado/Presupuesto disponible de funcionamiento)*100","Gestión","Eficiencia","Mensual",0.9,"Porcentaje","Ejecución presupuestal en SEVEN","Positiva","Si","La meta es anual con medición y análisis mensual.\nLa medición está a cargo del Área Financiera y el análisis a cargo de la Subdirección Administrativa y Financiera.\nLa medición y el análisis se deben realizar a más tardar el quinto día hábil de cada mes.\nUna vez se realice el Comité Financiero, el Área Financiera debe enviar a la Oficina Asesora de Planeación la presentación correspondiente, con el análisis respectivo en cuanto al desempeño del indicador.",2019,"Noviembre",27689917000,35208442000,0.78645675375240975,{"$f":"+V845/L845","v":0.87384083750267749}]
["Mejorar continuamente los procesos del Sistema Integrado de Gestión","Gestión Financiera","Administrar los recursos financieros asignados y realizar los respectivos registros, para el cumplimiento de las funciones de la entidad y pago de sus obligaciones con terceros","Oportunidad en la expedición de los certificados presupuestales y en la presentación de los informes de ejecución","Oportunidad en la autorización de giro de los recursos de transferencia",null,"Porcentaje de ejecución presupuestal en gastos de inversión","(Presupuesto de inversión ejecutado/Presupuesto disponible de inversión)*100","Gestión","Eficiencia","Mensual",0.95,"Porcentaje","Ejecución presupuestal en SEVEN","Positiva","Si","La meta es anual con medición y análisis mensual.\nLa medición está a cargo del Área Financiera y el análisis a cargo de los Ordenadores del Gasto.\nLa medición y el análisis se deben realizar a más tardar el quinto día hábil de cada mes.\nUna vez se realice el Comité Financiero, el Área Financiera debe enviar a la Oficina Asesora de Planeación la presentación correspondiente, con el análisis respectivo en cuanto al desempeño del indicador.",2019,"Noviembre",502578977000,745023641031,0.67458124725345192,0.71008552342468623]
["Mejorar continuamente los procesos del Sistema Integrado de Gestión","Gestión Financiera","Administrar los recursos financieros asignados y realizar los respectivos registros, para el cumplimiento de las funciones de la entidad y pago de sus obligaciones con terceros","Oportunidad en el pago de las obligaciones financieras de la entidad",null,null,"Porcentaje de ejecución del programa anual de caja","(Recursos ejecutados de reserva, vigencia y pasivos exigibles/Recursos programados de reserva, vigencia y pasivos exigibles)*100","Gestión","Eficiencia","Mensual",0.95,"Porcentaje","Sistema de información SEVEN","Positiva","Si","La meta es anual con medición y análisis mensual.\nLa medición está a cargo del Área Financiera y el análisis a cargo de los Ordenadores del Gasto.\nLa medición y el análisis se deben realizar a más tardar el quinto día hábil de cada mes.\nUna vez se realice el Comité Financiero, el Área Financiera debe enviar a la Oficina Asesora de Planeación la presentación correspondiente, con el análisis respectivo en cuanto al desempeño del indicador.",2019,"Noviembre",55266368,74353896,{"$f":"+T847/U847","v":0.7432881257493219},0.78240855342033888]
["Mejorar continuamente los procesos del Sistema Integrado de Gestión","Gestión Financiera","Administrar los recursos financieros asignados y realizar los respectivos registros, para el cumplimiento de las funciones de la entidad y pago de sus obligaciones con terceros","Oportunidad en el pago de las obligaciones financieras de la entidad","Oportunidad en la causación de ordenes de pago que cumplan con todos los requisitos establecidos","Oportunidad y veracidad de la información necesaria para la causación de las ordenes de pago reportada por los ordenadores del gasto","Porcentaje de cuentas individuales pagadas dentro del tiempo establecido","(No. de cuentas individuales pagadas en un tiempo menor o igual a 6 días/Total de cuentas de pago individuales tramitadas)*100 ","Gestión","Calidad","Mensual",1,"Porcentaje","Bitácora de cuentas en SEVEN","Positiva","No","La medición y el análisis están a cargo del Área Financiera.\nEn el análisis del indicador se presentará el resultado del tiempo promedio en cada una de las etapas para el pago, según la bitácora de cuentas de SEVEN.",2019,"Noviembre",313,316,{"$f":"+T848/U848","v":0.990506329113924},0.990506329113924,{"$f":"_xlfn.IFS(W848<=69%,\"Crítico\",W848>=90%,\"Aceptable\",W848>=70%,\"Tolerable\")","v":"Aceptable"}]
["Mejorar continuamente los procesos del Sistema Integrado de Gestión","Gestión Financiera","Administrar los recursos financieros asignados y realizar los respectivos registros, para el cumplimiento de las funciones de la entidad y pago de sus obligaciones con terceros","Oportunidad en el pago de las obligaciones financieras de la entidad","Oportunidad en la causación de ordenes de pago que cumplan con todos los requisitos establecidos","Oportunidad y veracidad de la información necesaria para la causación de las ordenes de pago reportada por los ordenadores del gasto","Porcentaje de cuentas colectivas pagadas dentro del tiempo establecido","(No. de cuentas colectivas pagadas en un tiempo menor o igual a 10 días/Total de cuentas de pago colectivas tramitadas)*100","Gestión","Calidad","Mensual",1,"Porcentaje","Bitácora de cuentas en SEVEN","Positiva","No","La medición y el análisis están a cargo del Área Financiera.\nEn el análisis del indicador se debe presentar el resultado del tiempo promedio en cada una de las etapas para el pago, según la bitácora de cuentas de SEVEN.",2019,"Noviembre",65,65,1,1,{"$f":"_xlfn.IFS(W849<=69%,\"Crítico\",W849>=90%,\"Aceptable\",W849>=70%,\"Tolerable\")","v":"Aceptable"}]
["Implementar las políticas y líneas de acción para la preservación e integridad de la documentación","Gestión Documental","Administrar, conservar y custodiar la documentación generada en la entidad, desde su origen hasta su disposición final, para preservar la memoria institucional","Actualización del inventario documental en el Formato Único de Inventario Documental, con base en la aplicación de las tablas de retención documental","Cumplimiento de los tiempos de retención documental establecidos en las tablas","Actualización de los instrumentos archivísticos","Porcentaje de inventario validado del fondo documental acumulado del archivo central","(No. de metros lineales de inventario validado en cuanto a series, subseries, asuntos y oficinas productoras/Total de metros lineales de archivo inventariado en estado natural del archivo central)*100 ","Gestión","Eficacia","Mensual",1,"Porcentaje","Matriz de seguimiento a inventario documental","Positiva","Si","La meta es anual con medición y análisis mensual",2019,"Noviembre"]
["Implementar las políticas y líneas de acción para la preservación e integridad de la documentación","Gestión Documental","Administrar, conservar y custodiar la documentación generada en la entidad, desde su origen hasta su disposición final, para preservar la memoria institucional","Oportunidad en las transferencias documentales de acuerdo con los tiempos de retención establecidos en las tablas",null,null,"Porcentaje de transferencias primarias realizadas de acuerdo con los tiempos de retención","(No. de transferencias primarias realizadas de acuerdo con los tiempos de retención establecidos en las TRD/Total de transferencias documentales programadas)*100","Gestión","Eficacia","Mensual",0.8,"Porcentaje","Matriz de seguimiento a transferencias documentales","Positiva","Si","La meta es anual con medición y análisis mensual",2019,"Noviembre",49,33,1.4848484848484849,1.856060606060606]
["Implementar las políticas y líneas de acción para la preservación e integridad de la documentación","Gestión Documental","Administrar, conservar y custodiar la documentación generada en la entidad, desde su origen hasta su disposición final, para preservar la memoria institucional","Cumplimiento de los estándares de temperatura, humedad relativa y luminosidad de los espacios de almacenamiento de material documental, dentro de los rangos establecidos en la normatividad vigente",null,null,"Porcentaje de espacios controlados para la conservación documental","(No. de espacios monitoreados e intervenidos/Total de espacios monitoreados)*100","Gestión","Eficacia","Mensual",1,"Porcentaje","Informe de monitoreo de espacios controlados","Positiva","No","La medición es mes vencido",2019,"Noviembre",8,8,1,1,{"$f":"_xlfn.IFS(W852<=69%,\"Crítico\",W852>=90%,\"Aceptable\",W852>=70%,\"Tolerable\")","v":"Aceptable"}]
["Mejorar continuamente los procesos del Sistema Integrado de Gestión","Servicio a la Ciudadanía","Brindar información y atender los requerimientos de los grupos de valor y de interés de la entidad para responder a sus necesidades en cumplimiento de sus derechos","Oportunidad y calidad en la respuesta a los requerimientos de los grupos de valor e interés de la entidad",null,null,"Porcentaje de peticiones, quejas, reclamos y sugerencias contestadas dentro de los términos legales vigentes","(No. de peticiones, quejas, reclamos y sugerencias contestadas en el aplicativo SDQS dentro de los términos legales vigentes/Total de peticiones, quejas, reclamos y sugerencias recibidas)*100","Gestión","Calidad","Mensual",1,"Porcentaje","Sistema SDQS","Positiva","No","La medición es mes vencido",2019,"Noviembre",214,243,0.88065843621399176,0.88065843621399176,"Tolerable"]
["Satisfacer las necesidades de los usuarios a través de la prestación de servicios eficientes, eficaces y efectivos","Servicio a la Ciudadanía","Brindar información y atender los requerimientos de los grupos de valor y de interés de la entidad para responder a sus necesidades en cumplimiento de sus derechos","Satisfacción del ciudadano frente a la atención brindada por la entidad",null,null,"Satisfacción del ciudadano con la atención recibida en los SUPERCADE","(No. de ciudadanos satisfechos con la atención recibida en los SUPERCADE/Total de ciudadanos atendidos en los SUPERCADE)*100","Gestión","Efectividad","Mensual",0.95,"Porcentaje","Encuesta de satisfacción con la atención brindada en SUPERCADES","Positiva","No",null,2019,"Noviembre",1280,1282,0.99843993759750393,1.0509894079973725,"Aceptable"]
["Mejorar continuamente los procesos del Sistema Integrado de Gestión","Servicio a la Ciudadanía","Brindar información y atender los requerimientos de los grupos de valor y de interés de la entidad para responder a sus necesidades en cumplimiento de sus derechos","Oportunidad en la actualización de la información publicada en la sección de ley de transparencia en la página web de la entidad",null,null,"Porcentaje de información actualizada en ley de transparencia","(No. de subcategorías con información actualizada en la página web/Total de subcategorías definidas en ley de transparencia)*100","Gestión","Eficacia","Trimestral",1,"Porcentaje","Página web","Positiva","No",null,2019,"Noviembre"]
["Mejorar continuamente los procesos del Sistema Integrado de Gestión","Servicio a la Ciudadanía","Brindar información y atender los requerimientos de los grupos de valor y de interés de la entidad para responder a sus necesidades en cumplimiento de sus derechos","Coherencia, claridad, solución de fondo, calidez y manejo del sistema en relación con los requerimientos atendidos por la entidad",null,null,"Porcentaje de requerimientos atendidos con oportunidad y calidad","(No. de respuestas a requerimientos sin observaciones en cuanto a los criterios de oportunidad y calidad/Total de requerimientos evaluados en el aplicativo SDQS)*100","Gestión","Eficacia","Mensual",0.8,"Porcentaje","SDQS y base de datos de gestión de PQRS","Positiva","No","La medición es mes vencido",2019,"Noviembre",138,172,0.80232558139534882,1.0029069767441861,"Aceptable"]
["Implementar buenas prácticas ambientales para la prevención de la contaminación en el marco de una Bogotá que defiende lo público en su función administrativa y de desarrollo institucional","Gestión de Recursos Físicos","Administrar y controlar los bienes muebles y servicios para el funcionamiento administrativo de la entidad","Calificación de la implementación del Plan Institucional de Gestión Ambiental, por parte de la Secretaría Distrital de Ambiente","Oportunidad en el reporte de formularios y registros electrónicos del PIGA ante la Secretaría Distrital de Ambiente",null,"Índice de implementación del PIGA","Promedio ponderado de cumplimiento de aspectos normativos y de implementación del PIGA, según auditoría realizada por la Secretaría Distrital de Ambiente en cada vigencia","Gestión","Eficacia","Anual",0.7,"Porcentaje","Informe de auditoría anual realizada por la Secretaría Distrital de Ambiente","Positiva","No","En el análisis del indicador se presentará el resultado desagregado por cada uno de los aspectos evaluados en la visita de control y seguimiento por parte de la Secretaría Distrital de Ambiente.\nLa meta está configurada como mayor a 70%.",2019,"Noviembre"]
["Proteger la integridad, confidencialidad y disponibilidad de la información","Gestión de Tecnología de la Información y las Comunicaciones","Proporcionar soluciones estratégicas de tecnologías de la información y las comunicaciones, para contribuir con la eficiencia administrativa, la mejora de los trámites y servicios y la protección de los activos de información de la entidad","Impacto del plan de remediación frente a las vulnerabilidades identificadas","Aseguramiento de incidencias en la seguridad de la información que afecten la confidencialidad, integridad y disponibilidad",null,"Porcentaje de remediación de vulnerabilidades de seguridad de la información","(No. de vulnerabilidades críticas o altas remediadas/Total de vulnerabilidades de seguridad de la información detectadas como críticas o altas)*100 ","Gestión","Eficacia","Anual",0.7,"Porcentaje","Matriz de vulnerabilidades","Positiva","No","La meta está configurada como mínimo 70%.",2019,"Noviembre"]
["Proteger la integridad, confidencialidad y disponibilidad de la información","Gestión de Tecnología de la Información y las Comunicaciones","Proporcionar soluciones estratégicas de tecnologías de la información y las comunicaciones, para contribuir con la eficiencia administrativa, la mejora de los trámites y servicios y la protección de los activos de información de la entidad","Avances en la implementación de gobierno digital de acuerdo con los componentes evaluados por MINTIC",null,null,"Índice de implementación de gobierno digital","Sumatoria de la calificación obtenida por cada componente/Total de componentes de la política de gobierno digital","Gestión","Eficacia","Anual",0.65,"Porcentaje","Instrumento de medición suministrado para el seguimiento a la política de gobierno digital  ","Positiva","No","En el análisis del indicador se presentará el resultado desagregado de las calificaciones obtenidas en cada componente de la política de seguridad digital.",2019,"Noviembre"]
["Mejorar continuamente los procesos del Sistema Integrado de Gestión","Gestión de Tecnología de la Información y las Comunicaciones","Proporcionar soluciones estratégicas de tecnologías de la información y las comunicaciones, para contribuir con la eficiencia administrativa, la mejora de los trámites y servicios y la protección de los activos de información de la entidad","Cumplimiento del Plan Estratégico de Tecnologías de la Información PETI",null,null,"Porcentaje de avance en proyectos de TI","(No. de hitos en proyectos de TI alcanzados/Total de hitos en proyectos de TI programados en la vigencia)*100","Gestión","Eficacia","Semestral",1,"Porcentaje","Cronograma de proyectos del PETI","Positiva","Si","La meta es anual con medición y análisis semestral.",2019,"Noviembre"]
["Proteger la integridad, confidencialidad y disponibilidad de la información","Gestión de Tecnología de la Información y las Comunicaciones","Proporcionar soluciones estratégicas de tecnologías de la información y las comunicaciones, para contribuir con la eficiencia administrativa, la mejora de los trámites y servicios y la protección de los activos de información de la entidad","Disponibilidad de los sistemas de información de la entidad",null,null,"Porcentaje de disponibilidad de los sistemas de información","(No. de horas disponibles de los sistemas de información/Total de horas en servicio de los sistemas de información)*100","Gestión","Eficiencia","Mensual",0.9,"Porcentaje","Herramienta de monitoreo ZABBIX","Positiva","No","En el análisis del indidicador se presentará el resultado desagregado de disponibilidad en ORFEO, SEVEN, KACTUS y SIM.\nLa meta está configurada como mayor o igual a 90%.",2019,"Noviembre",719.63,720,0.99948611111111108,1.11054012345679,{"$f":"_xlfn.IFS(W861<=69%,\"Crítico\",W861>=90%,\"Aceptable\",W861>=70%,\"Tolerable\")","v":"Aceptable"}]
["Mejorar continuamente los procesos del Sistema Integrado de Gestión","Gestión de Tecnología de la Información y las Comunicaciones","Proporcionar soluciones estratégicas de tecnologías de la información y las comunicaciones, para contribuir con la eficiencia administrativa, la mejora de los trámites y servicios y la protección de los activos de información de la entidad","Disponibilidad de los servicios de comunicaciones en la entidad, según los acuerdos de niveles de servicios establecidos",null,null,"Porcentaje de disponibilidad de los servicios de comunicaciones","(No. de horas disponibles de los servicios de comunicaciones /Total de horas de los servicios de comunicaciones)*100","Gestión","Eficiencia","Mensual",0.9,"Porcentaje","Herramienta de monitoreo ZABBIX","Positiva","No","En el análisis del indidicador se presentará el resultado desagregado de disponibilidad en Internet y Telefonía IP.\nLa meta está configurada como mayor o igual a 90%.",2019,"Noviembre",719.63,720,0.99948611111111108,1.11054012345679,"Aceptable"]
["Mejorar continuamente los procesos del Sistema Integrado de Gestión","Gestión de Tecnología de la Información y las Comunicaciones","Proporcionar soluciones estratégicas de tecnologías de la información y las comunicaciones, para contribuir con la eficiencia administrativa, la mejora de los trámites y servicios y la protección de los activos de información de la entidad","Incidencias reportadas en el funcionamiento del módulo o sistema de información implementado","Cumplimiento de los acuerdos de niveles de servicios establecidos",null,"Porcentaje de solicitudes de servicio tecnológico atendidas dentro de los tiempos establecidos","(No. de solicitudes atendidas dentro de los tiempos establecidos en los acuerdos de nivel de servicio/Total de solicitudes de servicio tecnológico recibidas)*100","Gestión","Calidad","Mensual",0.9,"Porcentaje","Herramienta GLPI","Positiva","No",null,2019,"Noviembre",611,616,0.99188311688311692,1.102092352092352,"Aceptable"]
["Mejorar continuamente los procesos del Sistema Integrado de Gestión","Gestión de Talento Humano","Gestionar el potencial del talento humano como factor estratégico, para contribuir con el desarrollo de la entidad en un ambiente seguro y saludable","Cumplimiento de compromisos y competencias del servidor público en el desempeño laboral","Oportunidad en el seguimiento y la evaluación anual u ordinaria del servidor público para continuar su permanencia en el servicio",null,"Índice de desempeño laboral de funcionarios","(Sumatoria de calificaciones finales de la evaluación de desempeño de los funcionarios/Total de funcionarios evaluados)*100","Gestión","Eficacia","Anual",0.9,"Porcentaje","Consolidado de las calificaciones finales de la evaluación de desempeño","Positiva","No","En el análisis del indicador se presentará el resultado desagregado por niveles jerárquicos y comparar con la evaluación de las áreas.\nLa meta está configurada como mayor a 90%.\nNota: Se mide para vigencia 2018-2019.",2019,"Noviembre"]
["Mejorar continuamente los procesos del Sistema Integrado de Gestión","Gestión de Talento Humano","Gestionar el potencial del talento humano como factor estratégico, para contribuir con el desarrollo de la entidad en un ambiente seguro y saludable","Cobertura de servidores públicos en las actividades del plan de bienestar e incentivos",null,null,"Porcentaje de funcionarios que participan en las actividades del plan de bienestar e incentivos","(No. de funcionarios participantes en las actividades del plan de bienestar e incentivos/Total de funcionarios de la entidad)*100 ","Gestión","Eficacia","Semestral",0.8,"Porcentaje","Registros de asistencia a las actividades del plan de bienestar","Positiva","No",null,2019,"Noviembre"]
["Mejorar continuamente los procesos del Sistema Integrado de Gestión","Gestión de Talento Humano","Gestionar el potencial del talento humano como factor estratégico, para contribuir con el desarrollo de la entidad en un ambiente seguro y saludable","Cobertura de servidores públicos en las actividades del plan institucional de capacitación",null,null,"Porcentaje de funcionarios que asisten a las actividades del plan institucional de capacitación","(No. de funcionarios asistentes a las actividades del plan institucional de capacitación/Total de funcionarios citados a las actividades del plan institucional de capacitación)*100","Gestión","Eficacia","Semestral",0.8,"Porcentaje","Registros de asistencia a las actividades del plan de capacitación","Positiva","No","Las capacitaciones que se incluyen en el indicador son las que implican recursos.",2019,"Noviembre"]
["Mejorar continuamente los procesos del Sistema Integrado de Gestión","Gestión de Talento Humano","Gestionar el potencial del talento humano como factor estratégico, para contribuir con el desarrollo de la entidad en un ambiente seguro y saludable","Evaluación del impacto de la capacitación en el desempeño de los servidores públicos y de la entidad",null,null,"Impacto de la capacitación en el desempeño laboral de funcionarios","(No. de funcionarios con capacitaciones efectivas/Total de funcionarios evaluados)*100","Gestión","Eficacia","Trimestral",0.95,"Porcentaje","Consolidado de las evaluaciones de impacto de la capacitación","Positiva","No",null,2019,"Noviembre"]
["Mejorar continuamente los procesos del Sistema Integrado de Gestión","Gestión de Talento Humano","Gestionar el potencial del talento humano como factor estratégico, para contribuir con el desarrollo de la entidad en un ambiente seguro y saludable","Satisfacción de los servidores públicos frente a las actividades de  bienestar e incentivos","Satisfacción de los servidores públicos frente a las actividades de capacitación",null,"Índice de clima organizacional","Promedio ponderado de las dimensiones evaluadas en la encuesta de medición de clima organizacional","Gestión","Eficacia","Anual",0.8,"Porcentaje","Informe de medición de clima organizacional","Positiva","No","En el análisis del indicador se presentará el resultado desagregado por áreas y/o dependencias, y por las dimensiones evaluadas.",2019,"Noviembre"]
["Mejorar continuamente los procesos del Sistema Integrado de Gestión","Gestión de Talento Humano","Gestionar el potencial del talento humano como factor estratégico, para contribuir con el desarrollo de la entidad en un ambiente seguro y saludable","Cumplimiento del plan anual de  bienestar e incentivos",null,null,"Porcentaje de ejecución del plan anual de bienestar e incentivos","(No. de actividades de bienestar e incentivos desarrolladas/Total de actividades programadas en el plan anual de bienestar e incentivos)*100","Gestión","Eficacia","Semestral",1,"Porcentaje","Matriz de seguimiento a la ejecución de actividades de bienestar e incentivos","Positiva","Si","La meta es anual con medición y análisis semestral.",2019,"Noviembre"]
["Mejorar continuamente los procesos del Sistema Integrado de Gestión","Gestión de Talento Humano","Gestionar el potencial del talento humano como factor estratégico, para contribuir con el desarrollo de la entidad en un ambiente seguro y saludable","Cumplimiento del plan institucional de capacitación",null,null,"Porcentaje de ejecución del plan institucional de capacitación","(No. de actividades de capacitación desarrolladas/Total de actividades programadas en el plan institucional de capacitación)*100","Gestión","Eficacia","Semestral",1,"Porcentaje","Matriz de seguimiento a la ejecución de actividades de capacitación","Positiva","Si","La meta es anual con medición y análisis semestral.",2019,"Noviembre"]
["Prevenir los factores que afecten la salud y seguridad a fin de mejorar las condiciones del ambiente de trabajo","Gestión de Talento Humano","Gestionar el potencial del talento humano como factor estratégico, para contribuir con el desarrollo de la entidad en un ambiente seguro y saludable","Cumplimiento del plan anual de trabajo",null,null,"Porcentaje de ejecución del plan anual de seguridad y salud en el trabajo","(No. de actividades de seguridad y salud desarrolladas/Total de actividades programadas en el plan anual de seguridad y salud en el trabajo)*100","Gestión","Eficacia","Mensual",0.95,"Porcentaje","Plan de trabajo anual del Sistema de Gestión de Seguridad y Salud en el Trabajo","Positiva","No",null,2019,"Noviembre",292,318,0.91823899371069184,0.96656736180072833,{"$f":"_xlfn.IFS(W871<=69%,\"Crítico\",W871>=90%,\"Aceptable\",W871>=70%,\"Tolerable\")","v":"Aceptable"}]
["Prevenir los factores que afecten la salud y seguridad a fin de mejorar las condiciones del ambiente de trabajo","Gestión de Talento Humano","Gestionar el potencial del talento humano como factor estratégico, para contribuir con el desarrollo de la entidad en un ambiente seguro y saludable","Tasa de accidentalidad",null,null,"Tasa de accidentalidad","(No. de accidentes de trabajo reportados/Total de trabajadores (funcionarios y contratistas)*100","Gestión","Efectividad","Mensual",0.04,"Porcentaje","Matriz de accidentes de trabajo","Negativa","No","La meta está configurada como menor o igual a 4%.",2019,"Noviembre",106,3090,3.4304207119741102E-2,{"$f":"((L872-V872)+L872)/L872","v":1.1423948220064724},"Aceptable"]
["Prevenir los factores que afecten la salud y seguridad a fin de mejorar las condiciones del ambiente de trabajo","Gestión de Talento Humano","Gestionar el potencial del talento humano como factor estratégico, para contribuir con el desarrollo de la entidad en un ambiente seguro y saludable","Incidencia y prevalencia de enfermedades laborales",null,null," Prevalencia de la enfermedad laboral","(No. de casos de enfermedad laboral calificada/Total de funcionarios)*100","Gestión","Efectividad","Trimestral",0.02,"Porcentaje","Matriz de seguimiento de enfermedades laborales","Negativa","No","La meta está configurada como menor o igual a 2%.",2019,"Noviembre"]
["Prevenir los factores que afecten la salud y seguridad a fin de mejorar las condiciones del ambiente de trabajo","Gestión de Talento Humano","Gestionar el potencial del talento humano como factor estratégico, para contribuir con el desarrollo de la entidad en un ambiente seguro y saludable","Incidencia y prevalencia de enfermedades laborales",null,null,"Incidencia de la enfermedad laboral","(No. de casos nuevos de enfermedad laboral calificados/Total de funcionarios)*100","Gestión","Efectividad","Trimestral",0.01,"Porcentaje","Matriz de seguimiento de enfermedades laborales","Negativa","No","La meta está configurada como menor o igual a 1%.",2019,"Noviembre"]
["Mejorar continuamente los procesos del Sistema Integrado de Gestión","Gestión de Recursos Físicos","Administrar y controlar los bienes muebles y servicios para el funcionamiento administrativo de la entidad","Confiabilidad del inventario de bienes devolutivos",null,null,"Porcentaje de inventario individual validado físicamente","(No. de elementos devolutivos del inventario individual validados físicamente/Total de elementos devolutivos del inventario individual registrados en el sistema de información SEVEN)*100 ","Gestión","Eficacia","Anual",1,"Porcentaje","Sistema de información SEVEN","Positiva","No",null,2019,"Noviembre"]
["Mejorar continuamente los procesos del Sistema Integrado de Gestión","Gestión de Recursos Físicos","Administrar y controlar los bienes muebles y servicios para el funcionamiento administrativo de la entidad","Confiabilidad del inventario de bienes devolutivos",null,null,"Porcentaje de inventario aleatorio validado físicamente en bodega","(No. de elementos devolutivos y de consumo en bodegas validados físicamente/Muestra de inventario de elementos devolutivos y de consumo registrados en el sistema de información SEVEN)*100 ","Gestión","Eficacia","Trimestral",1,"Porcentaje","Sistema de información SEVEN","Positiva","No",null,2019,"Noviembre"]
["Mejorar continuamente los procesos del Sistema Integrado de Gestión","Gestión de Asuntos Locales","Desarrollar acciones a nivel local para promover la participación ciudadana, brindar acompañamiento a las alcaldías locales en temas misionales de la entidad y ofertar sus programas","Cumplimiento de los compromisos adquiridos por la entidad, en el marco de las instancias de participación locales",null,null,"Porcentaje de compromisos atendidos en el marco de las instancias de participación locales","(No. de compromisos atendidos en las instancias Consejo Local de Gobierno, Unidad de Apoyo Técnico y Comisión Local Intersectorial de Participación /Total de compromisos generados en las instancias Consejo Local de Gobierno, Unidad de Apoyo Técnico y Comisión Local Intersectorial de Participación)*100","Gestión","Eficacia","Trimestral",1,"Porcentaje","Matriz de seguimiento a compromisos derivados de instancias de participación locales","Positiva","No",null,2019,"Noviembre"]
["Mejorar continuamente los procesos del Sistema Integrado de Gestión","Gestión de Asuntos Locales","Desarrollar acciones a nivel local para promover la participación ciudadana, brindar acompañamiento a las alcaldías locales en temas misionales de la entidad y ofertar sus programas","Efectividad en la atención de la demanda de actividades recreodeportivas en las localidades de Bogotá",null,null,"Porcentaje de actividades recreativas programadas por asuntos locales","(No. de actividades recreativas programadas en la plataforma SIM por los gestores locales/Total de actividades recreativas solicitadas por Promoción de la Recreación)*100","Gestión","Eficacia","Mensual",1,"Porcentaje","Sistema de información misional - SIM\nCuadro de metas de actividades recreativas","Positiva","No",null,2019,"Noviembre",2986,2152,1.3875464684014871,{"$f":"+V878/L878","v":1.3875464684014871},"Aceptable"]
["Mejorar continuamente los procesos del Sistema Integrado de Gestión","Gestión de Asuntos Locales","Desarrollar acciones a nivel local para promover la participación ciudadana, brindar acompañamiento a las alcaldías locales en temas misionales de la entidad y ofertar sus programas","Efectividad en la atención de la demanda de actividades recreodeportivas en las localidades de Bogotá",null,null,"Porcentaje de beneficiarios inscritos por asuntos locales en actividades deportivas","(No. de beneficiarios inscritos en actividades deportivas por los gestores locales/Total de beneficiarios de actividades deportivas programados por Fomento al Deporte)*100","Gestión","Eficacia","Trimestral",1,"Porcentaje","Reporte de las distintas plataformas para inscripciones\nCuadro de metas de actividades deportivas","Positiva","No",null,2019,"Noviembre"]
["Mejorar continuamente los procesos del Sistema Integrado de Gestión","Gestión de Asuntos Locales","Desarrollar acciones a nivel local para promover la participación ciudadana, brindar acompañamiento a las alcaldías locales en temas misionales de la entidad y ofertar sus programas","Cumplimiento de lineamientos y criterios de elegibilidad y viabilidad de los proyectos de contratación",null,null,"Porcentaje de asistencias técnicas realizadas a los Fondos de Desarrollo Local","(No. de asistencias técnicas realizadas a los Fondos de Desarrollo Local/Total de asistencias técnicas programadas a los Fondos de Desarrollo Local en las cuatro líneas de inversión)*100","Gestión","Eficacia","Trimestral",1,"Porcentaje","Cronograma de asistencias técnicas a los Fondos de Desarrollo Local","Positiva","No",null,2019,"Noviembre"]
["Mejorar continuamente los procesos del Sistema Integrado de Gestión","Gestión de Asuntos Locales","Desarrollar acciones a nivel local para promover la participación ciudadana, brindar acompañamiento a las alcaldías locales en temas misionales de la entidad y ofertar sus programas","Ejecución de los proyectos con recursos de los fondos de desarrollo local, en concordancia con el concepto previo y favorable emitido por la entidad",null,null,"Porcentaje de proyectos viabilizados con seguimiento efectuado","(No. de proyectos contratados con seguimiento efectuado/Total de proyectos viabilizados con contratación por parte de los Fondos de Desarrollo Local)*100","Gestión","Eficacia","Trimestral",1,"Porcentaje","SECOP\nInforme de seguimiento a viabilidades","Positiva","No",null,2019,"Noviembre"]
["Mejorar continuamente los procesos del Sistema Integrado de Gestión","Control Disciplinario","Investigar conductas presuntamente disciplinables e imponer sanciones cuando haya lugar, tanto a servidores como a ex-servidores públicos de la entidad, con el fin de que éstos cumplan con sus deberes y funciones","Cumplimiento de los términos legales en las distintas etapas procesales",null,null,"Porcentaje de procesos disciplinarios resueltos de fondo","(No. de procesos disciplinarios decididos de fondo/Total de procesos disciplinarios activos)*100","Gestión","Eficacia","Semestral",0.6,"Porcentaje","Matriz de autos","Positiva","No",null,2019,"Noviembre"]
["Mejorar continuamente los procesos del Sistema Integrado de Gestión","Control Disciplinario","Investigar conductas presuntamente disciplinables e imponer sanciones cuando haya lugar, tanto a servidores como a ex-servidores públicos de la entidad, con el fin de que éstos cumplan con sus deberes y funciones","Garantía del debido proceso en las distintas etapas procesales",null,null,"Porcentaje de procesos disciplinarios sin nulidades decretadas","(No. de procesos disciplinarios sin nulidades decretadas/Total de procesos disciplinarios activos)*100 ","Gestión","Eficacia","Trimestral",1,"Porcentaje","Matriz de autos","Positiva","No",null,2019,"Noviembre"]
["Mejorar continuamente los procesos del Sistema Integrado de Gestión","Control Disciplinario","Investigar conductas presuntamente disciplinables e imponer sanciones cuando haya lugar, tanto a servidores como a ex-servidores públicos de la entidad, con el fin de que éstos cumplan con sus deberes y funciones","Cumplimiento de los términos legales en las distintas etapas procesales",null,null,"Porcentaje de procesos disciplinarios sin vencimiento de términos","(No. de procesos disciplinarios sin vencimiento de términos/Total de procesos disciplinarios activos)*100","Gestión","Calidad","Trimestral",1,"Porcentaje","Expediente del proceso disciplinario ","Positiva","No",null,2019,"Noviembre"]
["Mejorar continuamente los procesos del Sistema Integrado de Gestión","Administración y Mantenimiento de Parques y Escenarios","Ofrecer parques y escenarios del Sistema Distrital para el uso y disfrute de la comunidad general, gestionando la sostenibilidad física, social, ambiental y económica","Uso de parques y escenarios con motivación económica que generen recursos para el mantenimiento de los mismos",null,null,"Aprovechamiento económico de parques y/o escenarios","(Ingresos del mes + acumulado de los ingresos del mes anterior/Total presupuesto anual)*100","Gestión","Eficiencia","Mensual",1,"Porcentaje","Sistema de información SEVEN","Positiva","Si","La meta es anual con medición y análisis mensual.\n\nEn el análisis del indicador se presentará la desagregación del aprovechamiento económico por tipo de parque y/o escenario, expresado en ingresos y participación porcentual.",2019,"Noviembre",22315450,22044017,{"$f":"+T885/U885","v":1.0123132276662643},1.0123132276662643]
["Satisfacer las necesidades de los usuarios a través de la prestación de servicios eficientes, eficaces y efectivos","Administración y Mantenimiento de Parques y Escenarios","Ofrecer parques y escenarios del Sistema Distrital para el uso y disfrute de la comunidad general, gestionando la sostenibilidad física, social, ambiental y económica","Satisfacción de los usuarios con las actividades de mantenimiento preventivo y correctivo",null,null,"Satisfacción de los usuarios con las obras de mantenimiento de nuevas tendencias","(No. de usuarios satisfechos con las obras de mantenimiento realizadas/Total de usuarios de parques y escenarios encuestados para obras de mantenimiento de nuevas tendencias)*100","Gestión","Efectividad","Anual",0.9,"Porcentaje","Encuesta de satisfacción con las obras de mantenimiento de nuevas tendencias","Positiva","No","En el análisis del indicador se presentará el resultado desagregado por cada uno de los aspectos evaluados en la encuesta de satisfacción.",2019,"Noviembre"]
["Mejorar continuamente los procesos del Sistema Integrado de Gestión","Administración y Mantenimiento de Parques y Escenarios","Ofrecer parques y escenarios del Sistema Distrital para el uso y disfrute de la comunidad general, gestionando la sostenibilidad física, social, ambiental y económica","Oportunidad y cumplimiento en la generación de compromisos o acuerdos ciudadanos frente al uso y sostenibilidad de los parques administrados",null,null,"Porcentaje de cumplimiento en acuerdos de sostenibilidad social de parques","(No. de compromisos gestionados/Total de compromisos adquiridos mediante acuerdos ciudadanos en parques)*100","Gestión","Eficacia","Trimestral",1,"Porcentaje","Matriz de seguimiento a compromisos o acuerdos ciudadanos","Positiva","No",null,2019,"Noviembre"]
["Mejorar continuamente los procesos del Sistema Integrado de Gestión","Administración y Mantenimiento de Parques y Escenarios","Ofrecer parques y escenarios del Sistema Distrital para el uso y disfrute de la comunidad general, gestionando la sostenibilidad física, social, ambiental y económica","Disponibilidad de los equipamientos en parques y escenarios","Cumplimiento de las especificaciones técnicas en las actividades de mantenimiento preventivo y correctivo","Cobertura en el mantenimiento de parques y escenarios de acuerdo con la priorización","Porcentaje de avance en la ejecución de contratos de obras de mantenimiento o recuperación","(Porcentaje contrato 1 + Porcentaje contrato 2 +...+ Porcentaje contrato n)/Total de contratos de obras de mantenimiento o recuperación en ejecución\nDonde: \nPorcentaje contrato n = Avance físico ejecutado/Avance físico programado\nn = Número de contratos de obras de mantenimiento o recuperación en ejecución","Gestión","Eficacia","Bimestral",0.9,"Porcentaje","Informes mensuales de interventoría presentados según programación de los contratistas","Positiva","No",null,2019,"Noviembre"]
["Satisfacer las necesidades de los usuarios a través de la prestación de servicios eficientes, eficaces y efectivos","Diseño y Construcción de Parques y Escenarios","Ampliar y mejorar la infraestructura física recreativa y deportiva del Distrito Capital para el uso de la comunidad en general","Cumplimiento de requisitos técnicos, administrativos, financieros y jurídicos de los proyectos",null,null,"Satisfacción de los usuarios con las obras de construcción y/o adecuación entregadas","(No. de usuarios satisfechos con las obras de construcción y/o adecuación entregadas /Total de usuarios encuestados por proyecto)*100","Gestión","Efectividad","Anual",0.9,"Porcentaje","Resultados de la encuesta de satisfacción entregados por los contratistas de obra","Positiva","No","En el análisis del indicador se presentará el resultado desagregado por cada uno de los aspectos evaluados en la encuesta de satisfacción.",2019,"Noviembre"]
["Mejorar continuamente los procesos del Sistema Integrado de Gestión","Diseño y Construcción de Parques y Escenarios","Ampliar y mejorar la infraestructura física recreativa y deportiva del Distrito Capital para el uso de la comunidad en general","Oportunidad en el seguimiento y adopción de medidas durante el seguimiento de la estabilidad de la obra","Cumplimiento de especificaciones técnicas conforme a lo establecido en la etapa de construcción",null,"Porcentaje de fallas de calidad o estabilidad de obra atendidas en construcción y adecuación de parques y escenarios","(No. de fallas de calidad o estabilidad de obra atendidas/Total de fallas de calidad o estabilidad de obra detectadas o reportadas por terceros)*100\n\nAtendido = Se genera requerimiento al contratista para establecer compromisos de reparación.","Gestión","Eficacia","Trimestral",0.9,"Porcentaje","Actas de visita o reconocimiento de estabilidad de obra \nActa de compromiso de reparación constructiva\nProgramación de visita\nComunicación oficial- notificación de fallas visita de inspección por estabilidad \nActa de verificación de reparación constructiva","Positiva","No","En el análisis del indicador se presentará la desagregación por parque y escenario.",2019,"Noviembre"]
["Mejorar continuamente los procesos del Sistema Integrado de Gestión","Diseño y Construcción de Parques y Escenarios","Ampliar y mejorar la infraestructura física recreativa y deportiva del Distrito Capital para el uso de la comunidad en general","Cumplimiento de requisitos técnicos, administrativos, financieros y jurídicos de los proyectos","Oportunidad en el seguimiento y adopción de medidas durante la ejecución de las obras","Cumplimiento del alcance de las obras conforme a los estudios y diseños, especificaciones técnicas y normatividad vigente","Porcentaje de avance en la ejecución de obras de construcción y adecuación de parques y escenarios","((%Ejecutado Obra 1*Plazo de ejecución Obra 1)+(%Ejecutado Obra 2*Plazo de ejecución Obra 2) +...+ (%Ejecutado Obra n*Plazo de ejecución Obra n))/((%Programado Obra 1*Plazo de ejecución Obra 1)+(%Programado Obra 2*Plazo de ejecución Obra 2) +...+ (%Programado Obra n*Plazo de ejecución Obra n))\nDonde:\nn = Número de obras en ejecución","Gestión","Eficacia","Mensual",0.9,"Porcentaje","Informes mensuales de interventoría\n\nInformes mensuales de supervisión","Positiva","No","En el análisis del indicador se presentará la desagregación por parque y escenario.",2019,"Noviembre",74.23,78.319999999999993,0.94777834525025551,1.0530870502780616,{"$f":"_xlfn.IFS(W891<=69%,\"Crítico\",W891>=90%,\"Aceptable\",W891>=70%,\"Tolerable\")","v":"Aceptable"}]
["Mejorar continuamente los procesos del Sistema Integrado de Gestión","Diseño y Construcción de Parques y Escenarios","Ampliar y mejorar la infraestructura física recreativa y deportiva del Distrito Capital para el uso de la comunidad en general","\nCumplimiento de requisitos técnicos, administrativos, financieros y legales de los proyectos de estudios y diseños","Oportunidad en el seguimiento y adopción de medidas durante la ejecución de los proyectos de estudios y diseños","Cumplimiento del alcance de los proyectos de estudios y diseños conforme a las necesidades identificadas","Porcentaje de avance en la ejecución de proyectos de estudios y/o diseños de parques y escenarios","(Porcentaje proyecto 1 + Porcentaje proyecto 2 +...+ Porcentaje proyecto n)/Total de proyectos de estudios y/o diseños en ejecución\nDonde: \nPorcentaje proyecto n =(Avance ejecutado de estudios y/o diseños/Avance programado de estudios y/o diseños al corte según forma de pago)\nn = Número de proyectos de estudios y/o diseños en ejecución","Gestión","Eficacia","Mensual",0.9,"Porcentaje","Informes mensuales de interventoría\n\nInformes mensuales de supervisión","Positiva","No","En el análisis del indicador se presentará la desagregación por proyecto.",2019,"Noviembre",92.79,100,0.92790000000000006,1.0310000000000001,"Aceptable"]
["Mejorar continuamente los procesos del Sistema Integrado de Gestión","Gestión Jurídica","Ejercer la defensa judicial y extrajudicial de la entidad y atender requerimientos jurídicos, para salvaguardar sus intereses y cumplir con los requisitos constitucionales y legales","Intervención oportuna en las distintas actuaciones judiciales y extrajudiciales en que sea parte la entidad","Oportunidad en el seguimiento a los procesos en los despachos e instancias judiciales",null,"Porcentaje de procesos judiciales y extrajudiciales atendidos dentro de los términos legales vigentes","(No. de procesos jurídicos atendidos dentro de los términos legales vigentes)/Total de procesos jurídicos notificados)*100","Gestión","Calidad","Trimestral",1,"Porcentaje","SIPROJ Web\nORFEO","Positiva","No","En el análisis del indicador se presentará la desagregación por procesos judiciales y extrajudiciales.",2019,"Noviembre"]
["Satisfacer las necesidades de los usuarios a través de la prestación de servicios eficientes, eficaces y efectivos","Gestión Jurídica","Ejercer la defensa judicial y extrajudicial de la entidad y atender requerimientos jurídicos, para salvaguardar sus intereses y cumplir con los requisitos constitucionales y legales","Cumplimiento de los requisitos establecidos para el reconocimiento deportivo y el aval de escuelas deportivas",null,null,"Satisfacción de los usuarios con el trámite de reconocimiento deportivo","(No. de usuarios satisfechos con el trámite de reconocimiento deportivo/Total de usuarios encuestados)*100","Gestión","Efectividad","Semestral",0.95,"Porcentaje","Encuesta de satisfacción de usuarios de reconocimiento deportivo","Positiva","No","En el análisis del indicador se presentarán los resultados desagregados por cada uno de los aspectos evaluados en la encuesta de satisfacción.",2019,"Noviembre"]
["Mejorar continuamente los procesos del Sistema Integrado de Gestión","Gestión Jurídica","Ejercer la defensa judicial y extrajudicial de la entidad y atender requerimientos jurídicos, para salvaguardar sus intereses y cumplir con los requisitos constitucionales y legales","Oportunidad en la respuesta del trámite de otorgamiento deportivo (45 días hábiles siguientes al cumplimiento de requisitos de otorgamiento deportivo)","Vigencia y aplicabilidad de la normatividad empleada para el reconocimiento deportivo y el aval de escuelas deportivas",null,"Porcentaje de trámites de reconocimiento deportivo atendidos dentro del término legal vigente","(No. de trámites de reconocimiento deportivo atendidos dentro del término legal vigente/Total de trámites de reconocimiento deportivo atendidos)*100 ","Gestión","Calidad","Trimestral",0.92,"Porcentaje","Matriz de control de reconocimiento deportivo","Positiva","No",null,2019,"Noviembre"]
["Mejorar continuamente los procesos del Sistema Integrado de Gestión","Gestión Jurídica","Ejercer la defensa judicial y extrajudicial de la entidad y atender requerimientos jurídicos, para salvaguardar sus intereses y cumplir con los requisitos constitucionales y legales","Oportunidad en la respuesta del trámite de aval de escuelas deportivas (58 días hábiles)","Vigencia y aplicabilidad de la normatividad empleada para el reconocimiento deportivo y el aval de escuelas deportivas",null,"Porcentaje de trámites de aval de escuelas deportivas atendidos dentro del término legal vigente","(No. de trámites de aval de escuelas deportivas atendidos dentro del término legal vigente/Total de trámites de aval de escuelas deportivas atendidos)*100","Gestión","Calidad","Trimestral",0.92,"Porcentaje","Matriz de control de aval de escuelas deportivas","Positiva","No",null,2019,"Noviembre"]
["Mejorar continuamente los procesos del Sistema Integrado de Gestión","Gestión Jurídica","Ejercer la defensa judicial y extrajudicial de la entidad y atender requerimientos jurídicos, para salvaguardar sus intereses y cumplir con los requisitos constitucionales y legales","Oportunidad en la respuesta a conceptos de proyectos de acuerdo con los tiempos establecidos","Suministro oportuno de la información de carácter técnico, de oportunidad y conveniencia del proyecto por parte de las dependencias y áreas de la entidad",null,"Porcentaje de solicitudes de concepto a proyectos de acuerdo, decreto o ley atendidas dentro del tiempo establecido","(No. de solicitudes de concepto a proyectos de acuerdo, decreto o ley atendidas dentro del tiempo establecido/Total de solicitudes de concepto a proyectos de acuerdo, decreto o ley recibidas)*100","Gestión","Calidad","Semestral",0.9,"Porcentaje","Matriz de seguimiento a solicitudes Congreso y Concejo","Positiva","No","En el análisis del indicador se presentará la desagregación por proyectos de acuerdo, decreto y ley.",2019,"Noviembre"]
["Mejorar continuamente los procesos del Sistema Integrado de Gestión","Gestión Jurídica","Ejercer la defensa judicial y extrajudicial de la entidad y atender requerimientos jurídicos, para salvaguardar sus intereses y cumplir con los requisitos constitucionales y legales","Recuperación de la cartera en mora",null,null,"Porcentaje de procesos de cobro de cartera efectuados","(No. de procesos con etapas de cobro efectuadas/Total de procesos de cobro remitidos con documentación completa)*100","Gestión","Eficacia","Cuatrimestral",1,"Porcentaje","Matriz de seguimiento cobro de cartera","Positiva","No","Los primeros cinco días hábiles de mayo se reportará el indicador con corte a 31 de diciembre del año anterior. \nLos primeros días de septiembre se reportará con corte 30 de abril de la vigencia.\nLos primeros días de enero se reportará con corte a 31 de agosto del año anterior.\nEn el análisis del indicador se presentará la desagregación por etapa (persuasivo y coactivo), así como también el porcentaje de recuperación de cartera.",2019,"Noviembre"]
["Mejorar continuamente los procesos del Sistema Integrado de Gestión","Gestión Jurídica","Ejercer la defensa judicial y extrajudicial de la entidad y atender requerimientos jurídicos, para salvaguardar sus intereses y cumplir con los requisitos constitucionales y legales","Intervención oportuna en las distintas actuaciones judiciales y extrajudiciales en que sea parte la entidad - tipos de daño en que se resulte demandado o condenado",null,null,"Índice de condenas adversas","(No. de condenas adversas/Total de procesos judiciales)*100","Gestión","Calidad","Semestral",0.08,"Porcentaje","Informe Siproj web mensual (procesos judiciales)","Negativa","No","El análisis del indicador debe evaluar dentro del comité de conciliación los procesos que cursen o hayan cursado en contra de la entidad, determinando causas generadoras de conflictos y los tipos de daño.",2019,"Noviembre"]
["Mejorar continuamente los procesos del Sistema Integrado de Gestión","Gestión de Comunicaciones","Dar a conocer interna y externamente las actividades, programas y obras que realiza la entidad, para generar apropiación y participación que contribuyan al posicionamiento de la imagen institucional","Exigencia de la solicitud de servicios para todos los procesos con la información completa y detallada de lo requerido","Veracidad de la información reportada por los solicitantes del servicio ",null,"Porcentaje de solicitudes de servicios de comunicaciones atendidas dentro de los tiempos establecidos","(No. de solicitudes de servicio atendidas dentro de los tiempos establecidos/Total de solicitudes de servicio de comunicaciones recibidas)*100","Gestión","Calidad","Trimestral",0.9,"Porcentaje","Consolidado de solicitudes de servicios de comunicaciones","Positiva","No",null,2019,"Noviembre"]
["Mejorar continuamente los procesos del Sistema Integrado de Gestión","Gestión de Comunicaciones","Dar a conocer interna y externamente las actividades, programas y obras que realiza la entidad, para generar apropiación y participación que contribuyan al posicionamiento de la imagen institucional","Relacionamiento con medios de comunicación","Análisis de los resultados obtenidos mediante el monitoreo de medios para facilitar la toma de decisiones",null,"Impacto de noticias publicadas en medios de comunicación","(No. de noticias positivas o neutras registradas/Total de noticias publicadas en medios de comunicación)*100","Gestión","Eficacia","Trimestral",1,"Porcentaje","Informes mensuales generados por la empresa contratada para realizar el monitoreo de medios","Positiva","No","En el análisis del indicador se presentará el resultado desagregado de noticias positivas y neutras, indicando los principales medios de comunicación.\nSe colocó una meta de 100%, mientras se levanta la línea base con la primera medición.",2019,"Noviembre"]
["Mejorar continuamente los procesos del Sistema Integrado de Gestión","Gestión de Comunicaciones","Dar a conocer interna y externamente las actividades, programas y obras que realiza la entidad, para generar apropiación y participación que contribuyan al posicionamiento de la imagen institucional","Seguimiento a los cambios en las condiciones de publicación en redes sociales y página web",null,null,"Tasa de variación en el alcance total de las publicaciones en redes sociales","((Alcance total de publicaciones en el trimestre actual - Alcance total de publicaciones en el trimestre anterior)/Alcance total de publicaciones en el trimestre anterior)*100\n\nDonde:\n\nAlcance total de las publicaciones = Total de usuarios que vieron las publicaciones de redes sociales","Gestión","Eficacia","Trimestral",0.2,"Porcentaje","Métricas nativas de cada red social","Positiva","No","En el análisis del indicador se presentará el resultado desagregado del alcance de las publicaciones por cada red social. ",2019,"Noviembre"]
["Mejorar continuamente los procesos del Sistema Integrado de Gestión","Gestión de Comunicaciones","Dar a conocer interna y externamente las actividades, programas y obras que realiza la entidad, para generar apropiación y participación que contribuyan al posicionamiento de la imagen institucional","Análisis de los resultados obtenidos mediante el monitoreo de medios para facilitar la toma de decisiones",null,null,"Salidas publicadas en medios de comunicación","N/A","Gestión","Eficacia","Mensual",80,"Número","Informes mensuales generados por la empresa contratada para realizar el monitoreo de medios","Positiva","No","En el análisis del indicador se presentará el valor estimado de las publicaciones en medios de comunicación.",2019,"Noviembre",158,1,{"$f":"+T903/U903","v":158},{"$f":"+V903/L903","v":1.9750000000000001},{"$f":"_xlfn.IFS(W903<=69%,\"Crítico\",W903>=90%,\"Aceptable\",W903>=70%,\"Tolerable\")","v":"Aceptable"}]
["Mejorar continuamente los procesos del Sistema Integrado de Gestión","Planeación de la Gestión","Establecer directrices para formular y realizar seguimiento a la planeación estratégica y operativa de la entidad con el propósito de contribuir al desarrollo de la misión y objetivos institucionales, así como facilitar la oportunidad y cumplimiento de los resultados esperados","Oportunidad, veracidad y calidad de la información de inversión y gestión",null,null,"Porcentaje de reportes de información presentados dentro de los tiempos programados","(No. de informes de ley y de gestión elaborados y presentados/Total de informes de ley y de gestión programados)*100  ","Gestión","Calidad","Trimestral",1,"Porcentaje","Cronograma de trabajo interno, plan operativo por dependencias (Oficina Asesora de Planeación), plan de adecuación y sostenibilidad SIGD-MIPG","Positiva","No","En el análisis del indicador se desagregará la programación para cada trimestre.",2019,"Diciembre",null,null,{"$error":"#DIV/0!"},{"$error":"#DIV/0!"},{"$error":"#DIV/0!"}]
["Mejorar continuamente los procesos del Sistema Integrado de Gestión","Planeación de la Gestión","Establecer directrices para formular y realizar seguimiento a la planeación estratégica y operativa de la entidad con el propósito de contribuir al desarrollo de la misión y objetivos institucionales, así como facilitar la oportunidad y cumplimiento de los resultados esperados","Oportunidad en el seguimiento de las acciones institucionales para la mejora (correcciones, acciones correctivas, oportunidades de mejora, acciones para abordar riesgos)",null,null,"Porcentaje de acciones de mejora con seguimiento efectuado dentro del Sistema de Gestión","[No. de acciones de mejora con seguimiento efectuado dentro del tiempo programado/Total de acciones de mejora abiertas dentro del Sistema de Gestión de la Calidad (correcciones, acciones correctivas, oportunidades de mejora, acciones para abordar riesgos)]*100","Gestión","Eficacia","Mensual",1,"Porcentaje","Isolución","Positiva","No","En el análisis del indicador se presentará el resultado desagregado por cada tipología de mejora (corrección, acciones correctivas, oportunidades de mejora, acciones para abordar riesgos).",2019,"Diciembre",null,null,{"$error":"#DIV/0!"},{"$error":"#DIV/0!"},{"$error":"#DIV/0!"}]
["Mejorar continuamente los procesos del Sistema Integrado de Gestión","Gestión de Recursos Físicos","Administrar y controlar los bienes muebles y servicios para el funcionamiento administrativo de la entidad","Oportunidad en la atención de requerimientos y necesidades de servicios administrativos",null,null,"Porcentaje de mantenimientos realizados a la infraestructura física de la sede administrativa","(No. de mantenimientos realizados a la infraestructura física/Total de mantenimientos programados a la infraestructura física de la sede administrativa)*100","Gestión","Eficacia","Trimestral",0.9,"Porcentaje","Expendientes contractuales en plataforma ORFEO","Positiva","No",null,2019,"Diciembre",null,null,{"$error":"#DIV/0!"},{"$error":"#DIV/0!"},{"$error":"#DIV/0!"}]
["Mejorar continuamente los procesos del Sistema Integrado de Gestión","Gestión de Asuntos Locales","Desarrollar acciones a nivel local para promover la participación ciudadana, brindar acompañamiento a las alcaldías locales en temas misionales de la entidad y ofertar sus programas","Oportunidad en la emisión del concepto previo y favorable según los tiempos establecidos en la normatividad vigente",null,null,"Porcentaje de conceptos previos tramitados dentro de los términos legales vigentes","(No. de conceptos previos tramitados dentro de los términos legales vigentes/Total de solicitudes de conceptos previos recibidas)*100","Gestión","Calidad","Trimestral",0.5,"Porcentaje","Matriz de seguimiento a conceptos previos tramitados","Positiva","No",null,2019,"Diciembre",null,null,{"$error":"#DIV/0!"},{"$error":"#DIV/0!"},{"$error":"#DIV/0!"}]
["Mejorar continuamente los procesos del Sistema Integrado de Gestión","Control, Evaluación y Seguimiento","Evaluar los controles y la gestión de la entidad con el fin de identificar e implementar acciones de mejora, en pro de la sostenibilidad del Sistema de Control Interno","Pertinencia y oportunidad en la entrega de los resultados del seguimiento a las partes interesadas","Oportunidad y calidad en la información reportada a las entidades competentes del orden nacional y distrital",null,"Porcentaje de informes presentados por la tercera línea de defensa dentro de los tiempos programados","(No. de informes de ley y de gestión elaborados y presentados dentro de los tiempos programados/Total de informes de ley y de gestión a cargo de la tercera línea de defensa )*100  ","Gestión","Calidad","Trimestral",1,"Porcentaje","Plan anual de auditoría\nCronograma presentación de informes","Positiva","No","En el análisis del indicador se presentará el resultado desagregado por cada uno de los informes realizados.",2019,"Diciembre",null,null,{"$error":"#DIV/0!"},{"$error":"#DIV/0!"},{"$error":"#DIV/0!"}]
["Mejorar continuamente los procesos del Sistema Integrado de Gestión","Control, Evaluación y Seguimiento","Evaluar los controles y la gestión de la entidad con el fin de identificar e implementar acciones de mejora, en pro de la sostenibilidad del Sistema de Control Interno","Cumplimiento de los objetivos definidos en el plan de auditoría conforme al plan de pruebas","Cobertura de las unidades a auditar de acuerdo con los parámetros establecidos en la matriz de priorización, en concordancia con los recursos disponibles para la ejecución del Plan Anual de Auditoría",null,"Índice de eficacia de auditorías internas de control interno","(Índice auditoría 1 + índice auditoría 2 +...+Índice auditoría n)/Total de auditorías realizadas\nDonde: \nÍndice auditoría n = Calificación porcentual de la variable Objetivos Específicos*Peso de la variable Objetivos Específicos + Calificación porcentual de la variable Actividad Plan de Auditoría*Peso de la variable Actividad Plan de Auditoría + Calificación porcentual de la variable Oportunidad*Peso de la variable Oportunidad\nPesos de las variables:\nObjetivos Específicos = 40%\nActividades Plan de Auditoría = 30%\nOportunidad = 30%. Esta se medirá tomando como fecha de referencia la de emisión del informe preliminar de auditoría.\nn = número de auditorías realizadas","Gestión","Eficacia","Trimestral",0.85,"Porcentaje","Planes de cada una de las auditorías","Positiva","No","En el análisis del indicador se presentará el resultado desagregado por cada una de las auditorías realizadas.",2019,"Diciembre",null,null,{"$error":"#DIV/0!"},{"$error":"#DIV/0!"},{"$error":"#DIV/0!"}]
["Mejorar continuamente los procesos del Sistema Integrado de Gestión","Gestión Financiera","Administrar los recursos financieros asignados y realizar los respectivos registros, para el cumplimiento de las funciones de la entidad y pago de sus obligaciones con terceros","Oportunidad en el seguimiento de las partidas pendientes por conciliar",null,null,"Porcentaje de partidas conciliatorias identificadas dentro del tiempo establecido","(No. de partidas conciliatorias identificadas con edad inferior a 60 días/Total de partidas reportadas)*100","Gestión","Calidad","Mensual",0.9,"Porcentaje","Sistema de información SEVEN","Positiva","No",null,2019,"Diciembre",null,null,{"$error":"#DIV/0!"},{"$error":"#DIV/0!"},{"$error":"#DIV/0!"}]
["Mejorar continuamente los procesos del Sistema Integrado de Gestión","Gestión Financiera","Administrar los recursos financieros asignados y realizar los respectivos registros, para el cumplimiento de las funciones de la entidad y pago de sus obligaciones con terceros","Oportunidad e integridad de la información necesaria para realizar las diferentes conciliaciones",null,null,"Porcentaje de obligaciones contingentes registradas correctamente en la contabilidad","(No. de procesos registrados correctamente en la contabilidad/Total de procesos reportados en SIPROJ Web)*100","Gestión","Calidad","Trimestral",1,"Porcentaje","Sistema de información SEVEN","Positiva","No",null,2019,"Diciembre",null,null,{"$error":"#DIV/0!"},{"$error":"#DIV/0!"},{"$error":"#DIV/0!"}]
["Mejorar continuamente los procesos del Sistema Integrado de Gestión","Gestión Financiera","Administrar los recursos financieros asignados y realizar los respectivos registros, para el cumplimiento de las funciones de la entidad y pago de sus obligaciones con terceros","Oportunidad en la presentación de informes y estados financieros a los diferentes entes de vigilancia y control",null,null,"Porcentaje de notas a los estados financieros reveladas correctamente","(No. de notas sin observaciones por parte de los órganos de control internos y externos/Total de notas a los estados financieros elaboradas)*100","Gestión","Calidad","Anual",0.95,"Porcentaje","Informes de entes de control y vigilancia","Positiva","No",null,2019,"Diciembre",null,null,{"$error":"#DIV/0!"},{"$error":"#DIV/0!"},{"$error":"#DIV/0!"}]
["Mejorar continuamente los procesos del Sistema Integrado de Gestión","Gestión Financiera","Administrar los recursos financieros asignados y realizar los respectivos registros, para el cumplimiento de las funciones de la entidad y pago de sus obligaciones con terceros","Oportunidad en la presentación de informes y estados financieros a los diferentes entes de vigilancia y control","Oportunidad en la presentación de las declaraciones tributarias",null,"Porcentaje de informes financieros presentados a los entes de vigilancia y control dentro de los términos legales vigentes","(No. de informes financieros presentados dentro de los términos legales vigentes/Total de informes financieros a reportar a los entes de vigilancia y control)*100","Gestión","Calidad","Mensual",1,"Porcentaje","Matriz de seguimiento a la presentación de informes ","Positiva","No",null,2019,"Diciembre",null,null,{"$error":"#DIV/0!"},{"$error":"#DIV/0!"},{"$error":"#DIV/0!"}]
["Satisfacer las necesidades de los usuarios a través de la prestación de servicios eficientes, eficaces y efectivos","Promoción de la Recreación","Desarrollar actividades recreativas en función de las características y necesidades de la población de Bogotá D.C., para promover el aprovechamiento del tiempo libre y el mejoramiento en la calidad de vida","Satisfacción del usuario con las actividades recreativas realizadas",null,null,"Satisfacción de los usuarios con los eventos y/o programas recreativos","(No. de usuarios satisfechos con los eventos y/o programas recreativos/Total de usuarios de eventos y/o programas recreativos encuestados)*100","Gestión","Efectividad","Anual",1,"Porcentaje","Encuesta de satisfacción sobre eventos y/o programas recreativos","Positiva","No","En el análisis del indicador se presentará el resultado desagregado por programa y por cada uno de los aspectos evaluados en la encuesta de satisfacción.\nSe colocó una meta de 100%, mientras se levanta la línea base con la primera medición.",2019,"Diciembre",null,null,{"$error":"#DIV/0!"},{"$error":"#DIV/0!"},{"$error":"#DIV/0!"}]
["Mejorar continuamente los procesos del Sistema Integrado de Gestión","Promoción de la Recreación","Desarrollar actividades recreativas en función de las características y necesidades de la población de Bogotá D.C., para promover el aprovechamiento del tiempo libre y el mejoramiento en la calidad de vida","Cumplimiento del programa de actividades recreativas, teniendo en cuenta lo establecido en las fichas técnicas o según lo concertado con la comunidad e instituciones",null,null,"Porcentaje de actividades recreativas que cumplen con los requisitos para su ejecución","(No. de actividades recreativas que cumplen con los requisitos definidos para su ejecución/Total de actividades recreativas realizadas)*100","Gestión","Eficacia","Trimestral",0.97,"Porcentaje","Sistema de información misional - SIM","Positiva","No","En el análisis del indicador se presentará el resultado desagregado por programa y por actividad.",2019,"Diciembre",null,null,{"$error":"#DIV/0!"},{"$error":"#DIV/0!"},{"$error":"#DIV/0!"}]
["Satisfacer las necesidades de los usuarios a través de la prestación de servicios eficientes, eficaces y efectivos","Fomento al Deporte","Desarrollar e implementar programas deportivos y de actividad física, para contribuir con el mejoramiento de la calidad de vida en la población de Bogotá D.C.","Satisfacción del usuario con las actividades deportivas  realizadas",null,null,"Satisfacción de los usuarios con las actividades realizadas en los programas deportivos","(No. de usuarios satisfechos con las actividades deportivas realizadas/Total de usuarios de actividades deportivas encuestados)*100","Gestión","Efectividad","Anual",1,"Porcentaje","Encuesta de satisfacción sobre actividades/programas deportivos","Positiva","No","En el análisis del indicador se presentará el resultado desagregado por programa y por cada uno de los aspectos evaluados en la encuesta de satisfacción.\nSe colocó una meta de 100%, mientras se levanta la línea base con la primera medición.",2019,"Diciembre",null,null,{"$error":"#DIV/0!"},{"$error":"#DIV/0!"},{"$error":"#DIV/0!"}]
["Mejorar continuamente los procesos del Sistema Integrado de Gestión","Fomento al Deporte","Desarrollar e implementar programas deportivos y de actividad física, para contribuir con el mejoramiento de la calidad de vida en la población de Bogotá D.C.","Cambios comportamentales como resultados de los programas deportivos y de actividad física",null,null,"Cambio comportamental frente a la actividad física y el deporte","(No. de beneficiarios con percepción de cambio comportamental alrededor de las 4 dimensiones de la alfabetización física/Total de beneficiarios de programas deportivos y de actividad física seleccionados en la muestra)*100","Gestión","Efectividad","Anual",1,"Porcentaje","Encuesta para medir las 4 dimensiones de la alfabetización física","Positiva","No","La metodología se aplicará sobre una muestra por cada por cada programa. Se define en 4 tipos de mediciones:\n1. Medición dimensión competencia física. Aplicar test de resistencia, fuerza de torso, habilidades y flexibilidad.\n2. Medición dimensiones: competencia cognitiva, comportamental y motivacional a través de un cuestionario (on-line o presencial).\nSe colocó una meta de 100%, mientras se levanta la línea base con la primera medición.",2019,"Diciembre",null,null,{"$error":"#DIV/0!"},{"$error":"#DIV/0!"},{"$error":"#DIV/0!"}]
["Satisfacer las necesidades de los usuarios a través de la prestación de servicios eficientes, eficaces y efectivos","Servicio a la Ciudadanía","Brindar información y atender los requerimientos de los grupos de valor y de interés de la entidad para responder a sus necesidades en cumplimiento de sus derechos","Oportunidad y calidad en la respuesta a los requerimientos de los grupos de valor e interés de la entidad","Satisfacción del ciudadano frente a las respuestas a sus requerimientos",null,"Satisfacción de peticionarios con la respuesta dada a sus requerimientos","(No. de peticionarios satisfechos con la respuesta dada a sus peticiones, quejas, reclamos y sugerencias/Total de peticionarios contactados)*100","Gestión","Efectividad","Mensual",0.8,"Porcentaje","Base de datos de gestión de PQRS","Positiva","No",null,2019,"Diciembre",null,null,{"$error":"#DIV/0!"},{"$error":"#DIV/0!"},{"$error":"#DIV/0!"}]
["Mejorar continuamente los procesos del Sistema Integrado de Gestión","Gestión de Recursos Físicos","Administrar y controlar los bienes muebles y servicios para el funcionamiento administrativo de la entidad","Oportunidad en la atención de requerimientos y necesidades de servicios administrativos",null,null,"Porcentaje de requerimientos de mantenimiento correctivo atendidos en la sede administrativa dentro de los tiempos establecidos","(No. de requerimientos de mantenimiento correctivo atendidos dentro de los tiempos establecidos/Total de requerimientos de mantenimiento correctivo reportados en la sede administrativa)*100","Gestión","Calidad","Trimestral",0.95,"Porcentaje","Aplicativo mesa de ayuda OTRS","Positiva","No",null,2019,"Diciembre",null,null,{"$error":"#DIV/0!"},{"$error":"#DIV/0!"},{"$error":"#DIV/0!"}]
["Mejorar continuamente los procesos del Sistema Integrado de Gestión","Adquisición de Bienes y Servicios","Realizar actividades contractuales para adquirir bienes y servicios con la oportunidad y de acuerdo con las especificaciones establecidas por la entidad","Cumplimiento de requisitos de acuerdo con la modalidad de selección",null,null,"Porcentaje de procesos de selección publicados dentro del tiempo establecido","(No. de actos de apertura de procesos de selección publicados en un tiempo menor o igual a 30 días hábiles después de la radicación/Total de actos de apertura expedidos)*100","Gestión","Calidad","Trimestral",0.9,"Porcentaje","Plataforma ORFEO y SECOP","Positiva","No","En el análisis del indicador se presentará el resultado desagregado para licitación pública, concurso de méritos y selección abreviada.",2019,"Diciembre",null,null,{"$error":"#DIV/0!"},{"$error":"#DIV/0!"},{"$error":"#DIV/0!"}]
["Mejorar continuamente los procesos del Sistema Integrado de Gestión","Adquisición de Bienes y Servicios","Realizar actividades contractuales para adquirir bienes y servicios con la oportunidad y de acuerdo con las especificaciones establecidas por la entidad","Oportunidad en la suscripción y legalización del contrato",null,null,"Porcentaje de contratos legalizados dentro del tiempo establecido","(No. de contratos legalizados en un tiempo menor o igual a 10 días hábiles a partir del acto administrativo de adjudicación/Total de procesos de selección adjudicados)*100","Gestión","Calidad","Mensual",0.8,"Porcentaje","SECOP y Plataforma ORFEO ","Positiva","No","En el análisis del indicador se presentará el resultado desagregado para licitación pública, concurso de méritos y selección abreviada.",2019,"Diciembre",null,null,{"$error":"#DIV/0!"},{"$error":"#DIV/0!"},{"$error":"#DIV/0!"}]
["Mejorar continuamente los procesos del Sistema Integrado de Gestión","Adquisición de Bienes y Servicios","Realizar actividades contractuales para adquirir bienes y servicios con la oportunidad y de acuerdo con las especificaciones establecidas por la entidad","Definición clara y precisa de requisitos técnicos, financieros, económicos, jurídicos y de riesgos de acuerdo con el bien o servicio a adquirir",null,null,"Porcentaje de procesos de obra tramitados en análisis de costos dentro del tiempo establecido","(No. de procesos de obra (todas las Subdirecciones) tramitados en oportunidad al recibo del memorando con la solicitud estudio del sector (20 días)/Total de procesos de obra recibidos)*100","Gestión","Calidad","Trimestral",1,"Porcentaje","Matriz de tráfico ACEE","Positiva","No",null,2019,"Diciembre",null,null,{"$error":"#DIV/0!"},{"$error":"#DIV/0!"},{"$error":"#DIV/0!"}]
["Mejorar continuamente los procesos del Sistema Integrado de Gestión","Adquisición de Bienes y Servicios","Realizar actividades contractuales para adquirir bienes y servicios con la oportunidad y de acuerdo con las especificaciones establecidas por la entidad","Definición clara y precisa de requisitos técnicos, financieros, económicos, jurídicos y de riesgos de acuerdo con el bien o servicio a adquirir",null,null,"Porcentaje de procesos diferentes a obra tramitados en análisis de costos dentro del tiempo establecido","(No. de procesos diferentes a obra tramitados en oportunidad al recibo del memorando con la solicitud estudio del sector (10 días hábiles)/Total de procesos recibidos diferentes a obra)*100","Gestión","Calidad","Trimestral",0.9,"Porcentaje","Matriz de tráfico ACEE","Positiva","No","En el análisis del indicador se presentará el resultado desagregado para procesos diferentes a obra.",2019,"Diciembre",null,null,{"$error":"#DIV/0!"},{"$error":"#DIV/0!"},{"$error":"#DIV/0!"}]
["Mejorar continuamente los procesos del Sistema Integrado de Gestión","Adquisición de Bienes y Servicios","Realizar actividades contractuales para adquirir bienes y servicios con la oportunidad y de acuerdo con las especificaciones establecidas por la entidad","Definición clara y precisa de requisitos técnicos, financieros, económicos, jurídicos y de riesgos de acuerdo con el bien o servicio a adquirir",null,null,"Porcentaje de procesos requeridos por precios artificialmente bajos","(No. de procesos (excepto Subastas SAS) requeridos por precios artificialmente bajos/Total de procesos evaluados)*100","Gestión","Calidad","Trimestral",0.15,"Porcentaje","Evaluación económica de los proponentes\n\nAnálisis de precios realizado por la ACEE","Negativa","No","En el análisis del indicador se presentará el resultado desagregado por tipo de proceso.",2019,"Diciembre",null,null,{"$error":"#DIV/0!"},{"$f":"((L924-V924)+L924)/L924","v":{"$error":"#DIV/0!"}},{"$error":"#DIV/0!"}]
["Mejorar continuamente los procesos del Sistema Integrado de Gestión","Control, Evaluación y Seguimiento","Evaluar los controles y la gestión de la entidad con el fin de identificar e implementar acciones de mejora, en pro de la sostenibilidad del Sistema de Control Interno","Pertinencia y oportunidad en la entrega de los resultados del seguimiento a las partes interesadas",null,null,"Porcentaje de acciones de mejoramiento interno con seguimiento efectuado","(No. de acciones de mejoramiento interno con seguimiento efectuado)/Total de acciones de mejoramiento interno abiertas de auditorías internas de control interno)*100","Gestión","Eficacia","Trimestral",1,"Porcentaje","Plataforma Isolución","Positiva","No","En el análisis del indicador se presentará el resultado desagregado por proceso.",2019,"Diciembre",null,null,{"$error":"#DIV/0!"},{"$f":"+V925/L925","v":{"$error":"#DIV/0!"}},{"$error":"#DIV/0!"}]
["Mejorar continuamente los procesos del Sistema Integrado de Gestión","Control, Evaluación y Seguimiento","Evaluar los controles y la gestión de la entidad con el fin de identificar e implementar acciones de mejora, en pro de la sostenibilidad del Sistema de Control Interno","Pertinencia y oportunidad en la entrega de los resultados del seguimiento a las partes interesadas",null,null,"Porcentaje de acciones de mejoramiento externo con seguimiento efectuado","(No. de acciones de mejoramiento externo con seguimiento efectuado)/Total de acciones de mejoramiento externo abiertas de auditorías externas)*100","Gestión","Eficacia","Trimestral",1,"Porcentaje","Matrices de consolidación del estado de las acciones de los diferentes entes de control y vigilancia","Positiva","No","En el análisis del indicador se presentará el resultado desagregado por auditoría externa.",2019,"Diciembre",null,null,{"$error":"#DIV/0!"},{"$error":"#DIV/0!"},{"$error":"#DIV/0!"}]
["Mejorar continuamente los procesos del Sistema Integrado de Gestión","Gestión Financiera","Administrar los recursos financieros asignados y realizar los respectivos registros, para el cumplimiento de las funciones de la entidad y pago de sus obligaciones con terceros","Oportunidad en la expedición de los certificados presupuestales y en la presentación de los informes de ejecución",null,null,"Porcentaje de ejecución presupuestal en gastos de funcionamiento","(Presupuesto de funcionamiento ejecutado/Presupuesto disponible de funcionamiento)*100","Gestión","Eficiencia","Mensual",0.9,"Porcentaje","Ejecución presupuestal en SEVEN","Positiva","Si","La meta es anual con medición y análisis mensual.\nLa medición está a cargo del Área Financiera y el análisis a cargo de la Subdirección Administrativa y Financiera.\nLa medición y el análisis se deben realizar a más tardar el quinto día hábil de cada mes.\nUna vez se realice el Comité Financiero, el Área Financiera debe enviar a la Oficina Asesora de Planeación la presentación correspondiente, con el análisis respectivo en cuanto al desempeño del indicador.",2019,"Diciembre",null,null,{"$error":"#DIV/0!"},{"$error":"#DIV/0!"},{"$error":"#DIV/0!"}]
["Mejorar continuamente los procesos del Sistema Integrado de Gestión","Gestión Financiera","Administrar los recursos financieros asignados y realizar los respectivos registros, para el cumplimiento de las funciones de la entidad y pago de sus obligaciones con terceros","Oportunidad en la expedición de los certificados presupuestales y en la presentación de los informes de ejecución","Oportunidad en la autorización de giro de los recursos de transferencia",null,"Porcentaje de ejecución presupuestal en gastos de inversión","(Presupuesto de inversión ejecutado/Presupuesto disponible de inversión)*100","Gestión","Eficiencia","Mensual",0.95,"Porcentaje","Ejecución presupuestal en SEVEN","Positiva","Si","La meta es anual con medición y análisis mensual.\nLa medición está a cargo del Área Financiera y el análisis a cargo de los Ordenadores del Gasto.\nLa medición y el análisis se deben realizar a más tardar el quinto día hábil de cada mes.\nUna vez se realice el Comité Financiero, el Área Financiera debe enviar a la Oficina Asesora de Planeación la presentación correspondiente, con el análisis respectivo en cuanto al desempeño del indicador.",2019,"Diciembre",null,null,{"$error":"#DIV/0!"},{"$error":"#DIV/0!"},{"$error":"#DIV/0!"}]
["Mejorar continuamente los procesos del Sistema Integrado de Gestión","Gestión Financiera","Administrar los recursos financieros asignados y realizar los respectivos registros, para el cumplimiento de las funciones de la entidad y pago de sus obligaciones con terceros","Oportunidad en el pago de las obligaciones financieras de la entidad",null,null,"Porcentaje de ejecución del programa anual de caja","(Recursos ejecutados de reserva, vigencia y pasivos exigibles/Recursos programados de reserva, vigencia y pasivos exigibles)*100","Gestión","Eficiencia","Mensual",0.95,"Porcentaje","Sistema de información SEVEN","Positiva","Si","La meta es anual con medición y análisis mensual.\nLa medición está a cargo del Área Financiera y el análisis a cargo de los Ordenadores del Gasto.\nLa medición y el análisis se deben realizar a más tardar el quinto día hábil de cada mes.\nUna vez se realice el Comité Financiero, el Área Financiera debe enviar a la Oficina Asesora de Planeación la presentación correspondiente, con el análisis respectivo en cuanto al desempeño del indicador.",2019,"Diciembre",null,null,{"$f":"+T929/U929","v":{"$error":"#DIV/0!"}},{"$error":"#DIV/0!"},{"$f":"_xlfn.IFS(W929<=69%,\"Crítico\",W929>=90%,\"Aceptable\",W929>=70%,\"Tolerable\")","v":{"$error":"#DIV/0!"}}]
["Mejorar continuamente los procesos del Sistema Integrado de Gestión","Gestión Financiera","Administrar los recursos financieros asignados y realizar los respectivos registros, para el cumplimiento de las funciones de la entidad y pago de sus obligaciones con terceros","Oportunidad en el pago de las obligaciones financieras de la entidad","Oportunidad en la causación de ordenes de pago que cumplan con todos los requisitos establecidos","Oportunidad y veracidad de la información necesaria para la causación de las ordenes de pago reportada por los ordenadores del gasto","Porcentaje de cuentas individuales pagadas dentro del tiempo establecido","(No. de cuentas individuales pagadas en un tiempo menor o igual a 6 días/Total de cuentas de pago individuales tramitadas)*100 ","Gestión","Calidad","Mensual",1,"Porcentaje","Bitácora de cuentas en SEVEN","Positiva","No","La medición y el análisis están a cargo del Área Financiera.\nEn el análisis del indicador se presentará el resultado del tiempo promedio en cada una de las etapas para el pago, según la bitácora de cuentas de SEVEN.",2019,"Diciembre",null,null,{"$error":"#DIV/0!"},{"$error":"#DIV/0!"},{"$error":"#DIV/0!"}]
["Mejorar continuamente los procesos del Sistema Integrado de Gestión","Gestión Financiera","Administrar los recursos financieros asignados y realizar los respectivos registros, para el cumplimiento de las funciones de la entidad y pago de sus obligaciones con terceros","Oportunidad en el pago de las obligaciones financieras de la entidad","Oportunidad en la causación de ordenes de pago que cumplan con todos los requisitos establecidos","Oportunidad y veracidad de la información necesaria para la causación de las ordenes de pago reportada por los ordenadores del gasto","Porcentaje de cuentas colectivas pagadas dentro del tiempo establecido","(No. de cuentas colectivas pagadas en un tiempo menor o igual a 10 días/Total de cuentas de pago colectivas tramitadas)*100","Gestión","Calidad","Mensual",1,"Porcentaje","Bitácora de cuentas en SEVEN","Positiva","No","La medición y el análisis están a cargo del Área Financiera.\nEn el análisis del indicador se debe presentar el resultado del tiempo promedio en cada una de las etapas para el pago, según la bitácora de cuentas de SEVEN.",2019,"Diciembre",null,null,{"$error":"#DIV/0!"},{"$error":"#DIV/0!"},{"$error":"#DIV/0!"}]
["Implementar las políticas y líneas de acción para la preservación e integridad de la documentación","Gestión Documental","Administrar, conservar y custodiar la documentación generada en la entidad, desde su origen hasta su disposición final, para preservar la memoria institucional","Actualización del inventario documental en el Formato Único de Inventario Documental, con base en la aplicación de las tablas de retención documental","Cumplimiento de los tiempos de retención documental establecidos en las tablas","Actualización de los instrumentos archivísticos","Porcentaje de inventario validado del fondo documental acumulado del archivo central","(No. de metros lineales de inventario validado en cuanto a series, subseries, asuntos y oficinas productoras/Total de metros lineales de archivo inventariado en estado natural del archivo central)*100 ","Gestión","Eficacia","Mensual",1,"Porcentaje","Matriz de seguimiento a inventario documental","Positiva","Si","La meta es anual con medición y análisis mensual",2019,"Diciembre"]
["Implementar las políticas y líneas de acción para la preservación e integridad de la documentación","Gestión Documental","Administrar, conservar y custodiar la documentación generada en la entidad, desde su origen hasta su disposición final, para preservar la memoria institucional","Oportunidad en las transferencias documentales de acuerdo con los tiempos de retención establecidos en las tablas",null,null,"Porcentaje de transferencias primarias realizadas de acuerdo con los tiempos de retención","(No. de transferencias primarias realizadas de acuerdo con los tiempos de retención establecidos en las TRD/Total de transferencias documentales programadas)*100","Gestión","Eficacia","Mensual",0.8,"Porcentaje","Matriz de seguimiento a transferencias documentales","Positiva","Si","La meta es anual con medición y análisis mensual",2019,"Diciembre",null,null,{"$error":"#DIV/0!"},{"$error":"#DIV/0!"},{"$error":"#DIV/0!"}]
["Implementar las políticas y líneas de acción para la preservación e integridad de la documentación","Gestión Documental","Administrar, conservar y custodiar la documentación generada en la entidad, desde su origen hasta su disposición final, para preservar la memoria institucional","Cumplimiento de los estándares de temperatura, humedad relativa y luminosidad de los espacios de almacenamiento de material documental, dentro de los rangos establecidos en la normatividad vigente",null,null,"Porcentaje de espacios controlados para la conservación documental","(No. de espacios monitoreados e intervenidos/Total de espacios monitoreados)*100","Gestión","Eficacia","Mensual",1,"Porcentaje","Informe de monitoreo de espacios controlados","Positiva","No","La medición es mes vencido",2019,"Diciembre",null,null,{"$error":"#DIV/0!"},{"$error":"#DIV/0!"},{"$error":"#DIV/0!"}]
["Mejorar continuamente los procesos del Sistema Integrado de Gestión","Servicio a la Ciudadanía","Brindar información y atender los requerimientos de los grupos de valor y de interés de la entidad para responder a sus necesidades en cumplimiento de sus derechos","Oportunidad y calidad en la respuesta a los requerimientos de los grupos de valor e interés de la entidad",null,null,"Porcentaje de peticiones, quejas, reclamos y sugerencias contestadas dentro de los términos legales vigentes","(No. de peticiones, quejas, reclamos y sugerencias contestadas en el aplicativo SDQS dentro de los términos legales vigentes/Total de peticiones, quejas, reclamos y sugerencias recibidas)*100","Gestión","Calidad","Mensual",1,"Porcentaje","Sistema SDQS","Positiva","No","La medición es mes vencido",2019,"Diciembre",null,null,{"$error":"#DIV/0!"},{"$error":"#DIV/0!"},{"$error":"#DIV/0!"}]
["Satisfacer las necesidades de los usuarios a través de la prestación de servicios eficientes, eficaces y efectivos","Servicio a la Ciudadanía","Brindar información y atender los requerimientos de los grupos de valor y de interés de la entidad para responder a sus necesidades en cumplimiento de sus derechos","Satisfacción del ciudadano frente a la atención brindada por la entidad",null,null,"Satisfacción del ciudadano con la atención recibida en los SUPERCADE","(No. de ciudadanos satisfechos con la atención recibida en los SUPERCADE/Total de ciudadanos atendidos en los SUPERCADE)*100","Gestión","Efectividad","Mensual",0.95,"Porcentaje","Encuesta de satisfacción con la atención brindada en SUPERCADES","Positiva","No",null,2019,"Diciembre",null,null,{"$error":"#DIV/0!"},{"$error":"#DIV/0!"},{"$error":"#DIV/0!"}]
["Mejorar continuamente los procesos del Sistema Integrado de Gestión","Servicio a la Ciudadanía","Brindar información y atender los requerimientos de los grupos de valor y de interés de la entidad para responder a sus necesidades en cumplimiento de sus derechos","Oportunidad en la actualización de la información publicada en la sección de ley de transparencia en la página web de la entidad",null,null,"Porcentaje de información actualizada en ley de transparencia","(No. de subcategorías con información actualizada en la página web/Total de subcategorías definidas en ley de transparencia)*100","Gestión","Eficacia","Trimestral",1,"Porcentaje","Página web","Positiva","No",null,2019,"Diciembre",null,null,{"$error":"#DIV/0!"},{"$error":"#DIV/0!"},{"$error":"#DIV/0!"}]
["Mejorar continuamente los procesos del Sistema Integrado de Gestión","Servicio a la Ciudadanía","Brindar información y atender los requerimientos de los grupos de valor y de interés de la entidad para responder a sus necesidades en cumplimiento de sus derechos","Coherencia, claridad, solución de fondo, calidez y manejo del sistema en relación con los requerimientos atendidos por la entidad",null,null,"Porcentaje de requerimientos atendidos con oportunidad y calidad","(No. de respuestas a requerimientos sin observaciones en cuanto a los criterios de oportunidad y calidad/Total de requerimientos evaluados en el aplicativo SDQS)*100","Gestión","Eficacia","Mensual",0.8,"Porcentaje","SDQS y base de datos de gestión de PQRS","Positiva","No","La medición es mes vencido",2019,"Diciembre",null,null,{"$error":"#DIV/0!"},{"$error":"#DIV/0!"},{"$error":"#DIV/0!"}]
["Implementar buenas prácticas ambientales para la prevención de la contaminación en el marco de una Bogotá que defiende lo público en su función administrativa y de desarrollo institucional","Gestión de Recursos Físicos","Administrar y controlar los bienes muebles y servicios para el funcionamiento administrativo de la entidad","Calificación de la implementación del Plan Institucional de Gestión Ambiental, por parte de la Secretaría Distrital de Ambiente","Oportunidad en el reporte de formularios y registros electrónicos del PIGA ante la Secretaría Distrital de Ambiente",null,"Índice de implementación del PIGA","Promedio ponderado de cumplimiento de aspectos normativos y de implementación del PIGA, según auditoría realizada por la Secretaría Distrital de Ambiente en cada vigencia","Gestión","Eficacia","Anual",0.7,"Porcentaje","Informe de auditoría anual realizada por la Secretaría Distrital de Ambiente","Positiva","No","En el análisis del indicador se presentará el resultado desagregado por cada uno de los aspectos evaluados en la visita de control y seguimiento por parte de la Secretaría Distrital de Ambiente.\nLa meta está configurada como mayor a 70%.",2019,"Diciembre",null,null,{"$error":"#DIV/0!"},{"$error":"#DIV/0!"},{"$error":"#DIV/0!"}]
["Proteger la integridad, confidencialidad y disponibilidad de la información","Gestión de Tecnología de la Información y las Comunicaciones","Proporcionar soluciones estratégicas de tecnologías de la información y las comunicaciones, para contribuir con la eficiencia administrativa, la mejora de los trámites y servicios y la protección de los activos de información de la entidad","Impacto del plan de remediación frente a las vulnerabilidades identificadas","Aseguramiento de incidencias en la seguridad de la información que afecten la confidencialidad, integridad y disponibilidad",null,"Porcentaje de remediación de vulnerabilidades de seguridad de la información","(No. de vulnerabilidades críticas o altas remediadas/Total de vulnerabilidades de seguridad de la información detectadas como críticas o altas)*100 ","Gestión","Eficacia","Anual",0.7,"Porcentaje","Matriz de vulnerabilidades","Positiva","No","La meta está configurada como mínimo 70%.",2019,"Diciembre",null,null,{"$error":"#DIV/0!"},{"$error":"#DIV/0!"},{"$error":"#DIV/0!"}]
["Proteger la integridad, confidencialidad y disponibilidad de la información","Gestión de Tecnología de la Información y las Comunicaciones","Proporcionar soluciones estratégicas de tecnologías de la información y las comunicaciones, para contribuir con la eficiencia administrativa, la mejora de los trámites y servicios y la protección de los activos de información de la entidad","Avances en la implementación de gobierno digital de acuerdo con los componentes evaluados por MINTIC",null,null,"Índice de implementación de gobierno digital","Sumatoria de la calificación obtenida por cada componente/Total de componentes de la política de gobierno digital","Gestión","Eficacia","Anual",0.65,"Porcentaje","Instrumento de medición suministrado para el seguimiento a la política de gobierno digital  ","Positiva","No","En el análisis del indicador se presentará el resultado desagregado de las calificaciones obtenidas en cada componente de la política de seguridad digital.",2019,"Diciembre",null,null,{"$error":"#DIV/0!"},{"$error":"#DIV/0!"},{"$error":"#DIV/0!"}]
["Mejorar continuamente los procesos del Sistema Integrado de Gestión","Gestión de Tecnología de la Información y las Comunicaciones","Proporcionar soluciones estratégicas de tecnologías de la información y las comunicaciones, para contribuir con la eficiencia administrativa, la mejora de los trámites y servicios y la protección de los activos de información de la entidad","Cumplimiento del Plan Estratégico de Tecnologías de la Información PETI",null,null,"Porcentaje de avance en proyectos de TI","(No. de hitos en proyectos de TI alcanzados/Total de hitos en proyectos de TI programados en la vigencia)*100","Gestión","Eficacia","Semestral",1,"Porcentaje","Cronograma de proyectos del PETI","Positiva","Si","La meta es anual con medición y análisis semestral.",2019,"Diciembre",null,null,{"$error":"#DIV/0!"},{"$error":"#DIV/0!"},{"$error":"#DIV/0!"}]
["Proteger la integridad, confidencialidad y disponibilidad de la información","Gestión de Tecnología de la Información y las Comunicaciones","Proporcionar soluciones estratégicas de tecnologías de la información y las comunicaciones, para contribuir con la eficiencia administrativa, la mejora de los trámites y servicios y la protección de los activos de información de la entidad","Disponibilidad de los sistemas de información de la entidad",null,null,"Porcentaje de disponibilidad de los sistemas de información","(No. de horas disponibles de los sistemas de información/Total de horas en servicio de los sistemas de información)*100","Gestión","Eficiencia","Mensual",0.9,"Porcentaje","Herramienta de monitoreo ZABBIX","Positiva","No","En el análisis del indidicador se presentará el resultado desagregado de disponibilidad en ORFEO, SEVEN, KACTUS y SIM.\nLa meta está configurada como mayor o igual a 90%.",2019,"Diciembre",null,null,{"$error":"#DIV/0!"},{"$error":"#DIV/0!"},{"$error":"#DIV/0!"}]
["Mejorar continuamente los procesos del Sistema Integrado de Gestión","Gestión de Tecnología de la Información y las Comunicaciones","Proporcionar soluciones estratégicas de tecnologías de la información y las comunicaciones, para contribuir con la eficiencia administrativa, la mejora de los trámites y servicios y la protección de los activos de información de la entidad","Disponibilidad de los servicios de comunicaciones en la entidad, según los acuerdos de niveles de servicios establecidos",null,null,"Porcentaje de disponibilidad de los servicios de comunicaciones","(No. de horas disponibles de los servicios de comunicaciones /Total de horas de los servicios de comunicaciones)*100","Gestión","Eficiencia","Mensual",0.9,"Porcentaje","Herramienta de monitoreo ZABBIX","Positiva","No","En el análisis del indidicador se presentará el resultado desagregado de disponibilidad en Internet y Telefonía IP.\nLa meta está configurada como mayor o igual a 90%.",2019,"Diciembre",null,null,{"$error":"#DIV/0!"},{"$error":"#DIV/0!"},{"$error":"#DIV/0!"}]
["Mejorar continuamente los procesos del Sistema Integrado de Gestión","Gestión de Tecnología de la Información y las Comunicaciones","Proporcionar soluciones estratégicas de tecnologías de la información y las comunicaciones, para contribuir con la eficiencia administrativa, la mejora de los trámites y servicios y la protección de los activos de información de la entidad","Incidencias reportadas en el funcionamiento del módulo o sistema de información implementado","Cumplimiento de los acuerdos de niveles de servicios establecidos",null,"Porcentaje de solicitudes de servicio tecnológico atendidas dentro de los tiempos establecidos","(No. de solicitudes atendidas dentro de los tiempos establecidos en los acuerdos de nivel de servicio/Total de solicitudes de servicio tecnológico recibidas)*100","Gestión","Calidad","Mensual",0.9,"Porcentaje","Herramienta GLPI","Positiva","No",null,2019,"Diciembre",null,null,{"$error":"#DIV/0!"},{"$error":"#DIV/0!"},{"$error":"#DIV/0!"}]
["Mejorar continuamente los procesos del Sistema Integrado de Gestión","Gestión de Talento Humano","Gestionar el potencial del talento humano como factor estratégico, para contribuir con el desarrollo de la entidad en un ambiente seguro y saludable","Cumplimiento de compromisos y competencias del servidor público en el desempeño laboral","Oportunidad en el seguimiento y la evaluación anual u ordinaria del servidor público para continuar su permanencia en el servicio",null,"Índice de desempeño laboral de funcionarios","(Sumatoria de calificaciones finales de la evaluación de desempeño de los funcionarios/Total de funcionarios evaluados)*100","Gestión","Eficacia","Anual",0.9,"Porcentaje","Consolidado de las calificaciones finales de la evaluación de desempeño","Positiva","No","En el análisis del indicador se presentará el resultado desagregado por niveles jerárquicos y comparar con la evaluación de las áreas.\nLa meta está configurada como mayor a 90%.\nNota: Se mide para vigencia 2018-2019.",2019,"Diciembre",null,null,{"$error":"#DIV/0!"},{"$error":"#DIV/0!"},{"$error":"#DIV/0!"}]
["Mejorar continuamente los procesos del Sistema Integrado de Gestión","Gestión de Talento Humano","Gestionar el potencial del talento humano como factor estratégico, para contribuir con el desarrollo de la entidad en un ambiente seguro y saludable","Cobertura de servidores públicos en las actividades del plan de bienestar e incentivos",null,null,"Porcentaje de funcionarios que participan en las actividades del plan de bienestar e incentivos","(No. de funcionarios participantes en las actividades del plan de bienestar e incentivos/Total de funcionarios de la entidad)*100 ","Gestión","Eficacia","Semestral",0.8,"Porcentaje","Registros de asistencia a las actividades del plan de bienestar","Positiva","No",null,2019,"Diciembre",null,null,{"$error":"#DIV/0!"},{"$error":"#DIV/0!"},{"$error":"#DIV/0!"}]
["Mejorar continuamente los procesos del Sistema Integrado de Gestión","Gestión de Talento Humano","Gestionar el potencial del talento humano como factor estratégico, para contribuir con el desarrollo de la entidad en un ambiente seguro y saludable","Cobertura de servidores públicos en las actividades del plan institucional de capacitación",null,null,"Porcentaje de funcionarios que asisten a las actividades del plan institucional de capacitación","(No. de funcionarios asistentes a las actividades del plan institucional de capacitación/Total de funcionarios citados a las actividades del plan institucional de capacitación)*100","Gestión","Eficacia","Semestral",0.8,"Porcentaje","Registros de asistencia a las actividades del plan de capacitación","Positiva","No","Las capacitaciones que se incluyen en el indicador son las que implican recursos.",2019,"Diciembre",null,null,{"$error":"#DIV/0!"},{"$error":"#DIV/0!"},{"$error":"#DIV/0!"}]
["Mejorar continuamente los procesos del Sistema Integrado de Gestión","Gestión de Talento Humano","Gestionar el potencial del talento humano como factor estratégico, para contribuir con el desarrollo de la entidad en un ambiente seguro y saludable","Evaluación del impacto de la capacitación en el desempeño de los servidores públicos y de la entidad",null,null,"Impacto de la capacitación en el desempeño laboral de funcionarios","(No. de funcionarios con capacitaciones efectivas/Total de funcionarios evaluados)*100","Gestión","Eficacia","Trimestral",0.95,"Porcentaje","Consolidado de las evaluaciones de impacto de la capacitación","Positiva","No",null,2019,"Diciembre",null,null,{"$error":"#DIV/0!"},{"$error":"#DIV/0!"},{"$error":"#DIV/0!"}]
["Mejorar continuamente los procesos del Sistema Integrado de Gestión","Gestión de Talento Humano","Gestionar el potencial del talento humano como factor estratégico, para contribuir con el desarrollo de la entidad en un ambiente seguro y saludable","Satisfacción de los servidores públicos frente a las actividades de  bienestar e incentivos","Satisfacción de los servidores públicos frente a las actividades de capacitación",null,"Índice de clima organizacional","Promedio ponderado de las dimensiones evaluadas en la encuesta de medición de clima organizacional","Gestión","Eficacia","Anual",0.8,"Porcentaje","Informe de medición de clima organizacional","Positiva","No","En el análisis del indicador se presentará el resultado desagregado por áreas y/o dependencias, y por las dimensiones evaluadas.",2019,"Diciembre",null,null,{"$error":"#DIV/0!"},{"$error":"#DIV/0!"},{"$error":"#DIV/0!"}]
["Mejorar continuamente los procesos del Sistema Integrado de Gestión","Gestión de Talento Humano","Gestionar el potencial del talento humano como factor estratégico, para contribuir con el desarrollo de la entidad en un ambiente seguro y saludable","Cumplimiento del plan anual de  bienestar e incentivos",null,null,"Porcentaje de ejecución del plan anual de bienestar e incentivos","(No. de actividades de bienestar e incentivos desarrolladas/Total de actividades programadas en el plan anual de bienestar e incentivos)*100","Gestión","Eficacia","Semestral",1,"Porcentaje","Matriz de seguimiento a la ejecución de actividades de bienestar e incentivos","Positiva","Si","La meta es anual con medición y análisis semestral.",2019,"Diciembre",null,null,{"$error":"#DIV/0!"},{"$error":"#DIV/0!"},{"$error":"#DIV/0!"}]
["Mejorar continuamente los procesos del Sistema Integrado de Gestión","Gestión de Talento Humano","Gestionar el potencial del talento humano como factor estratégico, para contribuir con el desarrollo de la entidad en un ambiente seguro y saludable","Cumplimiento del plan institucional de capacitación",null,null,"Porcentaje de ejecución del plan institucional de capacitación","(No. de actividades de capacitación desarrolladas/Total de actividades programadas en el plan institucional de capacitación)*100","Gestión","Eficacia","Semestral",1,"Porcentaje","Matriz de seguimiento a la ejecución de actividades de capacitación","Positiva","Si","La meta es anual con medición y análisis semestral.",2019,"Diciembre",null,null,{"$error":"#DIV/0!"},{"$error":"#DIV/0!"},{"$error":"#DIV/0!"}]
["Prevenir los factores que afecten la salud y seguridad a fin de mejorar las condiciones del ambiente de trabajo","Gestión de Talento Humano","Gestionar el potencial del talento humano como factor estratégico, para contribuir con el desarrollo de la entidad en un ambiente seguro y saludable","Cumplimiento del plan anual de trabajo",null,null,"Porcentaje de ejecución del plan anual de seguridad y salud en el trabajo","(No. de actividades de seguridad y salud desarrolladas/Total de actividades programadas en el plan anual de seguridad y salud en el trabajo)*100","Gestión","Eficacia","Mensual",0.95,"Porcentaje","Plan de trabajo anual del Sistema de Gestión de Seguridad y Salud en el Trabajo","Positiva","No",null,2019,"Diciembre",null,null,{"$error":"#DIV/0!"},{"$error":"#DIV/0!"},{"$error":"#DIV/0!"}]
["Prevenir los factores que afecten la salud y seguridad a fin de mejorar las condiciones del ambiente de trabajo","Gestión de Talento Humano","Gestionar el potencial del talento humano como factor estratégico, para contribuir con el desarrollo de la entidad en un ambiente seguro y saludable","Tasa de accidentalidad",null,null,"Tasa de accidentalidad","(No. de accidentes de trabajo reportados/Total de trabajadores (funcionarios y contratistas)*100","Gestión","Efectividad","Mensual",0.04,"Porcentaje","Matriz de accidentes de trabajo","Negativa","No","La meta está configurada como menor o igual a 4%.",2019,"Diciembre",null,null,{"$error":"#DIV/0!"},{"$f":"((L954-V954)+L954)/L954","v":{"$error":"#DIV/0!"}},{"$error":"#DIV/0!"}]
["Prevenir los factores que afecten la salud y seguridad a fin de mejorar las condiciones del ambiente de trabajo","Gestión de Talento Humano","Gestionar el potencial del talento humano como factor estratégico, para contribuir con el desarrollo de la entidad en un ambiente seguro y saludable","Incidencia y prevalencia de enfermedades laborales",null,null," Prevalencia de la enfermedad laboral","(No. de casos de enfermedad laboral calificada/Total de funcionarios)*100","Gestión","Efectividad","Trimestral",0.02,"Porcentaje","Matriz de seguimiento de enfermedades laborales","Negativa","No","La meta está configurada como menor o igual a 2%.",2019,"Diciembre",null,null,{"$error":"#DIV/0!"},{"$f":"((L955-V955)+L955)/L955","v":{"$error":"#DIV/0!"}},{"$error":"#DIV/0!"}]
["Prevenir los factores que afecten la salud y seguridad a fin de mejorar las condiciones del ambiente de trabajo","Gestión de Talento Humano","Gestionar el potencial del talento humano como factor estratégico, para contribuir con el desarrollo de la entidad en un ambiente seguro y saludable","Incidencia y prevalencia de enfermedades laborales",null,null,"Incidencia de la enfermedad laboral","(No. de casos nuevos de enfermedad laboral calificados/Total de funcionarios)*100","Gestión","Efectividad","Trimestral",0.01,"Porcentaje","Matriz de seguimiento de enfermedades laborales","Negativa","No","La meta está configurada como menor o igual a 1%.",2019,"Diciembre",null,null,{"$error":"#DIV/0!"},{"$f":"((L956-V956)+L956)/L956","v":{"$error":"#DIV/0!"}},{"$error":"#DIV/0!"}]
["Mejorar continuamente los procesos del Sistema Integrado de Gestión","Gestión de Recursos Físicos","Administrar y controlar los bienes muebles y servicios para el funcionamiento administrativo de la entidad","Confiabilidad del inventario de bienes devolutivos",null,null,"Porcentaje de inventario individual validado físicamente","(No. de elementos devolutivos del inventario individual validados físicamente/Total de elementos devolutivos del inventario individual registrados en el sistema de información SEVEN)*100 ","Gestión","Eficacia","Anual",1,"Porcentaje","Sistema de información SEVEN","Positiva","No",null,2019,"Diciembre",null,null,{"$error":"#DIV/0!"},{"$f":"+V957/L957","v":{"$error":"#DIV/0!"}},{"$error":"#DIV/0!"}]
["Mejorar continuamente los procesos del Sistema Integrado de Gestión","Gestión de Recursos Físicos","Administrar y controlar los bienes muebles y servicios para el funcionamiento administrativo de la entidad","Confiabilidad del inventario de bienes devolutivos",null,null,"Porcentaje de inventario aleatorio validado físicamente en bodega","(No. de elementos devolutivos y de consumo en bodegas validados físicamente/Muestra de inventario de elementos devolutivos y de consumo registrados en el sistema de información SEVEN)*100 ","Gestión","Eficacia","Trimestral",1,"Porcentaje","Sistema de información SEVEN","Positiva","No",null,2019,"Diciembre",null,null,{"$error":"#DIV/0!"},{"$error":"#DIV/0!"},{"$error":"#DIV/0!"}]
["Mejorar continuamente los procesos del Sistema Integrado de Gestión","Gestión de Asuntos Locales","Desarrollar acciones a nivel local para promover la participación ciudadana, brindar acompañamiento a las alcaldías locales en temas misionales de la entidad y ofertar sus programas","Cumplimiento de los compromisos adquiridos por la entidad, en el marco de las instancias de participación locales",null,null,"Porcentaje de compromisos atendidos en el marco de las instancias de participación locales","(No. de compromisos atendidos en las instancias Consejo Local de Gobierno, Unidad de Apoyo Técnico y Comisión Local Intersectorial de Participación /Total de compromisos generados en las instancias Consejo Local de Gobierno, Unidad de Apoyo Técnico y Comisión Local Intersectorial de Participación)*100","Gestión","Eficacia","Trimestral",1,"Porcentaje","Matriz de seguimiento a compromisos derivados de instancias de participación locales","Positiva","No",null,2019,"Diciembre",null,null,{"$error":"#DIV/0!"},{"$error":"#DIV/0!"},{"$error":"#DIV/0!"}]
["Mejorar continuamente los procesos del Sistema Integrado de Gestión","Gestión de Asuntos Locales","Desarrollar acciones a nivel local para promover la participación ciudadana, brindar acompañamiento a las alcaldías locales en temas misionales de la entidad y ofertar sus programas","Efectividad en la atención de la demanda de actividades recreodeportivas en las localidades de Bogotá",null,null,"Porcentaje de actividades recreativas programadas por asuntos locales","(No. de actividades recreativas programadas en la plataforma SIM por los gestores locales/Total de actividades recreativas solicitadas por Promoción de la Recreación)*100","Gestión","Eficacia","Mensual",1,"Porcentaje","Sistema de información misional - SIM\nCuadro de metas de actividades recreativas","Positiva","No",null,2019,"Diciembre",null,null,{"$error":"#DIV/0!"},{"$error":"#DIV/0!"},{"$error":"#DIV/0!"}]
["Mejorar continuamente los procesos del Sistema Integrado de Gestión","Gestión de Asuntos Locales","Desarrollar acciones a nivel local para promover la participación ciudadana, brindar acompañamiento a las alcaldías locales en temas misionales de la entidad y ofertar sus programas","Efectividad en la atención de la demanda de actividades recreodeportivas en las localidades de Bogotá",null,null,"Porcentaje de beneficiarios inscritos por asuntos locales en actividades deportivas","(No. de beneficiarios inscritos en actividades deportivas por los gestores locales/Total de beneficiarios de actividades deportivas programados por Fomento al Deporte)*100","Gestión","Eficacia","Trimestral",1,"Porcentaje","Reporte de las distintas plataformas para inscripciones\nCuadro de metas de actividades deportivas","Positiva","No",null,2019,"Diciembre",null,null,{"$f":"+T961/U961","v":{"$error":"#DIV/0!"}},{"$error":"#DIV/0!"},{"$f":"_xlfn.IFS(W961<=69%,\"Crítico\",W961>=90%,\"Aceptable\",W961>=70%,\"Tolerable\")","v":{"$error":"#DIV/0!"}}]
["Mejorar continuamente los procesos del Sistema Integrado de Gestión","Gestión de Asuntos Locales","Desarrollar acciones a nivel local para promover la participación ciudadana, brindar acompañamiento a las alcaldías locales en temas misionales de la entidad y ofertar sus programas","Cumplimiento de lineamientos y criterios de elegibilidad y viabilidad de los proyectos de contratación",null,null,"Porcentaje de asistencias técnicas realizadas a los Fondos de Desarrollo Local","(No. de asistencias técnicas realizadas a los Fondos de Desarrollo Local/Total de asistencias técnicas programadas a los Fondos de Desarrollo Local en las cuatro líneas de inversión)*100","Gestión","Eficacia","Trimestral",1,"Porcentaje","Cronograma de asistencias técnicas a los Fondos de Desarrollo Local","Positiva","No",null,2019,"Diciembre",null,null,{"$error":"#DIV/0!"},{"$error":"#DIV/0!"},{"$error":"#DIV/0!"}]
["Mejorar continuamente los procesos del Sistema Integrado de Gestión","Gestión de Asuntos Locales","Desarrollar acciones a nivel local para promover la participación ciudadana, brindar acompañamiento a las alcaldías locales en temas misionales de la entidad y ofertar sus programas","Ejecución de los proyectos con recursos de los fondos de desarrollo local, en concordancia con el concepto previo y favorable emitido por la entidad",null,null,"Porcentaje de proyectos viabilizados con seguimiento efectuado","(No. de proyectos contratados con seguimiento efectuado/Total de proyectos viabilizados con contratación por parte de los Fondos de Desarrollo Local)*100","Gestión","Eficacia","Trimestral",1,"Porcentaje","SECOP\nInforme de seguimiento a viabilidades","Positiva","No",null,2019,"Diciembre",null,null,{"$error":"#DIV/0!"},{"$error":"#DIV/0!"},{"$error":"#DIV/0!"}]
["Mejorar continuamente los procesos del Sistema Integrado de Gestión","Control Disciplinario","Investigar conductas presuntamente disciplinables e imponer sanciones cuando haya lugar, tanto a servidores como a ex-servidores públicos de la entidad, con el fin de que éstos cumplan con sus deberes y funciones","Cumplimiento de los términos legales en las distintas etapas procesales",null,null,"Porcentaje de procesos disciplinarios resueltos de fondo","(No. de procesos disciplinarios decididos de fondo/Total de procesos disciplinarios activos)*100","Gestión","Eficacia","Semestral",0.6,"Porcentaje","Matriz de autos","Positiva","No",null,2019,"Diciembre",null,null,{"$error":"#DIV/0!"},{"$error":"#DIV/0!"},{"$error":"#DIV/0!"}]
["Mejorar continuamente los procesos del Sistema Integrado de Gestión","Control Disciplinario","Investigar conductas presuntamente disciplinables e imponer sanciones cuando haya lugar, tanto a servidores como a ex-servidores públicos de la entidad, con el fin de que éstos cumplan con sus deberes y funciones","Garantía del debido proceso en las distintas etapas procesales",null,null,"Porcentaje de procesos disciplinarios sin nulidades decretadas","(No. de procesos disciplinarios sin nulidades decretadas/Total de procesos disciplinarios activos)*100 ","Gestión","Eficacia","Trimestral",1,"Porcentaje","Matriz de autos","Positiva","No",null,2019,"Diciembre",null,null,{"$error":"#DIV/0!"},{"$error":"#DIV/0!"},{"$error":"#DIV/0!"}]
["Mejorar continuamente los procesos del Sistema Integrado de Gestión","Control Disciplinario","Investigar conductas presuntamente disciplinables e imponer sanciones cuando haya lugar, tanto a servidores como a ex-servidores públicos de la entidad, con el fin de que éstos cumplan con sus deberes y funciones","Cumplimiento de los términos legales en las distintas etapas procesales",null,null,"Porcentaje de procesos disciplinarios sin vencimiento de términos","(No. de procesos disciplinarios sin vencimiento de términos/Total de procesos disciplinarios activos)*100","Gestión","Calidad","Trimestral",1,"Porcentaje","Expediente del proceso disciplinario ","Positiva","No",null,2019,"Diciembre",null,null,{"$error":"#DIV/0!"},{"$error":"#DIV/0!"},{"$error":"#DIV/0!"}]
["Mejorar continuamente los procesos del Sistema Integrado de Gestión","Administración y Mantenimiento de Parques y Escenarios","Ofrecer parques y escenarios del Sistema Distrital para el uso y disfrute de la comunidad general, gestionando la sostenibilidad física, social, ambiental y económica","Uso de parques y escenarios con motivación económica que generen recursos para el mantenimiento de los mismos",null,null,"Aprovechamiento económico de parques y/o escenarios","(Ingresos del mes + acumulado de los ingresos del mes anterior/Total presupuesto anual)*100","Gestión","Eficiencia","Mensual",1,"Porcentaje","Sistema de información SEVEN","Positiva","Si","La meta es anual con medición y análisis mensual.\n\nEn el análisis del indicador se presentará la desagregación del aprovechamiento económico por tipo de parque y/o escenario, expresado en ingresos y participación porcentual.",2019,"Diciembre",null,null,{"$error":"#DIV/0!"},{"$error":"#DIV/0!"},{"$error":"#DIV/0!"}]
["Satisfacer las necesidades de los usuarios a través de la prestación de servicios eficientes, eficaces y efectivos","Administración y Mantenimiento de Parques y Escenarios","Ofrecer parques y escenarios del Sistema Distrital para el uso y disfrute de la comunidad general, gestionando la sostenibilidad física, social, ambiental y económica","Satisfacción de los usuarios con las actividades de mantenimiento preventivo y correctivo",null,null,"Satisfacción de los usuarios con las obras de mantenimiento de nuevas tendencias","(No. de usuarios satisfechos con las obras de mantenimiento realizadas/Total de usuarios de parques y escenarios encuestados para obras de mantenimiento de nuevas tendencias)*100","Gestión","Efectividad","Anual",0.9,"Porcentaje","Encuesta de satisfacción con las obras de mantenimiento de nuevas tendencias","Positiva","No","En el análisis del indicador se presentará el resultado desagregado por cada uno de los aspectos evaluados en la encuesta de satisfacción.",2019,"Diciembre",null,null,{"$error":"#DIV/0!"},{"$error":"#DIV/0!"},{"$error":"#DIV/0!"}]
["Mejorar continuamente los procesos del Sistema Integrado de Gestión","Administración y Mantenimiento de Parques y Escenarios","Ofrecer parques y escenarios del Sistema Distrital para el uso y disfrute de la comunidad general, gestionando la sostenibilidad física, social, ambiental y económica","Oportunidad y cumplimiento en la generación de compromisos o acuerdos ciudadanos frente al uso y sostenibilidad de los parques administrados",null,null,"Porcentaje de cumplimiento en acuerdos de sostenibilidad social de parques","(No. de compromisos gestionados/Total de compromisos adquiridos mediante acuerdos ciudadanos en parques)*100","Gestión","Eficacia","Trimestral",1,"Porcentaje","Matriz de seguimiento a compromisos o acuerdos ciudadanos","Positiva","No",null,2019,"Diciembre",null,null,{"$error":"#DIV/0!"},{"$error":"#DIV/0!"},{"$error":"#DIV/0!"}]
["Mejorar continuamente los procesos del Sistema Integrado de Gestión","Administración y Mantenimiento de Parques y Escenarios","Ofrecer parques y escenarios del Sistema Distrital para el uso y disfrute de la comunidad general, gestionando la sostenibilidad física, social, ambiental y económica","Disponibilidad de los equipamientos en parques y escenarios","Cumplimiento de las especificaciones técnicas en las actividades de mantenimiento preventivo y correctivo","Cobertura en el mantenimiento de parques y escenarios de acuerdo con la priorización","Porcentaje de avance en la ejecución de contratos de obras de mantenimiento o recuperación","(Porcentaje contrato 1 + Porcentaje contrato 2 +...+ Porcentaje contrato n)/Total de contratos de obras de mantenimiento o recuperación en ejecución\nDonde: \nPorcentaje contrato n = Avance físico ejecutado/Avance físico programado\nn = Número de contratos de obras de mantenimiento o recuperación en ejecución","Gestión","Eficacia","Bimestral",0.9,"Porcentaje","Informes mensuales de interventoría presentados según programación de los contratistas","Positiva","No",null,2019,"Diciembre",null,null,{"$error":"#DIV/0!"},{"$error":"#DIV/0!"},{"$error":"#DIV/0!"}]
["Satisfacer las necesidades de los usuarios a través de la prestación de servicios eficientes, eficaces y efectivos","Diseño y Construcción de Parques y Escenarios","Ampliar y mejorar la infraestructura física recreativa y deportiva del Distrito Capital para el uso de la comunidad en general","Cumplimiento de requisitos técnicos, administrativos, financieros y jurídicos de los proyectos",null,null,"Satisfacción de los usuarios con las obras de construcción y/o adecuación entregadas","(No. de usuarios satisfechos con las obras de construcción y/o adecuación entregadas /Total de usuarios encuestados por proyecto)*100","Gestión","Efectividad","Anual",0.9,"Porcentaje","Resultados de la encuesta de satisfacción entregados por los contratistas de obra","Positiva","No","En el análisis del indicador se presentará el resultado desagregado por cada uno de los aspectos evaluados en la encuesta de satisfacción.",2019,"Diciembre",null,null,{"$error":"#DIV/0!"},{"$error":"#DIV/0!"},{"$error":"#DIV/0!"}]
["Mejorar continuamente los procesos del Sistema Integrado de Gestión","Diseño y Construcción de Parques y Escenarios","Ampliar y mejorar la infraestructura física recreativa y deportiva del Distrito Capital para el uso de la comunidad en general","Oportunidad en el seguimiento y adopción de medidas durante el seguimiento de la estabilidad de la obra","Cumplimiento de especificaciones técnicas conforme a lo establecido en la etapa de construcción",null,"Porcentaje de fallas de calidad o estabilidad de obra atendidas en construcción y adecuación de parques y escenarios","(No. de fallas de calidad o estabilidad de obra atendidas/Total de fallas de calidad o estabilidad de obra detectadas o reportadas por terceros)*100\n\nAtendido = Se genera requerimiento al contratista para establecer compromisos de reparación.","Gestión","Eficacia","Trimestral",0.9,"Porcentaje","Actas de visita o reconocimiento de estabilidad de obra \nActa de compromiso de reparación constructiva\nProgramación de visita\nComunicación oficial- notificación de fallas visita de inspección por estabilidad \nActa de verificación de reparación constructiva","Positiva","No","En el análisis del indicador se presentará la desagregación por parque y escenario.",2019,"Diciembre",null,null,{"$error":"#DIV/0!"},{"$error":"#DIV/0!"},{"$error":"#DIV/0!"}]
["Mejorar continuamente los procesos del Sistema Integrado de Gestión","Diseño y Construcción de Parques y Escenarios","Ampliar y mejorar la infraestructura física recreativa y deportiva del Distrito Capital para el uso de la comunidad en general","Cumplimiento de requisitos técnicos, administrativos, financieros y jurídicos de los proyectos","Oportunidad en el seguimiento y adopción de medidas durante la ejecución de las obras","Cumplimiento del alcance de las obras conforme a los estudios y diseños, especificaciones técnicas y normatividad vigente","Porcentaje de avance en la ejecución de obras de construcción y adecuación de parques y escenarios","((%Ejecutado Obra 1*Plazo de ejecución Obra 1)+(%Ejecutado Obra 2*Plazo de ejecución Obra 2) +...+ (%Ejecutado Obra n*Plazo de ejecución Obra n))/((%Programado Obra 1*Plazo de ejecución Obra 1)+(%Programado Obra 2*Plazo de ejecución Obra 2) +...+ (%Programado Obra n*Plazo de ejecución Obra n))\nDonde:\nn = Número de obras en ejecución","Gestión","Eficacia","Mensual",0.9,"Porcentaje","Informes mensuales de interventoría\n\nInformes mensuales de supervisión","Positiva","No","En el análisis del indicador se presentará la desagregación por parque y escenario.",2019,"Diciembre",null,null,{"$error":"#DIV/0!"},{"$error":"#DIV/0!"},{"$error":"#DIV/0!"}]
["Mejorar continuamente los procesos del Sistema Integrado de Gestión","Diseño y Construcción de Parques y Escenarios","Ampliar y mejorar la infraestructura física recreativa y deportiva del Distrito Capital para el uso de la comunidad en general","\nCumplimiento de requisitos técnicos, administrativos, financieros y legales de los proyectos de estudios y diseños","Oportunidad en el seguimiento y adopción de medidas durante la ejecución de los proyectos de estudios y diseños","Cumplimiento del alcance de los proyectos de estudios y diseños conforme a las necesidades identificadas","Porcentaje de avance en la ejecución de proyectos de estudios y/o diseños de parques y escenarios","(Porcentaje proyecto 1 + Porcentaje proyecto 2 +...+ Porcentaje proyecto n)/Total de proyectos de estudios y/o diseños en ejecución\nDonde: \nPorcentaje proyecto n =(Avance ejecutado de estudios y/o diseños/Avance programado de estudios y/o diseños al corte según forma de pago)\nn = Número de proyectos de estudios y/o diseños en ejecución","Gestión","Eficacia","Mensual",0.9,"Porcentaje","Informes mensuales de interventoría\n\nInformes mensuales de supervisión","Positiva","No","En el análisis del indicador se presentará la desagregación por proyecto.",2019,"Diciembre",null,null,{"$error":"#DIV/0!"},{"$error":"#DIV/0!"},{"$error":"#DIV/0!"}]
["Mejorar continuamente los procesos del Sistema Integrado de Gestión","Gestión Jurídica","Ejercer la defensa judicial y extrajudicial de la entidad y atender requerimientos jurídicos, para salvaguardar sus intereses y cumplir con los requisitos constitucionales y legales","Intervención oportuna en las distintas actuaciones judiciales y extrajudiciales en que sea parte la entidad","Oportunidad en el seguimiento a los procesos en los despachos e instancias judiciales",null,"Porcentaje de procesos judiciales y extrajudiciales atendidos dentro de los términos legales vigentes","(No. de procesos jurídicos atendidos dentro de los términos legales vigentes)/Total de procesos jurídicos notificados)*100","Gestión","Calidad","Trimestral",1,"Porcentaje","SIPROJ Web\nORFEO","Positiva","No","En el análisis del indicador se presentará la desagregación por procesos judiciales y extrajudiciales.",2019,"Diciembre",null,null,{"$error":"#DIV/0!"},{"$error":"#DIV/0!"},{"$error":"#DIV/0!"}]
["Satisfacer las necesidades de los usuarios a través de la prestación de servicios eficientes, eficaces y efectivos","Gestión Jurídica","Ejercer la defensa judicial y extrajudicial de la entidad y atender requerimientos jurídicos, para salvaguardar sus intereses y cumplir con los requisitos constitucionales y legales","Cumplimiento de los requisitos establecidos para el reconocimiento deportivo y el aval de escuelas deportivas",null,null,"Satisfacción de los usuarios con el trámite de reconocimiento deportivo","(No. de usuarios satisfechos con el trámite de reconocimiento deportivo/Total de usuarios encuestados)*100","Gestión","Efectividad","Semestral",0.95,"Porcentaje","Encuesta de satisfacción de usuarios de reconocimiento deportivo","Positiva","No","En el análisis del indicador se presentarán los resultados desagregados por cada uno de los aspectos evaluados en la encuesta de satisfacción.",2019,"Diciembre",null,null,{"$error":"#DIV/0!"},{"$error":"#DIV/0!"},{"$error":"#DIV/0!"}]
["Mejorar continuamente los procesos del Sistema Integrado de Gestión","Gestión Jurídica","Ejercer la defensa judicial y extrajudicial de la entidad y atender requerimientos jurídicos, para salvaguardar sus intereses y cumplir con los requisitos constitucionales y legales","Oportunidad en la respuesta del trámite de otorgamiento deportivo (45 días hábiles siguientes al cumplimiento de requisitos de otorgamiento deportivo)","Vigencia y aplicabilidad de la normatividad empleada para el reconocimiento deportivo y el aval de escuelas deportivas",null,"Porcentaje de trámites de reconocimiento deportivo atendidos dentro del término legal vigente","(No. de trámites de reconocimiento deportivo atendidos dentro del término legal vigente/Total de trámites de reconocimiento deportivo atendidos)*100 ","Gestión","Calidad","Trimestral",0.92,"Porcentaje","Matriz de control de reconocimiento deportivo","Positiva","No",null,2019,"Diciembre",null,null,{"$error":"#DIV/0!"},{"$error":"#DIV/0!"},{"$error":"#DIV/0!"}]
["Mejorar continuamente los procesos del Sistema Integrado de Gestión","Gestión Jurídica","Ejercer la defensa judicial y extrajudicial de la entidad y atender requerimientos jurídicos, para salvaguardar sus intereses y cumplir con los requisitos constitucionales y legales","Oportunidad en la respuesta del trámite de aval de escuelas deportivas (58 días hábiles)","Vigencia y aplicabilidad de la normatividad empleada para el reconocimiento deportivo y el aval de escuelas deportivas",null,"Porcentaje de trámites de aval de escuelas deportivas atendidos dentro del término legal vigente","(No. de trámites de aval de escuelas deportivas atendidos dentro del término legal vigente/Total de trámites de aval de escuelas deportivas atendidos)*100","Gestión","Calidad","Trimestral",0.92,"Porcentaje","Matriz de control de aval de escuelas deportivas","Positiva","No",null,2019,"Diciembre",null,null,{"$error":"#DIV/0!"},{"$error":"#DIV/0!"},{"$error":"#DIV/0!"}]
["Mejorar continuamente los procesos del Sistema Integrado de Gestión","Gestión Jurídica","Ejercer la defensa judicial y extrajudicial de la entidad y atender requerimientos jurídicos, para salvaguardar sus intereses y cumplir con los requisitos constitucionales y legales","Oportunidad en la respuesta a conceptos de proyectos de acuerdo con los tiempos establecidos","Suministro oportuno de la información de carácter técnico, de oportunidad y conveniencia del proyecto por parte de las dependencias y áreas de la entidad",null,"Porcentaje de solicitudes de concepto a proyectos de acuerdo, decreto o ley atendidas dentro del tiempo establecido","(No. de solicitudes de concepto a proyectos de acuerdo, decreto o ley atendidas dentro del tiempo establecido/Total de solicitudes de concepto a proyectos de acuerdo, decreto o ley recibidas)*100","Gestión","Calidad","Semestral",0.9,"Porcentaje","Matriz de seguimiento a solicitudes Congreso y Concejo","Positiva","No","En el análisis del indicador se presentará la desagregación por proyectos de acuerdo, decreto y ley.",2019,"Diciembre",null,null,{"$error":"#DIV/0!"},{"$error":"#DIV/0!"},{"$error":"#DIV/0!"}]
["Mejorar continuamente los procesos del Sistema Integrado de Gestión","Gestión Jurídica","Ejercer la defensa judicial y extrajudicial de la entidad y atender requerimientos jurídicos, para salvaguardar sus intereses y cumplir con los requisitos constitucionales y legales","Recuperación de la cartera en mora",null,null,"Porcentaje de procesos de cobro de cartera efectuados","(No. de procesos con etapas de cobro efectuadas/Total de procesos de cobro remitidos con documentación completa)*100","Gestión","Eficacia","Cuatrimestral",1,"Porcentaje","Matriz de seguimiento cobro de cartera","Positiva","No","Los primeros cinco días hábiles de mayo se reportará el indicador con corte a 31 de diciembre del año anterior. \nLos primeros días de septiembre se reportará con corte 30 de abril de la vigencia.\nLos primeros días de enero se reportará con corte a 31 de agosto del año anterior.\nEn el análisis del indicador se presentará la desagregación por etapa (persuasivo y coactivo), así como también el porcentaje de recuperación de cartera.",2019,"Diciembre",null,null,{"$error":"#DIV/0!"},{"$error":"#DIV/0!"},{"$error":"#DIV/0!"}]
["Mejorar continuamente los procesos del Sistema Integrado de Gestión","Gestión de Comunicaciones","Dar a conocer interna y externamente las actividades, programas y obras que realiza la entidad, para generar apropiación y participación que contribuyan al posicionamiento de la imagen institucional","Exigencia de la solicitud de servicios para todos los procesos con la información completa y detallada de lo requerido","Veracidad de la información reportada por los solicitantes del servicio ",null,"Porcentaje de solicitudes de servicios de comunicaciones atendidas dentro de los tiempos establecidos","(No. de solicitudes de servicio atendidas dentro de los tiempos establecidos/Total de solicitudes de servicio de comunicaciones recibidas)*100","Gestión","Calidad","Trimestral",0.9,"Porcentaje","Consolidado de solicitudes de servicios de comunicaciones","Positiva","No",null,2019,"Diciembre",null,null,{"$error":"#DIV/0!"},{"$error":"#DIV/0!"},{"$error":"#DIV/0!"}]
["Mejorar continuamente los procesos del Sistema Integrado de Gestión","Gestión de Comunicaciones","Dar a conocer interna y externamente las actividades, programas y obras que realiza la entidad, para generar apropiación y participación que contribuyan al posicionamiento de la imagen institucional","Relacionamiento con medios de comunicación","Análisis de los resultados obtenidos mediante el monitoreo de medios para facilitar la toma de decisiones",null,"Impacto de noticias publicadas en medios de comunicación","(No. de noticias positivas o neutras registradas/Total de noticias publicadas en medios de comunicación)*100","Gestión","Eficacia","Trimestral",1,"Porcentaje","Informes mensuales generados por la empresa contratada para realizar el monitoreo de medios","Positiva","No","En el análisis del indicador se presentará el resultado desagregado de noticias positivas y neutras, indicando los principales medios de comunicación.\nSe colocó una meta de 100%, mientras se levanta la línea base con la primera medición.",2019,"Diciembre",null,null,{"$error":"#DIV/0!"},{"$error":"#DIV/0!"},{"$error":"#DIV/0!"}]
["Mejorar continuamente los procesos del Sistema Integrado de Gestión","Gestión de Comunicaciones","Dar a conocer interna y externamente las actividades, programas y obras que realiza la entidad, para generar apropiación y participación que contribuyan al posicionamiento de la imagen institucional","Seguimiento a los cambios en las condiciones de publicación en redes sociales y página web",null,null,"Tasa de variación en el alcance total de las publicaciones en redes sociales","((Alcance total de publicaciones en el trimestre actual - Alcance total de publicaciones en el trimestre anterior)/Alcance total de publicaciones en el trimestre anterior)*100\n\nDonde:\n\nAlcance total de las publicaciones = Total de usuarios que vieron las publicaciones de redes sociales","Gestión","Eficacia","Trimestral",0.2,"Porcentaje","Métricas nativas de cada red social","Positiva","No","En el análisis del indicador se presentará el resultado desagregado del alcance de las publicaciones por cada red social. ",2019,"Diciembre",null,null,{"$error":"#DIV/0!"},{"$error":"#DIV/0!"},{"$error":"#DIV/0!"}]
["Mejorar continuamente los procesos del Sistema Integrado de Gestión","Gestión de Comunicaciones","Dar a conocer interna y externamente las actividades, programas y obras que realiza la entidad, para generar apropiación y participación que contribuyan al posicionamiento de la imagen institucional","Análisis de los resultados obtenidos mediante el monitoreo de medios para facilitar la toma de decisiones",null,null,"Salidas publicadas en medios de comunicación","N/A","Gestión","Eficacia","Mensual",80,"Número","Informes mensuales generados por la empresa contratada para realizar el monitoreo de medios","Positiva","No","En el análisis del indicador se presentará el valor estimado de las publicaciones en medios de comunicación.",2019,"Diciembre",null,null,{"$error":"#DIV/0!"},{"$error":"#DIV/0!"},{"$error":"#DIV/0!"}]
["Mejorar continuamente los procesos del Sistema Integrado de Gestión","Gestión Jurídica","Ejercer la defensa judicial y extrajudicial de la entidad y atender requerimientos jurídicos, para salvaguardar sus intereses y cumplir con los requisitos constitucionales y legales","Intervención oportuna en las distintas actuaciones judiciales y extrajudiciales en que sea parte la entidad - tipos de daño en que se resulte demandado o condenado",null,null,"Índice de condenas adversas","(No. de condenas adversas/Total de procesos judiciales)*100","Gestión","Calidad","Semestral",0.08,"Porcentaje","Informe Siproj web mensual (procesos judiciales)","Negativa","No","El análisis del indicador debe evaluar dentro del comité de conciliación los procesos que cursen o hayan cursado en contra de la entidad, determinando causas generadoras de conflictos y los tipos de daño.",2019,"Diciembre",null,null,{"$error":"#DIV/0!"},{"$f":"((L985-V985)+L985)/L985","v":{"$error":"#DIV/0!"}},{"$error":"#DIV/0!"}]